filature
created: 2011-09-01T00:00:00+02:00
modified: 2015-04-30T15:32:03+02:00
status: 1
type: Concept
broader: T96-857
definition: Usine où l'on transforme en fils différentes matières textiles : coton, laine, lin, chanvre, jute, etc. Elle fonctionne avec des bancs à broches, des continus à filer et comprend généralement un entrepôt industriel, une chaufferie, une salle des machines, etc.
in scheme: T96
narrower: T96-861
scope note: Ne pas confondre avec moulinerie.