moulinerie
terme associe: T96-676
created: 2011-09-01T00:00:00+02:00
modified: 2015-04-30T15:33:43+02:00
status: 1
type: Concept
broad match: Filature textile
broader: T96-860
definition: Usine où l'on mouline le fil de soie grège en le régularisant et en le tordant sur des machines à torsader (dites moulins) munies de fuseaux ou de bobines. Elle comprend généralement un bief de dérivation, un bâtiment d'eau, etc.
in scheme: T96
related: T96-676
scope note: Ne pas confondre avec filature.