usine de passementerie
created: 2011-09-01T00:00:00+02:00
modified: 2015-03-18T15:10:47+01:00
status: 1
type: Concept
broader: T96-862
definition: Usine où l'on fabrique des rubans, tresses, cordons, torsades, lacets, galons, etc. utilisés comme parure de vêtements ou de tentures d'ameublement. Elle fonctionne généralement avec des métiers à tisser à main, à ratière, à crochets, etc.
in scheme: T96