moulin à foulon
terme associe: T96-676
created: 2011-09-01T00:00:00+02:00
modified: 2015-03-18T15:59:12+01:00
status: 1
type: Concept
broader: T96-865
definition: Usine où s'effectue le foulage des étoffes, à l'aide d'un arbre à cames actionnant une batterie de maillets. Elle comprend généralement un bief de dérivation, un bâtiment d'eau, etc.
in scheme: T96
related: T96-676