usine de bonneterie
created: 2011-09-01T00:00:00+02:00
modified: 2015-03-19T12:36:06+01:00
status: 1
type: Concept
broader: T96-857
definition: Usine où l'on fabrique des tissus à maille (bas, chaussettes, lingerie, sous-vêtements, etc.) sur des tricoteuses rectilignes, circulaires, etc. Elle comprend généralement un bureau, un magasin industriel.
in scheme: T96