usine de broderie mécanique
created: 2011-09-01T00:00:00+02:00
modified: 2015-03-19T12:55:41+01:00
status: 1
type: Concept
broader: T96-857
definition: Usine où l'on exécute des broderies sur des métiers à broder à bras, à fil continu à pantographe, à fil continu à Jacquard, automatisés, etc. Elle comprend généralement un bureau, un entrepôt industriel, etc.
in scheme: T96