usine d'impression sur étoffes
created: 2011-09-01T00:00:00+02:00
modified: 2015-04-30T15:42:53+02:00
status: 1
type: Concept
broader: T96-857
definition: Usine où l'on procède à l'application de motifs décoratifs sur les étoffes, par impression à la planche, au rouleau (cylindre), sérigraphique, etc. Elle comprend généralement un laboratoire, un bureau, un magasin industriel, etc.
in scheme: T96