usine de produit textile non tissé
created: 2011-09-01T00:00:00+02:00
modified: 2015-04-30T15:51:27+02:00
status: 1
type: Concept
broader: T96-857
definition: Usine où l'on fabrique des textiles non tissés (voile ou nappe de fibres liées par friction, cohésion, adhésion, etc.) pour la confection de vêtements, alèses, draps jetables, etc. Elle comprend généralement un entrepôt industriel, un magasin industriel, etc.
in scheme: T96
narrower: T96-876
scope note: Cette production n'intègre pas le feutre car cette étoffe est à la fois tissée et non tissée.