usine de peausserie
created: 2011-09-01T00:00:00+02:00
modified: 2014-12-08T11:10:57+01:00
status: 1
type: Concept
broader: T96-675
definition: Usine où l’on effectue les différentes préparations de peaux destinées à la maroquinerie, la ganterie, l'habillement, etc. Ce descripteur désigne également, par extension, les usines où l’on traite d’autres éléments provenant de dépouilles animales (boyaux, poils, cornes, etc.).
in scheme: T96
narrower: T96-879
narrower: T96-880
narrower: T96-884
narrower: T96-885
narrower: T96-886
narrower: T96-888
narrower: T96-889
narrower: T96-890