tannerie
created: 2011-09-01T00:00:00+02:00
modified: 2014-12-08T11:41:50+01:00
status: 1
type: Concept
broader: T96-878
definition: Usine où l'on traite les peaux mécaniquement et chimiquement à l'aide de tanin ou de produits de synthèse, pour les rendre souples et imputrescibles. Elle comprend généralement des cuves de trempage, des tonneaux de tannage, une pièce de séchage, etc.
in scheme: T96
narrower: T96-881
narrower: T96-882
narrower: T96-883