chamoiserie
created: 2011-09-01T00:00:00+02:00
modified: 2015-04-28T16:34:53+02:00
status: 1
type: Concept
broader: T96-880
definition: Usine où l'on pratique le tannage à l'huile de poisson des peaux qui seront utilisées dans la ganterie, la maroquinerie, la chapellerie ou pour les articles de nettoyage. Elle comprend généralement un entrepôt industriel, une pièce de séchage, etc.
in scheme: T96