moulin à tan
terme associe: T96-676
created: 2011-09-01T00:00:00+02:00
modified: 2014-12-08T15:19:56+01:00
status: 1
type: Concept
broader: T96-880
definition: Usine où l'on broie, à l'aide d'un arbre à cames actionnant des pilons, l'écorce de chêne qui sert au tannage des peaux. Elle comprend généralement un bief de dérivation, un bâtiment d'eau, etc.
in scheme: T96
related: T96-676