usine liée au travail de la corne
created: 2011-09-01T00:00:00+02:00
modified: 2015-04-28T16:56:07+02:00
status: 1
type: Concept
broader: T96-878
definition: Usine spécialisée dans la préparation de la corne (tri, débitage et dressage) pour la tabletterie ou pour la fabrication d'engrais (broyage de la corne en poudre). Elle comprend généralement des machines à mouler par compression, à découper, à polir, à broyer, etc.
in scheme: T96