usine d'habillement
created: 2011-09-01T00:00:00+02:00
modified: 2015-01-22T11:34:29+01:00
status: 1
type: Concept
broader: T96-675
definition: Usine où l'on fabrique des vêtements et des accessoires tels que chaussures, chapeaux, gants, parapluies, etc.
in scheme: T96
narrower: T96-892
narrower: T96-893
narrower: T96-894
narrower: T96-895
narrower: T96-896
narrower: T96-897