usine de tabletterie
created: 2011-09-01T00:00:00+02:00
modified: 2015-03-12T17:14:50+01:00
status: 1
type: Concept
broader: T96-898
definition: Usine où l'on travaille le bois, le corozo, l'os, la corne, l'ivoire et la nacre pour boîtes, coffrets, manches de couteaux, articles pour fumeurs, éventails, peignes, dominos, etc. Elle comprend généralement un bureau, un atelier de conditionnement, un magasin industriel, etc.
in scheme: T96