usine de papeterie
created: 2011-09-01T00:00:00+02:00
modified: 2015-04-28T15:52:23+02:00
status: 1
type: Concept
broader: T96-675
definition: Usine où l'on fabrique et traite le papier, le carton, etc.
in scheme: T96
narrower: T96-914
narrower: T96-915
narrower: T96-916
narrower: T96-917
narrower: T96-918
narrower: T96-919