moulin à papier
terme associe: T96-676
created: 2011-09-01T00:00:00+02:00
modified: 2015-04-28T16:06:23+02:00
status: 1
type: Concept
broader: T96-913
definition: Usine où l'on fabrique du papier, à l'aide de piles hollandaises, de cuves de raffinage, etc. Elle comprend généralement un bief dedérivation , un bâtiment d'eau, une pièce de séchage, etc.
in scheme: T96
related: T96-676