usine d'emballage et conditionnement
created: 2011-09-01T00:00:00+02:00
modified: 2015-01-27T11:03:45+01:00
status: 1
type: Concept
broader: T96-913
definition: Usine où l'on fabrique cartons, enveloppes et papiers d'emballage divers. Elle comprend généralement un bureau, un atelier de conditionnement , un magasin industriel, etc.
in scheme: T96