usine d'impression sur papier
created: 2011-09-01T00:00:00+02:00
modified: 2013-04-23T00:00:00+02:00
status: 1
type: Concept
broader: T96-675
definition: Usine où l'on transporte sur le papier les caractères disposés dans les formes, les dessins préparés sur les planches, les cylindres ou les pierres lithographiques.
in scheme: T96
narrower: T96-922
narrower: T96-923