usine de papiers peints
created: 2011-09-01T00:00:00+02:00
modified: 2015-01-23T12:29:42+01:00
status: 1
type: Concept
broader: T96-921
definition: Usine où l'on fabrique des papiers peints suivant différentes techniques d'impression (machines à cylindres ou rouleaux gravés en creux, en relief, etc.). Elle comprend généralement une chaufferie, une pièce de séchage, un magasin industriel, etc.
in scheme: T96