aire de concassage
created: 2011-09-01T00:00:00+02:00
modified: 2015-03-24T12:55:25+01:00
status: 1
type: Concept
broader: T96-924
definition: Espace non bâti, délimité et aménagé pour broyer un produit solide (industrie extractive, métallurgie, etc.).
in scheme: T96