aire de fabrication
created: 2011-09-01T00:00:00+02:00
modified: 2015-03-24T13:01:03+01:00
status: 1
type: Concept
broader: T96-924
definition: Espace non bâti, délimité et aménagé pour qu’on puisse y effectuer les différentes opérations de fabrication d'un produit.
in scheme: T96