aire de lavage
created: 2011-09-01T00:00:00+02:00
modified: 2015-03-24T13:16:00+01:00
status: 1
type: Concept
broader: T96-924
definition: Espace non bâti, délimité et aménagé pour procéder à l'élimination des stériles contenus dans les minerais bruts.
in scheme: T96