aire de séchage
created: 2011-09-01T00:00:00+02:00
modified: 2015-03-24T14:58:37+01:00
status: 1
type: Concept
broader: T96-924
definition: Terrain aplani destiné au séchage de produits industriels (industrie céramique, industrie textile, tannerie).
in scheme: T96
scope note: Ne pas confondre avec aire à sécher.