atelier de conditionnement
created: 2011-09-01T00:00:00+02:00
modified: 2015-03-24T15:57:43+01:00
status: 1
type: Concept
broader: T96-924
definition: Bâtiment ou local de l'usine où l'on effectue la préparation du produit en vue de son expédition et de sa vente.
in scheme: T96