bassin de décantation
created: 2011-09-01T00:00:00+02:00
modified: 2015-04-30T16:26:38+02:00
status: 1
type: Concept
broader: T96-924
definition: Bassin aménagé pour y faire décanter des matières solides ou liquides : industrie céramique, industrie chimique, industrie extractive, station d'épuration, etc.
in scheme: T96