bassin de retenue
terme associe: T96-1049
created: 2011-09-01T00:00:00+02:00
modified: 2015-03-25T11:58:56+01:00
status: 1
type: Concept
broader: T96-924
definition: Bassin formé par une masse d'eau retenue et emmagasinée pour alimenter le bief de dérivation d’une usine.
in scheme: T96
related: T96-1049