bâtiment de la machine d'extraction
terme associe: T96-951
created: 2011-09-01T00:00:00+02:00
modified: 2015-04-30T16:38:49+02:00
status: 1
type: Concept
broader: T96-924
definition: Dans une usine d’extraction, bâtiment abritant le dispositif d'enroulement du câble (tambour, bobine ou poulie) en provenance du chevalement et le moteur qui le met en mouvement.
in scheme: T96
related: T96-951