bâtiment de recette
created: 2011-09-01T00:00:00+02:00
modified: 2015-04-30T16:38:01+02:00
status: 1
type: Concept
broad match: http://vocab.getty.edu/aat/300006361
broader: T96-924
definition: Bâtiment d'un site minier où sont reçus au jour les produits extraits du fond ainsi que le personnel.
in scheme: T96