cale de construction
terme associe: T96-726
created: 2011-09-01T00:00:00+02:00
modified: 2015-03-26T11:48:04+01:00
status: 1
type: Concept
broader: T96-924
definition: Dans les chantiers navals, plan incliné sur lequel on construit un navire et d'où on le lance à l'eau.
in scheme: T96
related: T96-726