chai
terme associe: T96-827
terme associe: T96-828
created: 2011-09-01T00:00:00+02:00
modified: 2015-03-26T12:58:29+01:00
status: 1
type: Concept
broader: T96-924
definition: Bâtiment ou local où l'on garde le vin ou les eaux-de-vie en fûts.
in scheme: T96
related: T96-827
related: T96-828
scope note: Ne pas confondre avec cellier.