chaufferie
created: 2011-09-01T00:00:00+02:00
modified: 2015-03-26T13:38:32+01:00
status: 1
type: Concept
broader: T96-924
definition: Bâtiment ou local de chauffe renfermant les chaudières.
in scheme: T96