chevalement
terme associe: T96-942
created: 2011-09-01T00:00:00+02:00
modified: 2015-04-30T16:48:10+02:00
status: 1
type: Concept
broader: T96-924
definition: Construction qui domine un puits de mine et qui supporte à son sommet un dispositif assurant le renvoi du câble d'extraction vers l'appareil d'enroulement.
in scheme: T96
narrower: T96-952
related: T96-942