cokerie
created: 2011-09-01T00:00:00+02:00
modified: 2015-03-27T11:24:30+01:00
status: 1
type: Concept
broader: T96-924
definition: Installation technique pour la production ou le traitement du coke.
in scheme: T96