établissement administratif d'entreprise
created: 2011-09-01T00:00:00+02:00
modified: 2015-03-27T15:53:51+01:00
status: 1
type: Concept
alternative label: siège social
broader: T96-924
definition: Édifice, situé en dehors du périmètre du lieu de production, consacré aux fonctions administratives, juridiques et commerciales de l’entreprise.
in scheme: T96