excavation
terme associe: T96-687
created: 2011-09-01T00:00:00+02:00
modified: 2015-03-27T16:19:06+01:00
status: 1
type: Concept
broader: T96-924
definition: Dans un terrain, cavité provoquée par l'exploitation d'une carrière.
in scheme: T96
related: T96-687