four industriel
created: 2011-09-01T00:00:00+02:00
modified: 2015-03-30T15:44:44+02:00
status: 1
type: Concept
broader: T96-924
definition: Ouvrage dans lequel s’opère par modifications de température le séchage, la fusion, la cuisson, la calcination, le changement d’état, etc. de diverses matières.
in scheme: T96
narrower: T96-959