local du comité d'entreprise
created: 2011-09-01T00:00:00+02:00
modified: 2015-04-30T17:03:32+02:00
status: 1
type: Concept
broader: T96-924
definition: Bâtiment ou local d'une entreprise affecté au comité d'entreprise.
in scheme: T96