logement d'ouvriers
terme associe: T96-515
created: 2011-09-01T00:00:00+02:00
modified: 2015-03-31T15:46:38+02:00
status: 1
type: Concept
broader: T96-924
definition: Habitation affectée aux ouvriers d'une usine.
in scheme: T96
related: T96-515