tour de réfrigération
created: 2011-09-01T00:00:00+02:00
modified: 2015-04-15T12:12:55+02:00
status: 1
type: Concept
broader: T96-924
definition: Ouvrage en maçonnerie servant à abaisser la température d'un liquide, d'un gaz dans l'industrie chimique, une centrale nucléaire, etc.
in scheme: T96