réseau de transport par câble
terme associe: T96-1108
created: 2011-09-01T00:00:00+02:00
modified: 2014-10-17T10:09:28+02:00
status: 1
type: Concept
broader: T96-991
definition: Réseau d'installations nécessaires au transport par câble des biens ou des personnes.
in scheme: T96
related: T96-1108