Thésaurus de la désignation des œuvres architecturales et des espaces aménagés
type: ConceptScheme
creator: Inventaire général du patrimoine culturel
contributor: Renaud Benoit-Cattin
contributor: Jean Davoigneau
contributor: Philippe Vergain (sous la direction de)
contributor: Marie-Hélène Benetière (contribution pour l'architecture des jardins)
contributor: Catherine Chaplain (contribution pour l'architecture industrielle)
contributor: Bernard Toulier (contribution)
contributor: Cécile Lestienne (avec la participation de)
contributor: Agathe Penchinat (avec la participation de)
contributor: Sophie Lemahieu (avec la participation de)
publisher: Ministère de la culture et de la communication
description: Le Thésaurus de la désignation des œuvres architecturales et des espaces aménagés élaboré en 2011 est une refonte du Thésaurus de l'architecture édité en 2000 aux Editions du patrimoine. Onze ans plus tard, il nous a paru nécessaire de reprendre cet ouvrage pour d'une part, présenter les concepts que les nouveaux terrains d'inventaire ou les nouveaux domaines de recherche ont fait émerger, ce qui a conduit à en reprendre l'organisation ; d'autre part, à en faire un véritable outil documentaire numérique.
modified: 2015-01-16T17:00:07+01:00
type: Thésaurus
rights: Licence Ouverte / Open Licence version 2.0
subject: urbanisme
subject: architecture
language: fr-FR
language: en-US
language: en-GB
language: it
has top concept: urbanisme et espaces aménagés
has top concept: architecture de jardin et des espaces verts
has top concept: partie ou élément commun à tous les types d'architecture et aux espaces aménagés
has top concept: architecture monumentale commémorative funéraire et votive
has top concept: architecture civile publique
has top concept: architecture judiciaire pénitentiaire ou de police
has top concept: architecture fiscale ou financière
has top concept: architecture hospitalière d'assistance ou de protection sociale
has top concept: architecture scolaire
has top concept: architecture de culture recherche sport ou loisir
has top concept: architecture militaire
has top concept: architecture domestique
has top concept: architecture agricole
has top concept: architecture artisanale commerciale et tertiaire
has top concept: architecture industrielle
has top concept: architecture religieuse
has top concept: génie civil
created: 2011-09-01T00:00:00+02:00
relation: http://www.inventaire.culture.gouv.fr/telechar/thesaurus_architecture_2013.pdf
issued: Version 2014
date submitted: 2016-05-19T13:25:24.786+02:00
date submitted: 2022-02-10T13:33:52.117+01:00

urbanisme et espaces aménagés
type: Concept
modified: 2013-04-23T00:00:00+02:00
in scheme: Thésaurus de la désignation des œuvres architecturales et des espaces aménagés
preferred label: planning @en-us
narrower: agglomération
narrower: secteur urbain
narrower: espace libre
created: 2011-09-01T00:00:00+02:00
status: 1

architecture de jardin et des espaces verts
type: Concept
modified: 2013-04-23T00:00:00+02:00
in scheme: Thésaurus de la désignation des œuvres architecturales et des espaces aménagés
narrower: couvert de jardin
narrower: clôture et circulation de jardin
narrower: jardin
narrower: construction de jardin
narrower: eaux de jardin
narrower: relief artificiel de jardin
narrower: découvert de jardin
created: 2011-09-01T00:00:00+02:00
status: 1

partie ou élément commun à tous les types d'architecture et aux espaces aménagés
type: Concept
modified: 2013-04-23T00:00:00+02:00
in scheme: Thésaurus de la désignation des œuvres architecturales et des espaces aménagés
narrower: abside
narrower: couvrement
narrower: éléments de circulation
narrower: cour
narrower: baie
narrower: élévation
narrower: charpente
narrower: couverture et accessoire du toit
narrower: cantine
narrower: cheminée
narrower: mur - garde-corps - clôture
narrower: enclos
narrower: colonnade
narrower: pièce
narrower: édicule à fonction non identifiée
narrower: pont-bascule
narrower: édifice à fonction non identifiée
narrower: ensemble à fonction non identifiée
narrower: étage
narrower: fondations et sol
narrower: four
narrower: stationnement
narrower: hangar
narrower: installation hydraulique
narrower: lampisterie
narrower: local syndical
narrower: mur végétal
narrower: pavillon
narrower: piège à animaux
narrower: séchoir
narrower: silo
narrower: tour
narrower: vaisseau
narrower: vestiaire
alternative label: élément d'architecture
created: 2011-09-01T00:00:00+02:00
definition: D'une manière générale, les descripteurs regroupés sous ce générique ne peuvent servir à désigner des œuvres d'architecture mais seulement des éléments.
status: 1

architecture monumentale commémorative funéraire et votive
type: Concept
modified: 2013-04-23T00:00:00+02:00
in scheme: Thésaurus de la désignation des œuvres architecturales et des espaces aménagés
preferred label: funerary + commemorative @en-gb
narrower: monument
narrower: ensemble commémoratif
narrower: ensemble funéraire
narrower: édifices et édicules funéraires
created: 2011-09-01T00:00:00+02:00
status: 1

architecture civile publique
type: Concept
modified: 2014-09-05T10:13:13+02:00
in scheme: Thésaurus de la désignation des œuvres architecturales et des espaces aménagés
preferred label: civil @en-gb
preferred label: public buildings @en-us
narrower: édicule de l'administration ou de la vie publique
narrower: édifice de l'administration ou de la vie publique
narrower: ensemble de l'administration ou de la vie publique
created: 2011-09-01T00:00:00+02:00
status: 1

architecture judiciaire pénitentiaire ou de police
type: Concept
modified: 2013-04-23T00:00:00+02:00
in scheme: Thésaurus de la désignation des œuvres architecturales et des espaces aménagés
narrower: ensemble judiciaire pénitentiaire ou de police
narrower: édifice judiciaire pénitentiaire ou de police
narrower: édicule judiciaire pénitentiaire ou de police
narrower: partie d'édifice judiciaire pénitentiaire ou de police
created: 2011-09-01T00:00:00+02:00
status: 1

architecture fiscale ou financière
type: Concept
modified: 2013-04-23T00:00:00+02:00
in scheme: Thésaurus de la désignation des œuvres architecturales et des espaces aménagés
narrower: ensemble fiscal ou financier
narrower: édifice financier public
narrower: édifice fiscal
created: 2011-09-01T00:00:00+02:00
status: 1

architecture hospitalière d'assistance ou de protection sociale
type: Concept
modified: 2013-04-23T00:00:00+02:00
in scheme: Thésaurus de la désignation des œuvres architecturales et des espaces aménagés
narrower: partie d'édifice hospitalier d'assistance ou de protection sociale
narrower: ensemble hospitalier d'assistance ou de protection sociale
narrower: édifice hospitalier d'assistance ou de protection sociale
created: 2011-09-01T00:00:00+02:00
status: 1

architecture scolaire
type: Concept
modified: 2014-12-01T15:26:35+01:00
in scheme: Thésaurus de la désignation des œuvres architecturales et des espaces aménagés
narrower: partie d'édifice scolaire
narrower: ensemble scolaire
narrower: édifice scolaire
created: 2011-09-01T00:00:00+02:00
status: 1

architecture de culture recherche sport ou loisir
type: Concept
modified: 2013-04-23T00:00:00+02:00
in scheme: Thésaurus de la désignation des œuvres architecturales et des espaces aménagés
narrower: édifice et aménagement de culture recherche sport ou loisir
narrower: ensemble de culture recherche sport ou loisir
narrower: édicule de culture recherche sport ou loisir
narrower: partie d'édifice de culture recherche sport ou loisir
created: 2011-09-01T00:00:00+02:00
status: 1

architecture militaire
type: Concept
modified: 2013-04-23T00:00:00+02:00
in scheme: Thésaurus de la désignation des œuvres architecturales et des espaces aménagés
narrower: ensemble militaire
narrower: édifice militaire
narrower: ouvrage militaire
created: 2011-09-01T00:00:00+02:00
status: 1

architecture domestique
type: Concept
modified: 2013-04-23T00:00:00+02:00
in scheme: Thésaurus de la désignation des œuvres architecturales et des espaces aménagés
narrower: édifice domestique
narrower: ensemble domestique
narrower: partie d'édifice domestique
created: 2011-09-01T00:00:00+02:00
status: 1

architecture agricole
type: Concept
modified: 2014-09-02T17:08:32+02:00
in scheme: Thésaurus de la désignation des œuvres architecturales et des espaces aménagés
narrower: partie d'édifice agricole
narrower: ensemble agricole
narrower: édifice agricole
created: 2011-09-01T00:00:00+02:00
status: 1

architecture artisanale commerciale et tertiaire
type: Concept
modified: 2013-04-23T00:00:00+02:00
in scheme: Thésaurus de la désignation des œuvres architecturales et des espaces aménagés
narrower: édifice artisanal commercial ou tertiaire
narrower: ensemble artisanal commercial ou tertiaire
narrower: édicule artisanal
narrower: parties artisanales
narrower: parties commerciales
created: 2011-09-01T00:00:00+02:00
status: 1

architecture industrielle
type: Concept
modified: 2013-04-23T00:00:00+02:00
in scheme: Thésaurus de la désignation des œuvres architecturales et des espaces aménagés
narrower: parties industrielles
narrower: ensemble industriel
narrower: usine
created: 2011-09-01T00:00:00+02:00
status: 1

architecture religieuse
type: Concept
modified: 2013-04-23T00:00:00+02:00
in scheme: Thésaurus de la désignation des œuvres architecturales et des espaces aménagés
preferred label: religious @en-gb
narrower: ensemble religieux
narrower: édicule religieux
narrower: partie d'édifice religieux
narrower: édifice religieux
created: 2011-09-01T00:00:00+02:00
status: 1

génie civil
type: Concept
modified: 2013-04-23T00:00:00+02:00
in scheme: Thésaurus de la désignation des œuvres architecturales et des espaces aménagés
narrower: ensemble du génie civil
narrower: ouvrage d'art
narrower: édifice du génie civil
narrower: réseau du génie civil
created: 2011-09-01T00:00:00+02:00
status: 1

abattoir
type: Concept
modified: 2014-12-04T14:55:33+01:00
in scheme: Thésaurus de la désignation des œuvres architecturales et des espaces aménagés
preferred label: slaughterhouses @en-us
narrower: boucherie
broader: édifice artisanal commercial ou tertiaire
created: 2011-09-01T00:00:00+02:00
hidden label: abattoirs
definition: Édifice ou partie d'édifice destiné à l'abattage des animaux de boucherie.
status: 1

édifice artisanal commercial ou tertiaire
type: Concept
modified: 2013-04-23T00:00:00+02:00
in scheme: Thésaurus de la désignation des œuvres architecturales et des espaces aménagés
narrower: abattoir
narrower: atelier
narrower: auberge
narrower: station de péage
narrower: banque
narrower: blanchisserie
narrower: boulangerie
narrower: bourse
narrower: magasin de commerce
narrower: restaurant
narrower: immeuble de bureaux
narrower: débit de boissons
narrower: marché
narrower: entrepôt commercial
narrower: forge artisanale
narrower: fournil
narrower: fromagerie
narrower: garage de réparation automobile
narrower: hôtel de voyageurs
narrower: laiterie
narrower: maison close
narrower: poterie
narrower: refuge de montagne
narrower: relais de poste
narrower: salle des ventes
narrower: station service
broader: architecture artisanale commerciale et tertiaire
alternative label: édifice privé commercial
created: 2011-09-01T00:00:00+02:00
definition: Édifice où s'effectuent des activités d'échange, d'achat et de vente de biens, titres ou services, ou bien des activités artisanales (fabrication, transformation, etc.) ou de stockage.
status: 1

boucherie
type: Concept
modified: 2014-10-06T12:46:18+02:00
in scheme: Thésaurus de la désignation des œuvres architecturales et des espaces aménagés
broader: abattoir
created: 2011-09-01T00:00:00+02:00
scope note: Ne pas employer pour une maison comportant une boutique de boucher. Le décor extérieur et intérieur de la boutique fait l’objet d’un dossier objet mobilier.
definition: Dans l'architecture de l'Ancien Régime, édifice adoptant en général la forme d'une halle, où l'on abat et où l'on vend la viande de boucherie. À l'époque contemporaine, lieu où l'on prépare et l'on vend la viande.
status: 1
narrow match: http://vocab.getty.edu/aat/300005243
narrow match: http://vocab.getty.edu/aat/300262995

abbaye
type: Concept
modified: 2014-11-27T16:51:04+01:00
in scheme: Thésaurus de la désignation des œuvres architecturales et des espaces aménagés
preferred label: abbazia @it
preferred label: abbeys @en-us
preferred label: abbey @en-gb
broader: établissement conventuel
created: 2011-09-01T00:00:00+02:00
scope note: Il convient de préciser l'ordre religieux en désignation.
definition: Établissement monastique sous le gouvernement d'un abbé ou d'une abbesse. L'abbaye-mère est une abbaye à partir de laquelle ont été fondées d'autres abbayes.
status: 1

établissement conventuel
type: Concept
modified: 2014-11-27T15:51:01+01:00
in scheme: Thésaurus de la désignation des œuvres architecturales et des espaces aménagés
preferred label: casa religiosa @it
preferred label: christian + religious communities @en-us
preferred label: religious house @en-gb
narrower: abbaye
narrower: béguinage
narrower: commanderie
narrower: couvent
narrower: ermitage
narrower: prieuré
broader: édifice religieux chrétien
alternative label: monastère
created: 2011-09-01T00:00:00+02:00
related: noviciat
definition: Établissement d'une communauté religieuse d'hommes ou de femmes.
TermeAssocie: noviciat
status: 1

abreuvoir
type: Concept
modified: 2014-12-30T14:11:06+01:00
in scheme: Thésaurus de la désignation des œuvres architecturales et des espaces aménagés
preferred label: troughs @en-us
broader: partie d'édifice agricole
created: 2011-09-01T00:00:00+02:00
scope note: Ne pas confondre avec auge-abreuvoir.
definition: Bassin pour faire boire et baigner les animaux qui peuvent y descendre par des rampes d'accès.
status: 1

partie d'édifice agricole
type: Concept
modified: 2014-09-02T17:16:32+02:00
in scheme: Thésaurus de la désignation des œuvres architecturales et des espaces aménagés
preferred label: farm building @en-gb
narrower: abreuvoir
narrower: aire à battre
narrower: aire à sécher
narrower: étable
narrower: remise agricole
narrower: pigeonnier
narrower: cuvage
narrower: faisanderie
narrower: fenil
narrower: grange
narrower: mare
narrower: poulailler
narrower: pressoir
narrower: rucher
narrower: vivier
broader: architecture agricole
created: 2011-09-01T00:00:00+02:00
definition: Espace intérieur d’un édifice agricole ou bâtiment qui lui est associé.
status: 1
broad match: http://data.bnf.fr/ark:/12148/cb119581065
broad match: http://vocab.getty.edu/aat/300004898

abri
type: Concept
modified: 2014-12-31T12:11:26+01:00
in scheme: Thésaurus de la désignation des œuvres architecturales et des espaces aménagés
narrower: abri sous roche
narrower: abri troglodytique
narrower: cabane
narrower: souterrain
broader: édifice domestique
created: 2011-09-01T00:00:00+02:00
definition: Édifice ou excavation permettant de se mettre à couvert de la pluie, du soleil, du danger, etc.
status: 1

édifice domestique
type: Concept
modified: 2013-04-23T00:00:00+02:00
in scheme: Thésaurus de la désignation des œuvres architecturales et des espaces aménagés
narrower: abri
narrower: demeure
broader: architecture domestique
alternative label: édifice d'habitation
created: 2011-09-01T00:00:00+02:00
definition: Construction ou groupe de constructions lié au logement et aux activités domestiques.
status: 1

abri sous roche
type: Concept
modified: 2014-12-31T11:29:42+01:00
in scheme: Thésaurus de la désignation des œuvres architecturales et des espaces aménagés
preferred label: cave dwellings @en-us
broader: abri
alternative label: grotte
alternative label: grotte préhistorique
created: 2011-09-01T00:00:00+02:00
related: grotte ornée
definition: Espace à l'abri sous un surplomb rocheux ou excavation naturelle dans le rocher. Il servait d'abri ou de lieu cultuel à l'époque préhistorique.
TermeAssocie: grotte ornée
status: 1

abri troglodytique
type: Concept
modified: 2014-12-31T11:31:42+01:00
in scheme: Thésaurus de la désignation des œuvres architecturales et des espaces aménagés
broader: abri
created: 2011-09-01T00:00:00+02:00
scope note: Pour une maison ou une église troglodytique, porter l’information dans la désignation complète de l’édifice.
related: souterrain refuge
definition: Abri aménagé dans une excavation naturelle ou artificielle : le percement de baies, le nivellement des sols, la distribution de l'espace intérieur, etc. sont les principaux aménagements qui distinguent l'abri troglodytique de la simple grotte.
TermeAssocie: souterrain refuge
status: 1
broad match: http://vocab.getty.edu/aat/300048808

cabane
type: Concept
modified: 2014-12-31T12:03:19+01:00
in scheme: Thésaurus de la désignation des œuvres architecturales et des espaces aménagés
preferred label: huts @en-us
broader: abri
alternative label: borie
alternative label: chibotte
alternative label: hutte
alternative label: cadole
alternative label: orry
created: 2011-09-01T00:00:00+02:00
definition: Construction rudimentaire ayant fonction d'abri.
status: 1

souterrain
type: Concept
modified: 2014-12-31T12:06:45+01:00
in scheme: Thésaurus de la désignation des œuvres architecturales et des espaces aménagés
preferred label: souterrains @en-us
narrower: souterrain refuge
broader: abri
created: 2011-09-01T00:00:00+02:00
definition: Passage naturel ou aménagé par l'homme, situé sous le niveau du sol et destiné à servir de moyen de circulation, voire d'habitation.
status: 1

abri d'horloge
type: Concept
modified: 2014-10-17T15:20:47+02:00
in scheme: Thésaurus de la désignation des œuvres architecturales et des espaces aménagés
broader: édicule de l'administration ou de la vie publique
created: 2011-09-01T00:00:00+02:00
definition: Structure, isolée ou adossée, destinée à protéger des intempéries une horloge publique.
status: 1

édicule de l'administration ou de la vie publique
type: Concept
modified: 2013-04-23T00:00:00+02:00
in scheme: Thésaurus de la désignation des œuvres architecturales et des espaces aménagés
narrower: abri d'horloge
narrower: banc public
narrower: lavoir
narrower: horloge publique
narrower: toilettes publiques
broader: architecture civile publique
created: 2011-09-01T00:00:00+02:00
related: pont-bascule
definition: Édicule relevant de la vie publique.
TermeAssocie: pont-bascule
status: 1

abri d'instrument équatorial
type: Concept
modified: 2014-12-19T10:23:01+01:00
in scheme: Thésaurus de la désignation des œuvres architecturales et des espaces aménagés
broader: observatoire
alternative label: coupole d'observatoire
created: 2011-09-01T00:00:00+02:00
definition: Ouvrage isolé ou partie d'un observatoire astronomique au centre duquel est placé un instrument fixe, lunette ou télescope, permettant de suivre le mouvement des astres. Pour permettre à l'instrument de pointer et de suivre un astre, quelles que soient ses positions initiale et successives, cet ouvrage est le plus souvent couvert d'un dôme hémisphérique mobile possédant une ouverture verticale occultable par des panneaux à glissières.
status: 1

observatoire
type: Concept
modified: 2014-12-19T10:21:10+01:00
in scheme: Thésaurus de la désignation des œuvres architecturales et des espaces aménagés
preferred label: observatories @en-us
narrower: abri d'instrument équatorial
narrower: abri d'instrument méridien
narrower: marégraphe
narrower: station de sismologie
narrower: station météorologique
broader: institut de recherche
alternative label: observatoire astronomique
created: 2011-09-01T00:00:00+02:00
scope note: Pour étudier l’instrumentation, voir le Thesaurus des objets mobiliers.
definition: Établissement de recherche abritant les services et l’instrumentation nécessaires aux observations, mesures et analyses en astronomie (astrométrie, astrophysique, etc.) et/ou en géophysique (météorologie, géomagnétisme, sismologie, etc.).
status: 1

abri d'instrument méridien
type: Concept
modified: 2014-12-19T10:24:34+01:00
in scheme: Thésaurus de la désignation des œuvres architecturales et des espaces aménagés
broader: observatoire
created: 2011-09-01T00:00:00+02:00
scope note: À cet ouvrage sont souvent associées des mires qui permettent, par contrôle, de positionner l'instrument d'observation.
definition: Ouvrage isolé ou partie d'un observatoire astronomique où sont placés un ou plusieurs instruments permettant d'observer l'heure de passage ou la hauteur d'un astre au moment où celui-ci franchit le méridien du lieu. Pour permettre à l'instrument d'observer le ciel dans le plan méridien, les murs nord et sud sont percés sur toute leur hauteur de baies verticales prolongées dans la couverture par une ouverture zénithale couverte d'un toit amovible.
status: 1

grotte ornée
type: Concept
modified: 2014-10-23T10:23:41+02:00
in scheme: Thésaurus de la désignation des œuvres architecturales et des espaces aménagés
preferred label: caverna decorata @it
preferred label: cave + rock art @en-gb
broader: édifice religieux
created: 2011-09-01T00:00:00+02:00
related: abri sous roche
definition: Cavité naturelle dont les parois ont été décorées par l'homme dans un but cultuel.
TermeAssocie: abri sous roche
status: 1

souterrain refuge
type: Concept
modified: 2014-12-31T12:04:49+01:00
in scheme: Thésaurus de la désignation des œuvres architecturales et des espaces aménagés
broader: souterrain
created: 2011-09-01T00:00:00+02:00
related: abri troglodytique
definition: Excavation artificielle formée de galeries et de cellules, destinées à servir de refuge ou même d'habitation permanente.
TermeAssocie: abri troglodytique
status: 1
broad match: http://data.bnf.fr/ark:/12148/cb131628193

abside
type: Concept
modified: 2015-02-25T11:14:30+01:00
in scheme: Thésaurus de la désignation des œuvres architecturales et des espaces aménagés
preferred label: apses @en-us
narrower: absidiole
broader: partie ou élément commun à tous les types d'architecture et aux espaces aménagés
created: 2011-09-01T00:00:00+02:00
related: partie d'église
definition: Espace intérieur de plan cintré ou polygonal s'ouvrant sur une pièce ou sur un vaisseau.
TermeAssocie: partie d'église
status: 1

partie d'église
type: Concept
modified: 2013-04-23T00:00:00+02:00
in scheme: Thésaurus de la désignation des œuvres architecturales et des espaces aménagés
narrower: chaire à prêcher extérieure
narrower: chapelle d'église
narrower: chevet
narrower: choeur
narrower: clôture de chapelle
narrower: clôture de choeur
narrower: collatéral
narrower: crypte
narrower: déambulatoire
narrower: niche-crédence
narrower: massif antérieur
narrower: nef
narrower: sacristie
narrower: tour lanterne
narrower: transept
narrower: salle du trésor
broader: partie d'édifice religieux
created: 2011-09-01T00:00:00+02:00
related: abside
related: absidiole
related: parvis
definition: Partie d’une église, d’un de ses éléments ou d’un bâtiment qui lui est associé.
TermeAssocie: abside
TermeAssocie: absidiole
TermeAssocie: parvis
status: 1

absidiole
type: Concept
modified: 2015-02-25T11:19:39+01:00
in scheme: Thésaurus de la désignation des œuvres architecturales et des espaces aménagés
preferred label: apsidioles @en-us
broader: abside
created: 2011-09-01T00:00:00+02:00
scope note: L'absidiole n'est souvent qu'une partie de chapelle : ne pas prendre en compte sa partie dans la définition de l'absidiole.
related: partie d'église
definition: Petite abside.
TermeAssocie: partie d'église
status: 1
broad match: cb11941964n

académie
type: Concept
modified: 2014-12-12T14:26:02+01:00
in scheme: Thésaurus de la désignation des œuvres architecturales et des espaces aménagés
preferred label: academies (buildings) @en-us
broader: édifice et aménagement de culture recherche sport ou loisir
created: 2011-09-01T00:00:00+02:00
scope note: Ne pas appeler académie les bureaux d'un rectorat, qui sont désignés comme établissement administratif.
definition: Édifice destiné à accueillir une société de gens de lettres, savants ou artistes : Académie française, académie de médecine, académie de musique, etc.
status: 1

édifice et aménagement de culture recherche sport ou loisir
type: Concept
modified: 2013-04-23T00:00:00+02:00
in scheme: Thésaurus de la désignation des œuvres architecturales et des espaces aménagés
narrower: académie
narrower: aire de jeux
narrower: aménagement sportif
narrower: salle de spectacle
narrower: centre d'archives
narrower: atelier d'artiste
narrower: auberge de jeunesse
narrower: établissement de bains
narrower: plage aménagée
narrower: bibliothèque
narrower: édifice sportif
narrower: casino
narrower: centre de loisirs
narrower: centre culturel
narrower: établissement de danse
narrower: institut de recherche
narrower: lieu d'exposition
narrower: lieu de production médiatique
narrower: maison de quartier
narrower: musée
narrower: palais des congrès
narrower: plan d'eau aménagé
narrower: salle de billard
narrower: salle des fêtes
narrower: office de tourisme
narrower: théâtre de plein air
broader: architecture de culture recherche sport ou loisir
created: 2011-09-01T00:00:00+02:00
definition: Espace, construction ou groupe de constructions accueillant ou abritant des activités culturelles, sportives, de recherche ou de loisirs.
status: 1

aciérie
type: Concept
modified: 2015-03-13T16:03:02+01:00
in scheme: Thésaurus de la désignation des œuvres architecturales et des espaces aménagés
broader: usine de fabrication des métaux
created: 2011-09-01T00:00:00+02:00
definition: Usine où l'on fabrique l'acier et comprenant généralement des convertisseurs, des fours industriels, un pont roulant, etc.
status: 1

usine de fabrication des métaux
type: Concept
modified: 2015-03-13T15:44:47+01:00
in scheme: Thésaurus de la désignation des œuvres architecturales et des espaces aménagés
narrower: aciérie
narrower: affinerie
narrower: bas fourneau
narrower: forge anglaise
narrower: forge catalane
narrower: haut fourneau
narrower: usine électrométallurgique
broader: usine métallurgique
created: 2011-09-01T00:00:00+02:00
definition: Usine où l'on fabrique de l'acier, du fer, de la fonte, du cuivre, de l'aluminium, etc., suivant différents procédés.
status: 1

aérodrome
type: Concept
modified: 2014-12-01T12:01:10+01:00
in scheme: Thésaurus de la désignation des œuvres architecturales et des espaces aménagés
narrower: hydrobase
narrower: aéroport
broader: ensemble du génie civil
alternative label: terrain d'aviation
created: 2011-09-01T00:00:00+02:00
related: tour de contrôle
definition: Plate-forme aménagée pour l'accueil d'aéronefs et pour la pratique de l'aviation sous toutes ses formes.
TermeAssocie: tour de contrôle
status: 1
broad match: cb11936051t

tour de contrôle
type: Concept
modified: 2014-10-16T15:44:57+02:00
in scheme: Thésaurus de la désignation des œuvres architecturales et des espaces aménagés
preferred label: control towers @en-us
broader: poste de commande
alternative label: vigie
created: 2011-09-01T00:00:00+02:00
related: aérodrome
definition: Dans un aérodrome, édifice où est organisé le trafic aérien : celui proche des pistes, comme celui des appareils plus lointains, mais gérant également la circulation des avions au sol.
TermeAssocie: aérodrome
status: 1

ensemble du génie civil
type: Concept
modified: 2013-04-23T00:00:00+02:00
in scheme: Thésaurus de la désignation des œuvres architecturales et des espaces aménagés
narrower: aérodrome
narrower: aqueduc
narrower: port
narrower: voie navigable
narrower: canal
narrower: site d'écluse
narrower: gare de triage
narrower: plate-forme multimodale
narrower: rivière aménagée
narrower: voie ferrée
broader: génie civil
created: 2011-09-01T00:00:00+02:00
definition: Ensemble formé d'édifices ou d'ouvrages d'ingénierie civile, ou appartenant à des réseaux.
status: 1

hydrobase
type: Concept
modified: 2014-10-16T14:26:45+02:00
in scheme: Thésaurus de la désignation des œuvres architecturales et des espaces aménagés
broader: aérodrome
created: 2011-09-01T00:00:00+02:00
definition: Plan d’eau spécialement aménagé pour l'accueil d’hydravions. Il comprend, outre des installations à terre comparables à celles de tout autre aérodrome (vigie, hangar aéronautique, etc.), une aire amerrissage et de décollage, des chenaux de circulation, des bassins de mouillage pouvant être équipés d’ouvrages d’accostage fixes ou flottants, de cale ou de slipway, etc.
status: 1

aéroport
type: Concept
modified: 2014-12-01T12:05:58+01:00
in scheme: Thésaurus de la désignation des œuvres architecturales et des espaces aménagés
preferred label: airports @en-us
broader: aérodrome
alternative label: complexe aéroportuaire
created: 2011-09-01T00:00:00+02:00
definition: Tout aérodrome accueillant les infrastructures liées aux activités commerciales du transport aérien.
status: 1

aérogare
type: Concept
modified: 2014-11-28T16:14:35+01:00
in scheme: Thésaurus de la désignation des œuvres architecturales et des espaces aménagés
broader: établissement aéronautique
created: 2011-09-01T00:00:00+02:00
definition: Ensemble des bâtiments permettant aux passagers ou au fret de gagner les avions ou d'en ressortir. On y trouve généralement les services commerciaux, d'embarquement et de débarquement, de douane, de police, etc.
status: 1
broad match: http://vocab.getty.edu/aat/300000681

établissement aéronautique
type: Concept
modified: 2014-10-23T11:58:55+02:00
in scheme: Thésaurus de la désignation des œuvres architecturales et des espaces aménagés
preferred label: air and space transportation buildings @en-us
narrower: aérogare
narrower: hangar aéronautique
broader: édifice du génie civil
created: 2011-09-01T00:00:00+02:00
definition: Édifice lié à l'aviation.
status: 1

affinerie
type: Concept
modified: 2015-03-13T16:17:45+01:00
in scheme: Thésaurus de la désignation des œuvres architecturales et des espaces aménagés
broader: usine de fabrication des métaux
created: 2011-09-01T00:00:00+02:00
definition: Usine où l'on affine les métaux en les débarrassant de leurs impuretés et comprenant généralement un four industriel, etc.
status: 1

agglomération
type: Concept
modified: 2015-01-07T11:52:24+01:00
in scheme: Thésaurus de la désignation des œuvres architecturales et des espaces aménagés
preferred label: settlement @en-gb
preferred label: agglomerations @en-us
narrower: station thermale
narrower: village
narrower: ville
narrower: bourg
narrower: conurbation
narrower: écart
narrower: palafitte
narrower: station climatique
narrower: station de villégiature
broader: urbanisme et espaces aménagés
alternative label: habitat
alternative label: ensemble urbain
created: 2011-09-01T00:00:00+02:00
definition: Pour une ville débordant les limites communales, préférer le terme d'agglomération à celui de ville.
definition: Groupement de bâtiments pérennes ou éphémères présentant entre eux peu ou pas de discontinuité, pouvant être accompagnés d'autres aménagements de l'espace, de fonctions diverses ou non.
status: 1

station thermale
type: Concept
modified: 2014-10-17T14:20:42+02:00
in scheme: Thésaurus de la désignation des œuvres architecturales et des espaces aménagés
preferred label: spa @en-gb
preferred label: spas @en-us
broader: agglomération
alternative label: ville d'eau
created: 2011-09-01T00:00:00+02:00
related: station de villégiature
related: établissement thermal
definition: Agglomération consacrée aux activités curatives liées à la présence d’une eau aux propriétés particulières.
TermeAssocie: station de villégiature
TermeAssocie: établissement thermal
status: 1
broad match: cb11935587z

village
type: Concept
modified: 2015-01-07T11:42:26+01:00
in scheme: Thésaurus de la désignation des œuvres architecturales et des espaces aménagés
preferred label: villages @en-us
preferred label: villaggio @it
broader: agglomération
created: 2011-09-01T00:00:00+02:00
definition: Agglomération de moins de 2000 habitants, autrefois souvent siège d'une paroisse et essentiellement vouée aux activités agricoles.
definition: Le nombre d’habitants à prendre en compte est celui de la seule partie agglomérée de la commune.
status: 1

ville
type: Concept
modified: 2015-01-07T11:48:48+01:00
in scheme: Thésaurus de la désignation des œuvres architecturales et des espaces aménagés
preferred label: città @it
preferred label: cities + towns @en-us
preferred label: town @en-gb
narrower: ville nouvelle
narrower: ville satellite
broader: agglomération
alternative label: civitas
created: 2011-09-01T00:00:00+02:00
scope note: Le nombre d’habitants à prendre en compte est celui de la seule partie agglomérée de la commune.
definition: Agglomération de plus de 2000 habitants, aux fonctions diversifiées (administration, économie, transports, culture, éducation, logement, etc.), en majorité non agricoles. La ville n’est formée que d’une commune.
status: 1

bourg
type: Concept
modified: 2015-01-07T11:28:31+01:00
in scheme: Thésaurus de la désignation des œuvres architecturales et des espaces aménagés
preferred label: borgo @it
preferred label: boroughs @en-us
preferred label: burgh @en-gb
broader: agglomération
created: 2011-09-01T00:00:00+02:00
definition: Agglomération ou partie d'une agglomération médiévale ayant un statut juridique particulier et ne jouissant pas des privilèges de la cité. Aujourd'hui, agglomération de taille et de fonctions - notamment commerciales (lieu de marché) - intermédiaires entre le village et la ville.
status: 1
narrow match: http://data.bnf.fr/ark:/12148/cb16252678f

conurbation
type: Concept
modified: 2014-10-17T10:42:48+02:00
in scheme: Thésaurus de la désignation des œuvres architecturales et des espaces aménagés
preferred label: conurbations @en-us
broader: agglomération
created: 2011-09-01T00:00:00+02:00
definition: Agglomération formée d'une ville et de ses banlieues ou de villes voisines, réunies par suite de leur expansion.
status: 1
broad match: http://data.bnf.fr/ark:/12148/cb119762129

écart
type: Concept
modified: 2015-01-07T11:30:26+01:00
in scheme: Thésaurus de la désignation des œuvres architecturales et des espaces aménagés
preferred label: frazione @it
preferred label: hamlet @en-gb
preferred label: hamlets @en-us
broader: agglomération
alternative label: hameau
alternative label: lieu-dit
created: 2011-09-01T00:00:00+02:00
definition: Agglomération, généralement d'origine rurale, formée de quelques édifices.
status: 1
broad match: cb11939034z

palafitte
type: Concept
modified: 2015-01-07T11:31:25+01:00
in scheme: Thésaurus de la désignation des œuvres architecturales et des espaces aménagés
preferred label: palafitta @it
preferred label: lake dwelings @en-us
preferred label: lake village @en-gb
broader: agglomération
alternative label: cité lacustre
created: 2011-09-01T00:00:00+02:00
definition: Agglomération construite sur pilotis, située sur l'eau ou sur un rivage.
status: 1

station climatique
type: Concept
modified: 2014-10-17T10:45:04+02:00
in scheme: Thésaurus de la désignation des œuvres architecturales et des espaces aménagés
preferred label: health resorts @en-us
broader: agglomération
created: 2011-09-01T00:00:00+02:00
definition: Agglomération ou partie d’agglomération dont l’origine ou la fonction emblématique sont les soins médicaux ou le sport, dans un site au climat adapté.
status: 1

station de villégiature
type: Concept
modified: 2015-01-07T11:38:22+01:00
in scheme: Thésaurus de la désignation des œuvres architecturales et des espaces aménagés
preferred label: resorts @en-us
narrower: station balnéaire
narrower: station de sports d'hiver
broader: agglomération
created: 2011-09-01T00:00:00+02:00
related: station thermale
definition: Agglomération ou partie d’agglomération dont l’origine ou la fonction emblématique est le repos, la détente, les loisirs, le sport, la culture, la visite de curiosités naturelles. Il s’y trouve plus d’habitants temporaires que permanents.
TermeAssocie: station thermale
status: 1

agglomération cultuelle
type: Concept
modified: 2013-04-23T00:00:00+02:00
in scheme: Thésaurus de la désignation des œuvres architecturales et des espaces aménagés
broader: ensemble religieux
created: 2011-09-01T00:00:00+02:00
status: 1

ensemble religieux
type: Concept
modified: 2013-04-23T00:00:00+02:00
in scheme: Thésaurus de la désignation des œuvres architecturales et des espaces aménagés
preferred label: religious communities @en-us
narrower: agglomération cultuelle
narrower: centre paroissial
narrower: ensemble cultuel
narrower: groupe épiscopal
narrower: quartier canonial
broader: architecture religieuse
created: 2011-09-01T00:00:00+02:00
definition: Ensemble à fonction religieuse constitué d'édifices ou d'édicules religieux.
status: 1

aire à battre
type: Concept
modified: 2014-12-30T14:12:14+01:00
in scheme: Thésaurus de la désignation des œuvres architecturales et des espaces aménagés
preferred label: threshing floor @en-us
narrower: aire à battre couverte
broader: partie d'édifice agricole
created: 2011-09-01T00:00:00+02:00
definition: Terrain aplani destiné au battage des céréales.
status: 1

aire à battre couverte
type: Concept
modified: 2014-12-30T14:13:01+01:00
in scheme: Thésaurus de la désignation des œuvres architecturales et des espaces aménagés
broader: aire à battre
created: 2011-09-01T00:00:00+02:00
definition: Aire à battre délimitée par des poteaux, fermée ou non, portant une toiture.
status: 1

aire à sécher
type: Concept
modified: 2014-10-06T12:10:31+02:00
in scheme: Thésaurus de la désignation des œuvres architecturales et des espaces aménagés
broader: partie d'édifice agricole
created: 2011-09-01T00:00:00+02:00
scope note: Ne pas confondre avec aire de séchage.
definition: Terrain aplani destiné au séchage de denrées agricoles.
status: 1

aire de concassage
type: Concept
modified: 2015-03-24T12:55:25+01:00
in scheme: Thésaurus de la désignation des œuvres architecturales et des espaces aménagés
broader: parties industrielles
created: 2011-09-01T00:00:00+02:00
definition: Espace non bâti, délimité et aménagé pour broyer un produit solide (industrie extractive, métallurgie, etc.).
status: 1

parties industrielles
type: Concept
modified: 2015-04-30T16:08:45+02:00
in scheme: Thésaurus de la désignation des œuvres architecturales et des espaces aménagés
narrower: aire de concassage
narrower: aire de fabrication
narrower: aire de lavage
narrower: aire de séchage
narrower: aire de stockage du combustible
narrower: aire de triage
narrower: aire des déchets
narrower: aire des matières premières
narrower: aire des produits manufacturés
narrower: atelier de conditionnement
narrower: atelier de fabrication
narrower: atelier de réparation
narrower: bassin de retenue
narrower: bassin de décantation
narrower: bâtiment administratif d'entreprise
narrower: bâtiment d'eau
narrower: bâtiment de la machine d'extraction
narrower: chevalement
narrower: bâtiment de la soufflerie
narrower: bâtiment de recette
narrower: bureau d'études
narrower: cale de construction
narrower: excavation
narrower: chai
narrower: chambre froide
narrower: chaufferie
narrower: cheminée d'usine
narrower: cokerie
narrower: logement de contremaître
narrower: logement d'ouvriers
narrower: logement patronal
narrower: derrick
narrower: magasin industriel
narrower: entrepôt industriel
narrower: établissement administratif d'entreprise
narrower: four industriel
narrower: galerie maçonnée
narrower: réservoir industriel
narrower: local du comité d'entreprise
narrower: pièce de séchage
narrower: pièce de stockage du combustible
narrower: poste de chargement
narrower: puits d'aérage
narrower: puits d'extraction
narrower: puits de service
narrower: puits de sondage
narrower: salle des machines
narrower: terril
narrower: tour de réfrigération
narrower: transporteur automatique par câbles
broader: architecture industrielle
alternative label: partie d'édifice industriel
created: 2011-09-01T00:00:00+02:00
definition: Partie d’un édifice industriel ou d’une construction qui lui est associée.
status: 1

aire de fabrication
type: Concept
modified: 2015-03-24T13:01:03+01:00
in scheme: Thésaurus de la désignation des œuvres architecturales et des espaces aménagés
broader: parties industrielles
created: 2011-09-01T00:00:00+02:00
definition: Espace non bâti, délimité et aménagé pour qu’on puisse y effectuer les différentes opérations de fabrication d'un produit.
status: 1

aire de jeux
type: Concept
modified: 2014-10-17T15:45:35+02:00
in scheme: Thésaurus de la désignation des œuvres architecturales et des espaces aménagés
preferred label: playgrounds @en-us
broader: édifice et aménagement de culture recherche sport ou loisir
created: 2011-09-01T00:00:00+02:00
definition: Surface libre d'assez petites dimensions aménagée pour les jeux d’enfants.
status: 1

aire de lavage
type: Concept
modified: 2015-03-24T13:16:00+01:00
in scheme: Thésaurus de la désignation des œuvres architecturales et des espaces aménagés
broader: parties industrielles
created: 2011-09-01T00:00:00+02:00
definition: Espace non bâti, délimité et aménagé pour procéder à l'élimination des stériles contenus dans les minerais bruts.
status: 1

aire de séchage
type: Concept
modified: 2015-03-24T14:58:37+01:00
in scheme: Thésaurus de la désignation des œuvres architecturales et des espaces aménagés
broader: parties industrielles
created: 2011-09-01T00:00:00+02:00
scope note: Ne pas confondre avec aire à sécher.
definition: Terrain aplani destiné au séchage de produits industriels (industrie céramique, industrie textile, tannerie).
status: 1

aire de stockage du combustible
type: Concept
modified: 2015-04-30T16:23:22+02:00
in scheme: Thésaurus de la désignation des œuvres architecturales et des espaces aménagés
broader: parties industrielles
created: 2011-09-01T00:00:00+02:00
definition: Espace non bâti, délimité et aménagé pour stocker le combustible en attente de son utilisation.
status: 1

aire de triage
type: Concept
modified: 2013-04-23T00:00:00+02:00
in scheme: Thésaurus de la désignation des œuvres architecturales et des espaces aménagés
broader: parties industrielles
created: 2011-09-01T00:00:00+02:00
definition: Espace non bâti, délimité et aménagé pour effectuer le triage mécanique, par grosseur, des minerais bruts.
status: 1

aire des déchets
type: Concept
modified: 2015-03-24T13:25:58+01:00
in scheme: Thésaurus de la désignation des œuvres architecturales et des espaces aménagés
broader: parties industrielles
created: 2011-09-01T00:00:00+02:00
definition: Espace non bâti, délimité et aménagé pour recevoir les déchets et les matières impropres à la fabrication.
status: 1

aire des matières premières
type: Concept
modified: 2015-03-24T15:08:31+01:00
in scheme: Thésaurus de la désignation des œuvres architecturales et des espaces aménagés
broader: parties industrielles
created: 2011-09-01T00:00:00+02:00
definition: Espace non bâti, délimité et aménagé pour stocker les matières premières avant transformation.
status: 1

aire des produits manufacturés
type: Concept
modified: 2015-03-24T15:15:01+01:00
in scheme: Thésaurus de la désignation des œuvres architecturales et des espaces aménagés
broader: parties industrielles
created: 2011-09-01T00:00:00+02:00
definition: Espace non bâti, délimité et aménagé pour stocker les produits manufacturés.
status: 1

alignement
type: Concept
modified: 2015-02-24T16:12:10+01:00
in scheme: Thésaurus de la désignation des œuvres architecturales et des espaces aménagés
preferred label: alineamento @it
preferred label: stone alignment @en-gb
preferred label: megalith alignments @en-us
broader: mégalithe
alternative label: cromlech
alternative label: alignement de menhir
created: 2011-09-01T00:00:00+02:00
scope note: Pour les alignements de maisons, employer : rue, ensemble d'édifices derrière façade, front bâti, etc.
definition: Ensemble formé par une rangée de menhirs. Un groupement de menhirs en cercle et, par extension, en rectangle ou en carré, est appelé cromlech.
status: 1

mégalithe
type: Concept
modified: 2015-02-24T16:05:51+01:00
in scheme: Thésaurus de la désignation des œuvres architecturales et des espaces aménagés
preferred label: megalite @it
preferred label: standing stone 1 @en-gb
preferred label: megalithic monuments @en-us
narrower: alignement
narrower: allée couverte
narrower: tumulus
narrower: dolmen
narrower: menhir
narrower: trilithe
broader: monument funéraire
created: 2011-09-01T00:00:00+02:00
definition: Monument préhistorique formé de blocs de pierre de grandes dimensions. Certains de ces monuments sont enterrés sous un tumulus.
status: 1

alignement d'arbres
type: Concept
modified: 2014-12-30T16:14:56+01:00
in scheme: Thésaurus de la désignation des œuvres architecturales et des espaces aménagés
broader: couvert de jardin
created: 2011-09-01T00:00:00+02:00
definition: Rangée d'arbres. On parle d'alignement discontinu quand les cimes des arbres sont séparées, et d'alignement continu quand elles se rejoignent, effet obtenu par la taille.
status: 1
broad match: Arbre

couvert de jardin
type: Concept
modified: 2014-10-14T10:44:04+02:00
in scheme: Thésaurus de la désignation des œuvres architecturales et des espaces aménagés
narrower: alignement d'arbres
narrower: arbre isolé
narrower: bocage de jardin
narrower: bois de jardin
narrower: bosquet
narrower: forêt
narrower: groupe d'arbres
narrower: labyrinthe
narrower: massif d'arbres
narrower: quinconce
narrower: topiaire
broader: architecture de jardin et des espaces verts
created: 2011-09-01T00:00:00+02:00
definition: Ensemble des parties boisées d'un jardin.
status: 1

allée
type: Concept
modified: 2014-12-30T15:11:02+01:00
in scheme: Thésaurus de la désignation des œuvres architecturales et des espaces aménagés
preferred label: allées @en-us
narrower: allée couverte de jardin
narrower: mail
narrower: passe-pied
broader: clôture et circulation de jardin
alternative label: allée de jardin
created: 2011-09-01T00:00:00+02:00
scope note: Ne pas employer en urbanisme. Voir alleé cavalière, boulevard, avenue, etc.
definition: Voie de communication aménagée à l'intérieur des limites d'un parc ou d'un jardin, dont la largeur est en principe supérieure à deux mètres. Elle peut être régulière ou irrégulière. La contre-allée double une allée plus grande, dont elle n'est séparée que par des rangées d'arbre, une plate-bande, etc.
status: 1

clôture et circulation de jardin
type: Concept
modified: 2013-04-23T00:00:00+02:00
in scheme: Thésaurus de la désignation des œuvres architecturales et des espaces aménagés
narrower: allée
narrower: avenue de jardin
narrower: clôture de jardin
narrower: chemin de jardin
narrower: entrée de jardin
narrower: pas japonais
broader: architecture de jardin et des espaces verts
created: 2011-09-01T00:00:00+02:00
definition: Ouvrage divisant ou délimitant un jardin, ou en facilitant la circulation.
status: 1

allée couverte de jardin
type: Concept
modified: 2014-12-30T15:02:11+01:00
in scheme: Thésaurus de la désignation des œuvres architecturales et des espaces aménagés
preferred label: covered walkways @en-us
broader: allée
created: 2011-09-01T00:00:00+02:00
scope note: Ne pas confondre avec allée couverte.
definition: Allée formant un passage à couvert. L'allée sous voûte de verdure est constituée par des arbres de haute-tige taillés en marquise. Le berceau de verdure est constitué d'une palissade de verdure dont les branches forment un couvrement en berceau.
status: 1

mail
type: Concept
modified: 2014-12-30T15:07:17+01:00
in scheme: Thésaurus de la désignation des œuvres architecturales et des espaces aménagés
broader: allée
created: 2011-09-01T00:00:00+02:00
related: promenade
definition: Allée sablée longue d'environ 600 m et large de 8 à 10 m bordée de pieux ou d'arbres en alignement, où les joueurs de jeu de mail poussent une boule de bois à l'aide d'un maillet vers un lieu désigné au début de la partie.
TermeAssocie: promenade
status: 1
broad match: http://vocab.getty.edu/aat/300178561

passe-pied
type: Concept
modified: 2014-09-30T10:23:15+02:00
in scheme: Thésaurus de la désignation des œuvres architecturales et des espaces aménagés
broader: allée
created: 2011-09-01T00:00:00+02:00
definition: Sentier étroit aménagé à l'intérieur ou autour d'une pièce découverte pour permettre l'entretien des plantations. Il contribue à souligner la composition.
status: 1
broad match: cb13162947m
broad match: http://vocab.getty.edu/aat/300008328

allée cavalière
type: Concept
modified: 2015-01-07T12:24:18+01:00
in scheme: Thésaurus de la désignation des œuvres architecturales et des espaces aménagés
preferred label: bridleway @en-gb
preferred label: bridle paths @en-us
broader: voie
created: 2011-09-01T00:00:00+02:00
definition: Voie ou aménagement compris dans une voie, généralement placé latéralement, destiné aux cavaliers.
status: 1

voie
type: Concept
modified: 2014-10-17T14:28:43+02:00
in scheme: Thésaurus de la désignation des œuvres architecturales et des espaces aménagés
preferred label: road 2 @en-gb
preferred label: roads @en-us
narrower: allée cavalière
narrower: autoroute
narrower: avenue
narrower: piste cyclable
narrower: boulevard
narrower: caniveau
narrower: chaussée
narrower: chemin
narrower: chemin de halage
narrower: impasse
narrower: promenade
narrower: passage
narrower: route
narrower: rue
narrower: sentier
narrower: trottoir
broader: espace libre
created: 2011-09-01T00:00:00+02:00
related: réseau d'équipement urbain
definition: Emprise linéaire, de largeur variable, aménagée pour permettre la circulation et la liaison entre différents lieux.
TermeAssocie: réseau d'équipement urbain
status: 1
narrow match: http://data.bnf.fr/ark:/12148/cb11975928c

allée couverte
type: Concept
modified: 2015-02-24T16:14:40+01:00
in scheme: Thésaurus de la désignation des œuvres architecturales et des espaces aménagés
preferred label: gallery grave @en-gb
preferred label: gallery graves @en-us
broader: mégalithe
created: 2011-09-01T00:00:00+02:00
scope note: Ne pas confondre allée couverte, dont toutes les tables sont sensiblement à la même hauteur, avec dolmen à couloir.
definition: Chambre sépulcrale de plan allongé, formée par des tables portées sur deux alignements d'orthostates ou deux murs en pierres sèches. L'allée couverte est généralement enterrée, partiellement enterrée ou sous tumulus ; elle est souvent recoupée dans sa longueur par des murs de refend.
status: 1

ambassade
type: Concept
modified: 2014-10-09T11:54:39+02:00
in scheme: Thésaurus de la désignation des œuvres architecturales et des espaces aménagés
preferred label: embassies @en-us
narrower: consulat
broader: édifice de l'administration ou de la vie publique
created: 2011-09-01T00:00:00+02:00
scope note: Une résidence d'ambassadeur sans bureaux n'est pas une ambassade.
definition: Édifice abritant le siège de la représentation diplomatique d'un État auprès d'un autre État. Il comprend les locaux nécessaires à cette mission et peut abriter la résidence de l'ambassadeur.
status: 1

édifice de l'administration ou de la vie publique
type: Concept
modified: 2013-04-23T00:00:00+02:00
in scheme: Thésaurus de la désignation des œuvres architecturales et des espaces aménagés
narrower: ambassade
narrower: beffroi
narrower: siège d'association ou d'organisation
narrower: caserne de pompiers
narrower: mairie
narrower: entrepôt public
narrower: établissement administratif
narrower: hôtel de département
narrower: hôtel de région
narrower: porte monumentale
narrower: bureau de poste
broader: architecture civile publique
alternative label: édifice public
created: 2011-09-01T00:00:00+02:00
definition: Construction ou groupe de constructions abritant des activités administratives ou relevant de la vie publique.
status: 1

consulat
type: Concept
modified: 2014-10-09T11:55:21+02:00
in scheme: Thésaurus de la désignation des œuvres architecturales et des espaces aménagés
preferred label: consulates (diplomatic buildings) @en-us
broader: ambassade
created: 2011-09-01T00:00:00+02:00
definition: Édifice abritant le siège d'un service consulaire d'un État dans un autre État, chargé de protéger à l'étranger les intérêts de ses compatriotes dans le pays où il est implanté. Il comprend les locaux nécessaires à cette mission et, éventuellement, la résidence du consul.
status: 1

aménagement sportif
type: Concept
modified: 2014-09-05T15:41:04+02:00
in scheme: Thésaurus de la désignation des œuvres architecturales et des espaces aménagés
preferred label: sports buildings @en-us
narrower: parcours sportif
narrower: piste de glisse
narrower: terrain de jeu
broader: édifice et aménagement de culture recherche sport ou loisir
created: 2011-09-01T00:00:00+02:00
definition: Ouvrage destiné à l'exercice ou à la pratique d'une ou plusieurs activités sportives.
status: 1

parcours sportif
type: Concept
modified: 2014-10-09T13:11:11+02:00
in scheme: Thésaurus de la désignation des œuvres architecturales et des espaces aménagés
broader: aménagement sportif
created: 2011-09-01T00:00:00+02:00
definition: Ensemble d’équipements destinés à la pratique d’exercices physiques, généralement situé dans un cadre naturel.
status: 1

piste de glisse
type: Concept
modified: 2014-10-09T13:13:15+02:00
in scheme: Thésaurus de la désignation des œuvres architecturales et des espaces aménagés
preferred label: skateboarding parks @en-us
broader: aménagement sportif
created: 2011-09-01T00:00:00+02:00
related: patinoire
definition: Ouvrage destiné à la pratique de la planche à roulettes, du patin à roulettes, du bicross, du bobsleigh, de la luge, etc.
TermeAssocie: patinoire
status: 1

terrain de jeu
type: Concept
modified: 2014-10-09T13:18:40+02:00
in scheme: Thésaurus de la désignation des œuvres architecturales et des espaces aménagés
broader: aménagement sportif
created: 2011-09-01T00:00:00+02:00
definition: Espace découvert de forme et de superficie variées permettant de pratiquer un ou plusieurs types de jeu
status: 1
broad match: http://vocab.getty.edu/aat/300122433

amphithéâtre
type: Concept
modified: 2014-12-19T11:03:28+01:00
in scheme: Thésaurus de la désignation des œuvres architecturales et des espaces aménagés
preferred label: amphitheaters (builts works) @en-us
narrower: arène
broader: salle de spectacle
created: 2011-09-01T00:00:00+02:00
scope note: Ne pas confondre avec amphithéâtre d'enseignement, ni avec amphithéâtre d'anatomie.
definition: Édifice à gradins de plan circulaire ou ovale, destiné aux combats de gladiateurs et d'animaux, aux courses d'animaux, aux chasses, etc.
status: 1
narrow match: cb11961536q

salle de spectacle
type: Concept
modified: 2014-12-19T10:58:22+01:00
in scheme: Thésaurus de la désignation des œuvres architecturales et des espaces aménagés
preferred label: performing arts buildings @en-us
narrower: amphithéâtre
narrower: auditorium
narrower: cabaret
narrower: cinéma
narrower: cirque
narrower: opéra
narrower: salle de concert
narrower: théâtre
broader: édifice et aménagement de culture recherche sport ou loisir
alternative label: lieu de spectacle
created: 2011-09-01T00:00:00+02:00
definition: Édifice affecté aux représentations théâtrales, cinématographiques, chorégraphiques, musicales.
status: 1

arène
type: Concept
modified: 2014-12-19T11:04:27+01:00
in scheme: Thésaurus de la désignation des œuvres architecturales et des espaces aménagés
broader: amphithéâtre
alternative label: place de taureaux
created: 2011-09-01T00:00:00+02:00
definition: Espace libre, généralement recouvert de sable, entouré de gradins, pour accueillir les spectacles taurins.
status: 1

amphithéâtre d'anatomie
type: Concept
modified: 2015-01-02T12:29:46+01:00
in scheme: Thésaurus de la désignation des œuvres architecturales et des espaces aménagés
broader: partie d'édifice hospitalier d'assistance ou de protection sociale
created: 2011-09-01T00:00:00+02:00
definition: Salle ou corps de bâtiment de plan centré - généralement circulaire ou octogonal - muni intérieurement de gradins et destiné à montrer à un public d'étudiants une dissection de cadavre exécutée sur une table placée au centre.
status: 1

partie d'édifice hospitalier d'assistance ou de protection sociale
type: Concept
modified: 2013-04-23T00:00:00+02:00
in scheme: Thésaurus de la désignation des œuvres architecturales et des espaces aménagés
narrower: amphithéâtre d'anatomie
narrower: quartier d'aliénés
narrower: pharmacie
narrower: salle d'opération
broader: architecture hospitalière d'assistance ou de protection sociale
created: 2011-09-01T00:00:00+02:00
definition: Espace intérieur d’un édifice hospitalier, d'assistance ou de protection sociale, ou bâtiment qui lui est associé.
status: 1

amphithéâtre d'enseignement
type: Concept
modified: 2014-12-08T11:31:59+01:00
in scheme: Thésaurus de la désignation des œuvres architecturales et des espaces aménagés
preferred label: lecture halls @en-us
broader: partie d'édifice scolaire
alternative label: amphithéâtre universitaire
created: 2011-09-01T00:00:00+02:00
definition: Grande pièce garnie de gradins, où les professeurs donnent leurs cours.
status: 1

partie d'édifice scolaire
type: Concept
modified: 2014-12-08T12:00:22+01:00
in scheme: Thésaurus de la désignation des œuvres architecturales et des espaces aménagés
narrower: amphithéâtre d'enseignement
narrower: internat
narrower: préau
broader: architecture scolaire
created: 2011-09-01T00:00:00+02:00
definition: Espace intérieur d’un édifice scolaire ou d’un bâtiment qui lui est associé.
status: 1

appontement
type: Concept
modified: 2014-10-16T14:33:02+02:00
in scheme: Thésaurus de la désignation des œuvres architecturales et des espaces aménagés
preferred label: wharves @en-us
broader: ouvrage d'art
alternative label: wharf
created: 2011-09-01T00:00:00+02:00
scope note: Ne pas confondre avec jetée.
related: embarcadère
definition: Plate-forme avec tablier généralement sur pilotis fondés dans l’eau, contre laquelle peuvent accoster les bateaux. Le wharf est un appontement construit perpendiculairement à la rive auquel les navires peuvent accoster des deux côtés.
TermeAssocie: embarcadère
status: 1
broad match: http://data.bnf.fr/ark:/12148/cb119494913

embarcadère
type: Concept
modified: 2014-12-02T14:50:02+01:00
in scheme: Thésaurus de la désignation des œuvres architecturales et des espaces aménagés
preferred label: landings (marine structures) @en-us
broader: quai
alternative label: débarcadère
created: 2011-09-01T00:00:00+02:00
related: appontement
definition: Ouvrage aménagé dans un port ou sur une rivière, pour permettre l'embarquement et le débarquement de voyageurs et de marchandises. Il peut comprendre un autre type d’édifices.
TermeAssocie: appontement
status: 1
broad match: http://data.bnf.fr/ark:/12148/cb119494913

ouvrage d'art
type: Concept
modified: 2013-04-23T00:00:00+02:00
in scheme: Thésaurus de la désignation des œuvres architecturales et des espaces aménagés
narrower: appontement
narrower: ascenseur indépendant
narrower: aménagement de bac
narrower: barrage
narrower: bassin de port
narrower: berge aménagée
narrower: quai
narrower: ouvrage lié à l'alimentation en eau
narrower: borne
narrower: cale
narrower: chenal
narrower: déversoir de fond
narrower: déversoir de superficie
narrower: digue
narrower: jetée
narrower: écluse
narrower: égout
narrower: élévateur à bateau
narrower: entrée de port
narrower: éolienne
narrower: épi
narrower: remontée mécanique
narrower: gué
narrower: porte de garde
narrower: passage à niveau
narrower: passage souterrain
narrower: pente d'eau
narrower: piste d'aviation
narrower: pont
narrower: poste de commande
narrower: relais de télécommunication
narrower: sémaphore
narrower: station de télégraphe
narrower: transformateur (abri)
narrower: tunnel
broader: génie civil
alternative label: ouvrage du génie civil
alternative label: édicule du génie civil
created: 2011-09-01T00:00:00+02:00
definition: Construction, dont la conception et la réalisation ont fait intervenir des connaissances en ingénierie, pouvant entraîner l'établissement d'une voie de communication, d'un dispositif de retenue des eaux, etc.
status: 1

aqueduc
type: Concept
modified: 2014-12-01T12:49:56+01:00
in scheme: Thésaurus de la désignation des œuvres architecturales et des espaces aménagés
preferred label: aqueducts @en-us
broader: ensemble du génie civil
created: 2011-09-01T00:00:00+02:00
scope note: Ne pas appeler aqueduc mais pont-aqueduc les sections aériennes de la conduite d'eau.
related: pont aqueduc
definition: Conduite d'amenée d'eau. L'aqueduc peut être souterrain ou porté au-dessus du sol par une suite d'arcades.
TermeAssocie: pont aqueduc
status: 1

pont aqueduc
type: Concept
modified: 2014-12-02T12:37:06+01:00
in scheme: Thésaurus de la désignation des œuvres architecturales et des espaces aménagés
broader: ouvrage lié à l'alimentation en eau
created: 2011-09-01T00:00:00+02:00
related: aqueduc
definition: Ouvrage de franchissement portant un aqueduc.
TermeAssocie: aqueduc
status: 1

arbre isolé
type: Concept
modified: 2014-12-30T16:16:36+01:00
in scheme: Thésaurus de la désignation des œuvres architecturales et des espaces aménagés
broader: couvert de jardin
alternative label: arbre de la liberté
created: 2011-09-01T00:00:00+02:00
scope note: Ne pas le confondre avec l'arbre détaché qui participe à la composition du couvert dont il est un élément avancé.
definition: Arbre (arbrisseau, arbuste) planté à distance d'un couvert et qui participe à la décoration de l’espace par sa forme spécifique.
status: 1
broad match: cb11934786x

arc de couvrement
type: Concept
modified: 2015-02-25T12:23:26+01:00
in scheme: Thésaurus de la désignation des œuvres architecturales et des espaces aménagés
preferred label: arches @en-us
broader: couvrement
created: 2011-09-01T00:00:00+02:00
scope note: Voir aussi le Thesaurus des objets mobiliers.
definition: Organe appareillé porté par deux points d'appui et présentant un intrados.
status: 1

couvrement
type: Concept
modified: 2015-02-24T17:11:20+01:00
in scheme: Thésaurus de la désignation des œuvres architecturales et des espaces aménagés
narrower: arc de couvrement
narrower: voûte
narrower: lambris de couvrement
narrower: linteau
narrower: plafond
narrower: plate-bande
broader: partie ou élément commun à tous les types d'architecture et aux espaces aménagés
created: 2011-09-01T00:00:00+02:00
scope note: Voir aussi le Thesaurus des objets mobiliers.
definition: Organe ou ouvrage limitant par le haut un entrecolonnement, une baie, une pièce, un vaisseau, etc.
status: 1

arc de triomphe
type: Concept
modified: 2015-02-24T16:34:15+01:00
in scheme: Thésaurus de la désignation des œuvres architecturales et des espaces aménagés
preferred label: arco di trionfo @it
preferred label: triumphal arch @en-gb
preferred label: triumphal arches @en-us
broader: arc monumental
created: 2011-09-01T00:00:00+02:00
scope note: Ne pas confondre avec arc triomphal, qui est une élévation intérieure d'une église.
related: porte de ville
definition: Arc monumental élevé en commémoration de victoires.
TermeAssocie: porte de ville
status: 1

porte de ville
type: Concept
modified: 2014-12-12T10:31:22+01:00
in scheme: Thésaurus de la désignation des œuvres architecturales et des espaces aménagés
preferred label: city gates @en-us
broader: porte monumentale
created: 2011-09-01T00:00:00+02:00
related: arc de triomphe
related: ouvrage d'entrée
definition: Porte monumentale marquant l’entrée d’une ville. À l’origine, elle fait souvent partie d’une fortification ou d’une barrière d'octroi.
TermeAssocie: arc de triomphe
TermeAssocie: ouvrage d'entrée
status: 1

arc monumental
type: Concept
modified: 2015-02-24T16:33:18+01:00
in scheme: Thésaurus de la désignation des œuvres architecturales et des espaces aménagés
preferred label: arco onorario @it
preferred label: memorial arches @en-us
preferred label: commemorative monument + arch @en-gb
narrower: arc de triomphe
broader: monument
alternative label: arc funéraire
alternative label: arc commémoratif
created: 2011-09-01T00:00:00+02:00
definition: Monument formé d'une ou plusieurs arches. À l'époque moderne, l'arc monumental peut en outre faire fonction de porte de ville.
status: 1
narrow match: Arc de triomphe

monument
type: Concept
modified: 2015-02-24T12:36:36+01:00
in scheme: Thésaurus de la désignation des œuvres architecturales et des espaces aménagés
preferred label: monuments @en-us
preferred label: commemorative monument 1 @en-gb
narrower: arc monumental
narrower: édicule commémoratif
narrower: obélisque
narrower: roche ornée
broader: architecture monumentale commémorative funéraire et votive
alternative label: édicule votif
created: 2011-09-01T00:00:00+02:00
scope note: Voir aussi le Thesaurus des objets mobiliers.
definition: Au sens propre, édicule commémoratif ou votif.
status: 1

ensemble agricole
type: Concept
modified: 2014-12-30T14:08:39+01:00
in scheme: Thésaurus de la désignation des œuvres architecturales et des espaces aménagés
preferred label: agricultural complexes @en-us
narrower: réseau d'irrigation
narrower: exploitation agricole
narrower: ensemble pastoral
narrower: exploitation aquicole
narrower: polder
narrower: terrasse agricole
broader: architecture agricole
created: 2011-09-01T00:00:00+02:00
scope note: Ne pas appeler ensemble agricole l'ensemble des fermes pouvant constituer des annexes d'un même domaine.
definition: Ensemble constitué d'édifices, édicules ou ouvrages à fonction agricole.
status: 1
broad match: http://data.bnf.fr/ark:/12148/cb119581065

édifice agricole
type: Concept
modified: 2014-09-02T16:59:42+02:00
in scheme: Thésaurus de la désignation des œuvres architecturales et des espaces aménagés
preferred label: agricultural buildings @en-us
narrower: ferme
narrower: entrepôt agricole
narrower: haras
narrower: magnanerie
broader: architecture agricole
created: 2011-09-01T00:00:00+02:00
definition: Édifice à fonction agricole.
status: 1
broad match: http://data.bnf.fr/ark:/12148/cb119581065

ensemble artisanal commercial ou tertiaire
type: Concept
modified: 2013-04-23T00:00:00+02:00
in scheme: Thésaurus de la désignation des œuvres architecturales et des espaces aménagés
narrower: centre artisanal
narrower: centre commercial
narrower: centre d'affaires
narrower: champ de foire
narrower: parc d'exposition
narrower: complexe hôtelier
broader: architecture artisanale commerciale et tertiaire
created: 2011-09-01T00:00:00+02:00
definition: Complexe regroupant des constructions liées aux activités artisanales, commerciales ou tertiaires.
status: 1

édicule artisanal
type: Concept
modified: 2013-04-23T00:00:00+02:00
in scheme: Thésaurus de la désignation des œuvres architecturales et des espaces aménagés
narrower: polissoir
narrower: travail à ferrer
broader: architecture artisanale commerciale et tertiaire
created: 2011-09-01T00:00:00+02:00
definition: Édicule utilisé à des fins artisanales.
status: 1

parties artisanales
type: Concept
modified: 2013-04-23T00:00:00+02:00
in scheme: Thésaurus de la désignation des œuvres architecturales et des espaces aménagés
broader: architecture artisanale commerciale et tertiaire
alternative label: partie d'édifice artisanal
created: 2011-09-01T00:00:00+02:00
related: moulin
related: pressoir
definition: Parties d'édifice aménagées pour accueillir une ou plusieurs activités artisanales.
TermeAssocie: moulin
TermeAssocie: pressoir
status: 1

parties commerciales
type: Concept
modified: 2013-04-23T00:00:00+02:00
in scheme: Thésaurus de la désignation des œuvres architecturales et des espaces aménagés
narrower: boutique
narrower: devanture
broader: architecture artisanale commerciale et tertiaire
alternative label: partie d'édifice commercial
created: 2011-09-01T00:00:00+02:00
definition: Parties d'édifice aménagées pour accueillir une ou plusieurs activités commerciales.
status: 1

ensemble de l'administration ou de la vie publique
type: Concept
modified: 2013-04-23T00:00:00+02:00
in scheme: Thésaurus de la désignation des œuvres architecturales et des espaces aménagés
narrower: centre administratif
broader: architecture civile publique
created: 2011-09-01T00:00:00+02:00
definition: Complexe regroupant des constructions dévolues à des activités administratives ou relevant de la vie publique.
status: 1

ensemble de culture recherche sport ou loisir
type: Concept
modified: 2013-04-23T00:00:00+02:00
in scheme: Thésaurus de la désignation des œuvres architecturales et des espaces aménagés
narrower: base de loisirs
narrower: camping
narrower: complexe sportif
narrower: parc d'attractions
narrower: parc résidentiel de loisirs
narrower: village de vacances
broader: architecture de culture recherche sport ou loisir
created: 2011-09-01T00:00:00+02:00
definition: Complexe regroupant des constructions consacrées aux activités culturelles, sportives, de recherche ou de loisir.
status: 1

édicule de culture recherche sport ou loisir
type: Concept
modified: 2013-04-23T00:00:00+02:00
in scheme: Thésaurus de la désignation des œuvres architecturales et des espaces aménagés
narrower: plongeoir
narrower: cabine de bain
narrower: mire
narrower: poste d'affût
narrower: table d'orientation
broader: architecture de culture recherche sport ou loisir
created: 2011-09-01T00:00:00+02:00
definition: Édicule utilisé à des fins culturelles, sportives, de recherche ou de loisir.
status: 1

partie d'édifice de culture recherche sport ou loisir
type: Concept
modified: 2013-04-23T00:00:00+02:00
in scheme: Thésaurus de la désignation des œuvres architecturales et des espaces aménagés
narrower: bassin de natation
narrower: club-house
narrower: piste d'athlétisme
narrower: salle du théâtre
narrower: tank à ramer
narrower: tribune du public
broader: architecture de culture recherche sport ou loisir
created: 2011-09-01T00:00:00+02:00
definition: Espace intérieur d’un édifice culturel, sportif, de recherche ou de loisir, ou construction qui lui est associée.
status: 1

jardin
type: Concept
modified: 2014-12-31T11:21:27+01:00
in scheme: Thésaurus de la désignation des œuvres architecturales et des espaces aménagés
narrower: jardin d'agrément
narrower: parc
narrower: jardin botanique
narrower: jardin d'utilité
narrower: jardin en couverture
narrower: jardin zoologique
narrower: roseraie
broader: architecture de jardin et des espaces verts
created: 2011-09-01T00:00:00+02:00
definition: Espace organisé, public ou privé, comportant des végétaux en pleine terre ou hors sol.
status: 1

construction de jardin
type: Concept
modified: 2014-12-30T16:13:34+01:00
in scheme: Thésaurus de la désignation des œuvres architecturales et des espaces aménagés
narrower: cabane de jardin
narrower: fabrique de jardin
narrower: folie
narrower: glacière
narrower: hameau de jardin
narrower: maison rustique
narrower: ménagerie
narrower: muette
narrower: nymphée
narrower: orangerie
narrower: pavillon de jardin
narrower: pont de jardin
narrower: serre
broader: architecture de jardin et des espaces verts
created: 2011-09-01T00:00:00+02:00
definition: Construction de jardin de plus ou moins grande importance destinée à servir d'abri, d'ornement, etc.
status: 1

eaux de jardin
type: Concept
modified: 2013-04-23T00:00:00+02:00
in scheme: Thésaurus de la désignation des œuvres architecturales et des espaces aménagés
narrower: pièce d'eau
narrower: chute d'eau
narrower: étang
narrower: fausse rivière
narrower: île artificielle
narrower: jeu d'eau
narrower: lac de jardin
narrower: naumachie
narrower: rivière artificielle
broader: architecture de jardin et des espaces verts
created: 2011-09-01T00:00:00+02:00
definition: Eau aménagée pour l'ornement d'un jardin, généralement grâce à un réseau hydraulique complexe alimenté par un réservoir et aboutissant à un déversoir.
status: 1

relief artificiel de jardin
type: Concept
modified: 2013-04-23T00:00:00+02:00
in scheme: Thésaurus de la désignation des œuvres architecturales et des espaces aménagés
narrower: belvédère de jardin
narrower: butte artificielle
narrower: montagne artificielle
narrower: terrasse en terre-plein
narrower: vallon artificiel
broader: architecture de jardin et des espaces verts
created: 2011-09-01T00:00:00+02:00
definition: Relief issu de la modification du site naturel par terrassement, régalage et égalisation.
status: 1

découvert de jardin
type: Concept
modified: 2013-04-23T00:00:00+02:00
in scheme: Thésaurus de la désignation des œuvres architecturales et des espaces aménagés
narrower: boulingrin
narrower: carré de jardin
narrower: clairière ornementale
narrower: massif de fleurs
narrower: parterre
narrower: pelouse
narrower: pièce de gazon
narrower: planche de jardin
narrower: plate-bande de jardin
narrower: prairie ornementale
narrower: rocaille de jardin
narrower: salle de verdure
broader: architecture de jardin et des espaces verts
created: 2011-09-01T00:00:00+02:00
definition: Ensemble des parties d'un jardin traitées en surface ou en faible élévation et souvent limitées par une bordure.
status: 1

ensemble domestique
type: Concept
modified: 2014-12-31T13:57:51+01:00
in scheme: Thésaurus de la désignation des œuvres architecturales et des espaces aménagés
narrower: campement
narrower: cité universitaire
broader: architecture domestique
created: 2011-09-01T00:00:00+02:00
related: lotissement
definition: Complexe regroupant des constructions liées au logement et aux activités domestiques.
TermeAssocie: lotissement
status: 1

partie d'édifice domestique
type: Concept
modified: 2013-04-23T00:00:00+02:00
in scheme: Thésaurus de la désignation des œuvres architecturales et des espaces aménagés
narrower: communs
narrower: logis
broader: architecture domestique
created: 2011-09-01T00:00:00+02:00
definition: Espace intérieur d’un édifice domestique ou d’un bâtiment qui lui est associé.
status: 1

ensemble fiscal ou financier
type: Concept
modified: 2013-04-23T00:00:00+02:00
in scheme: Thésaurus de la désignation des œuvres architecturales et des espaces aménagés
narrower: barrière d'octroi
broader: architecture fiscale ou financière
created: 2011-09-01T00:00:00+02:00
definition: Complexe regroupant des constructions dévolues aux activités fiscales ou financières.
status: 1

édifice financier public
type: Concept
modified: 2013-04-23T00:00:00+02:00
in scheme: Thésaurus de la désignation des œuvres architecturales et des espaces aménagés
narrower: banque de France
narrower: caisse d'épargne
narrower: cour des comptes
narrower: mont-de-piété
narrower: hôtel des monnaies
broader: architecture fiscale ou financière
created: 2011-09-01T00:00:00+02:00
related: bourse
definition: Édifice ayant vocation à émettre, à garder en sûreté ou à faire fructifier les fonds ou les valeurs qui lui sont confiés.
TermeAssocie: bourse
status: 1

édifice fiscal
type: Concept
modified: 2015-01-02T11:14:02+01:00
in scheme: Thésaurus de la désignation des œuvres architecturales et des espaces aménagés
narrower: bureau d'octroi
narrower: bureau de douane
narrower: grange aux dîmes
narrower: grenier à sel
narrower: maison aux dîmes
broader: architecture fiscale ou financière
alternative label: hôtel des impôts
alternative label: perception
created: 2011-09-01T00:00:00+02:00
definition: Édifice de l'administration chargée du calcul et du recouvrement des impôts directs.
status: 1

ensemble hospitalier d'assistance ou de protection sociale
type: Concept
modified: 2013-04-23T00:00:00+02:00
in scheme: Thésaurus de la désignation des œuvres architecturales et des espaces aménagés
narrower: centre hospitalier universitaire
broader: architecture hospitalière d'assistance ou de protection sociale
created: 2011-09-01T00:00:00+02:00
definition: Complexe regroupant des constructions consacrées aux activités hospitalières, d'assistance ou de protection sociale.
status: 1

édifice hospitalier d'assistance ou de protection sociale
type: Concept
modified: 2013-04-23T00:00:00+02:00
in scheme: Thésaurus de la désignation des œuvres architecturales et des espaces aménagés
narrower: édifice d'assistance ou de protection sociale
narrower: édifice hospitalier
broader: architecture hospitalière d'assistance ou de protection sociale
created: 2011-09-01T00:00:00+02:00
definition: Construction ou groupe de constructions abritant des activités hospitalières, d'assistance ou de protection sociale.
status: 1

ensemble industriel
type: Concept
modified: 2015-04-13T12:26:13+02:00
in scheme: Thésaurus de la désignation des œuvres architecturales et des espaces aménagés
narrower: ensemble d'industrie agro-alimentaire
narrower: ensemble d'industrie céramique
narrower: ensemble d'industrie chimique
narrower: ensemble d'industrie du bois
narrower: ensemble d'industrie du papier
narrower: ensemble d'industrie extractive
narrower: ensemble d'industrie verrière
narrower: ensemble de construction mécanique
narrower: ensemble de construction électrique
narrower: ensemble de construction électronique
narrower: ensemble de fabrication de matériaux de construction
narrower: ensemble métallurgique
narrower: ensemble de mécanique de précision
narrower: ensemble de petite métallurgie
narrower: ensemble générateur d'énergie
narrower: ensemble textile
broader: architecture industrielle
created: 2011-09-01T00:00:00+02:00
definition: Ensemble constitué d'usines.
status: 1

usine
type: Concept
modified: 2015-02-09T15:23:28+01:00
in scheme: Thésaurus de la désignation des œuvres architecturales et des espaces aménagés
narrower: usine textile
narrower: usine de produits agro-alimentaires
narrower: usine de fabrication de matériaux de construction
narrower: usine de céramique
narrower: usine liée au travail du bois
narrower: usine de construction électrique
narrower: usine d'extraction
narrower: usine de papeterie
narrower: usine génératrice d'énergie
narrower: usine de peausserie
narrower: usine de petite métallurgie
narrower: verrerie
narrower: usine d'habillement
narrower: usine d'impression sur papier
narrower: moulin
narrower: usine de produits chimiques
narrower: usine métallurgique
narrower: usine de construction mécanique
narrower: usine de mécanique de précision
narrower: usine de construction électronique
broader: architecture industrielle
alternative label: édifice industriel
created: 2011-09-01T00:00:00+02:00
scope note: L'artisanat se distingue de l'industrie par les caractères suivants : petit nombre d'ouvriers, degré de mécanisation peu élevé, pas de production en grande série et généralement pas de commercialisation du produit hors d'une aire géographique restreinte.
definition: Établissement industriel équipé de machines et destiné soit à la transformation des matières premières ou semi-ouvrées en produits finis, soit à la production d'énergie.
status: 1

ensemble judiciaire pénitentiaire ou de police
type: Concept
modified: 2013-04-23T00:00:00+02:00
in scheme: Thésaurus de la désignation des œuvres architecturales et des espaces aménagés
narrower: bagne
narrower: camp de concentration
narrower: colonie pénitentiaire
broader: architecture judiciaire pénitentiaire ou de police
created: 2011-09-01T00:00:00+02:00
definition: Complexe regroupant des constructions liées aux activités policières, judiciaires ou pénitentiaires.
status: 1

édifice judiciaire pénitentiaire ou de police
type: Concept
modified: 2013-04-23T00:00:00+02:00
in scheme: Thésaurus de la désignation des œuvres architecturales et des espaces aménagés
narrower: commissariat de police
narrower: prison
narrower: tribunal
broader: architecture judiciaire pénitentiaire ou de police
created: 2011-09-01T00:00:00+02:00
definition: Construction ou groupe de constructions abritant des activités judiciaires, pénitentiaires ou de police.
status: 1

édicule judiciaire pénitentiaire ou de police
type: Concept
modified: 2013-04-23T00:00:00+02:00
in scheme: Thésaurus de la désignation des œuvres architecturales et des espaces aménagés
narrower: gibet
narrower: mirador
narrower: pilori
broader: architecture judiciaire pénitentiaire ou de police
created: 2011-09-01T00:00:00+02:00
definition: Édicule lié aux activités policières, judiciaires ou pénitentiaires.
status: 1

partie d'édifice judiciaire pénitentiaire ou de police
type: Concept
modified: 2013-04-23T00:00:00+02:00
in scheme: Thésaurus de la désignation des œuvres architecturales et des espaces aménagés
narrower: salle d'audience
broader: architecture judiciaire pénitentiaire ou de police
created: 2011-09-01T00:00:00+02:00
definition: Espace intérieur d’un édifice judiciaire, pénitentiaire ou de police, ou bâtiment qui lui est associé.
status: 1

ensemble militaire
type: Concept
modified: 2013-04-23T00:00:00+02:00
in scheme: Thésaurus de la désignation des œuvres architecturales et des espaces aménagés
narrower: base militaire
narrower: champ de bataille
narrower: ensemble castral
narrower: fortification
narrower: polygone de tir
broader: architecture militaire
created: 2011-09-01T00:00:00+02:00
definition: Complexe regroupant des constructions liées aux activités militaires.
status: 1

édifice militaire
type: Concept
modified: 2015-01-05T11:57:11+01:00
in scheme: Thésaurus de la désignation des œuvres architecturales et des espaces aménagés
narrower: édifice logistique
narrower: édifice fortifié
broader: architecture militaire
created: 2011-09-01T00:00:00+02:00
definition: Édifice lié à la surveillance et à la défense d'un territoire.
status: 1

ouvrage militaire
type: Concept
modified: 2015-01-05T13:34:30+01:00
in scheme: Thésaurus de la désignation des œuvres architecturales et des espaces aménagés
narrower: ouvrage fortifié
narrower: poste d'observation
narrower: rampe de lancement
broader: architecture militaire
alternative label: édicule militaire
created: 2011-09-01T00:00:00+02:00
definition: Construction utilisée à des fins militaires (fortification, observation, etc.).
status: 1

ensemble commémoratif
type: Concept
modified: 2015-02-24T16:29:52+01:00
in scheme: Thésaurus de la désignation des œuvres architecturales et des espaces aménagés
broader: architecture monumentale commémorative funéraire et votive
created: 2011-09-01T00:00:00+02:00
definition: Ensemble formé d'édifices ou d'édicules commémoratifs.
status: 1

ensemble funéraire
type: Concept
modified: 2013-04-23T00:00:00+02:00
in scheme: Thésaurus de la désignation des œuvres architecturales et des espaces aménagés
preferred label: funerary buildings + complexes @en-us
preferred label: funerary site @en-gb
narrower: cimetière
narrower: enclos funéraire
narrower: nécropole
broader: architecture monumentale commémorative funéraire et votive
created: 2011-09-01T00:00:00+02:00
definition: Ensemble formé d'édicules ou d'édifices funéraires.
status: 1

édifices et édicules funéraires
type: Concept
modified: 2013-04-23T00:00:00+02:00
in scheme: Thésaurus de la désignation des œuvres architecturales et des espaces aménagés
preferred label: funerary buildings @en-us
preferred label: funerary building @en-gb
narrower: monument funéraire
narrower: charnier
narrower: columbarium
narrower: crématorium
narrower: enfeu
narrower: funérarium
narrower: grotte sépulcrale
narrower: lanterne des morts
narrower: morgue
narrower: ossuaire
narrower: pierre des morts
broader: architecture monumentale commémorative funéraire et votive
created: 2011-09-01T00:00:00+02:00
definition: Construction ou groupe de constructions abritant les corps des défunts, les activités, les rites, etc. liés à la mort.
status: 1

édicule religieux
type: Concept
modified: 2013-04-23T00:00:00+02:00
in scheme: Thésaurus de la désignation des œuvres architecturales et des espaces aménagés
preferred label: religious structures @en-us
preferred label: religious (other structures) @en-gb
narrower: édicule religieux chrétien
broader: architecture religieuse
created: 2011-09-01T00:00:00+02:00
definition: Construction autonome non habitable à fonction religieuse.
status: 1

partie d'édifice religieux
type: Concept
modified: 2013-04-23T00:00:00+02:00
in scheme: Thésaurus de la désignation des œuvres architecturales et des espaces aménagés
narrower: partie d'église
narrower: hôtellerie
narrower: piscine baptismale
narrower: bâtiment conventuel
narrower: logis abbatial
narrower: logis prieural
narrower: piscine de pèlerinage
narrower: salle synodale
broader: architecture religieuse
created: 2011-09-01T00:00:00+02:00
definition: Partie d’un édifice religieux ou d’un bâtiment qui lui est associé.
status: 1

édifice religieux
type: Concept
modified: 2013-04-23T00:00:00+02:00
in scheme: Thésaurus de la désignation des œuvres architecturales et des espaces aménagés
preferred label: religious buildings @en-us
narrower: grotte ornée
narrower: bains rituels
narrower: édifice religieux chrétien
narrower: lieu de prière
narrower: mosquée
narrower: synagogue
narrower: temple antique
narrower: temple bouddhiste
narrower: temple hindouiste
broader: architecture religieuse
alternative label: sanctuaire
created: 2011-09-01T00:00:00+02:00
definition: Construction ou groupe de constructions où se réunissent les pratiquants d'une religion pour prier, célébrer un culte, participer à un rituel, etc.
status: 1

ensemble scolaire
type: Concept
modified: 2013-04-23T00:00:00+02:00
in scheme: Thésaurus de la désignation des œuvres architecturales et des espaces aménagés
narrower: campus universitaire
broader: architecture scolaire
created: 2011-09-01T00:00:00+02:00
definition: Complexe regroupant des constructions consacrées aux activités scolaires (enseignements général, sportif, artistique, etc.), logements et restauration des enseignants et des élèves.
status: 1

édifice scolaire
type: Concept
modified: 2014-12-01T15:26:22+01:00
in scheme: Thésaurus de la désignation des œuvres architecturales et des espaces aménagés
narrower: édifice d'enseignement supérieur
narrower: école
broader: architecture scolaire
alternative label: édifice d'enseignement
created: 2011-09-01T00:00:00+02:00
definition: Construction ou groupe de constructions abritant des activités scolaires, principalement les activités d'enseignement.
status: 1

centre d'archives
type: Concept
modified: 2014-12-12T14:40:02+01:00
in scheme: Thésaurus de la désignation des œuvres architecturales et des espaces aménagés
preferred label: archives (buildings) @en-us
broader: édifice et aménagement de culture recherche sport ou loisir
created: 2011-09-01T00:00:00+02:00
definition: Édifice où sont déposées, classées et conservées les archives ou collections de pièces et documents anciens. Il peut abriter une salle de consultation.
status: 1

ardoisière
type: Concept
modified: 2015-01-21T15:30:46+01:00
in scheme: Thésaurus de la désignation des œuvres architecturales et des espaces aménagés
broader: carrière
created: 2011-09-01T00:00:00+02:00
definition: Carrière d'ardoise, comprenant généralement une excavation et une aire des déchets et, pour l'exploitation en galeries souterraines, un puits d'extraction, un chevalement, etc.
status: 1

carrière
type: Concept
modified: 2015-01-15T16:39:54+01:00
in scheme: Thésaurus de la désignation des œuvres architecturales et des espaces aménagés
preferred label: quarries @en-us
narrower: ardoisière
narrower: carrière souterraine
broader: usine d'extraction
created: 2011-09-01T00:00:00+02:00
related: excavation
definition: Usine d'extraction de matériaux de construction (schiste ardoisier, pierre, marbre, sable, etc.), comprenant généralement une excavation, un atelier de concassage, etc.
TermeAssocie: excavation
status: 1

jeu de l'arquebuse
type: Concept
modified: 2014-10-17T15:53:27+02:00
in scheme: Thésaurus de la désignation des œuvres architecturales et des espaces aménagés
broader: établissement de tir
created: 2011-09-01T00:00:00+02:00
definition: Espace aménagé pour la pratique du tir à l'arquebuse, et comportant habituellement un bâtiment servant de lieu de réunion et de festivités aux arquebusiers et des « buttes », parfois architecturées, sur lesquelles sont fixées les cibles.
status: 1

établissement de tir
type: Concept
modified: 2014-10-17T15:51:01+02:00
in scheme: Thésaurus de la désignation des œuvres architecturales et des espaces aménagés
preferred label: shooting ranges @en-us
narrower: jeu de l'arquebuse
narrower: jeu d'arc
broader: édifice sportif
alternative label: stand de tir
created: 2011-09-01T00:00:00+02:00
definition: Espace aménagé où l'on pratique le tir sportif à la cible.
status: 1

arsenal
type: Concept
modified: 2015-01-05T11:31:14+01:00
in scheme: Thésaurus de la désignation des œuvres architecturales et des espaces aménagés
preferred label: arsenals @en-us
broader: édifice logistique
created: 2011-09-01T00:00:00+02:00
definition: Atelier de fabrication et de réparation ou simple dépôt pour les armes et les munitions. L'arsenal est un local compris dans un ensemble ou un édifice, fortifié ou non. Dans le domaine maritime, établissement d'État chargé de la construction, de l'entretien et de la réparation des navires.
status: 1

édifice logistique
type: Concept
modified: 2015-01-05T11:52:04+01:00
in scheme: Thésaurus de la désignation des œuvres architecturales et des espaces aménagés
narrower: arsenal
narrower: caserne
narrower: corps de garde
narrower: magasin de fourrage
narrower: magasin de munitions
narrower: poudrière
narrower: station radar
broader: édifice militaire
created: 2011-09-01T00:00:00+02:00
definition: Édifice militaire abritant les activités liées au transport, au ravitaillement ou au logement des troupes.
status: 1

ascenseur
type: Concept
modified: 2015-02-25T12:40:42+01:00
in scheme: Thésaurus de la désignation des œuvres architecturales et des espaces aménagés
preferred label: elevators @en-us
broader: éléments de circulation
alternative label: monte-charge
alternative label: cage d'ascenseur
created: 2011-09-01T00:00:00+02:00
definition: Ouvrage mécanique de circulation verticale, généralement composé d'une cabine, se mouvant dans une cage et permettant de passer d'un plan à un autre.
status: 1

éléments de circulation
type: Concept
modified: 2013-04-23T00:00:00+02:00
in scheme: Thésaurus de la désignation des œuvres architecturales et des espaces aménagés
narrower: ascenseur
narrower: couloir
narrower: coursière
narrower: escalier
narrower: galerie technique
narrower: passage d'entrée
narrower: porche
narrower: rampe d'accès
narrower: salle des pas perdus
narrower: tapis roulant
narrower: toboggan de manutention
broader: partie ou élément commun à tous les types d'architecture et aux espaces aménagés
created: 2011-09-01T00:00:00+02:00
definition: Partie d’édifice ou ouvrage parfois mécanisé, en bois, en maçonnerie, en métal, etc., permettant une circulation horizontale ou verticale.
status: 1

ascenseur indépendant
type: Concept
modified: 2014-10-23T12:39:06+02:00
in scheme: Thésaurus de la désignation des œuvres architecturales et des espaces aménagés
broader: ouvrage d'art
alternative label: ascenseur public
created: 2011-09-01T00:00:00+02:00
definition: Ascenseur non inclus dans un édifice, permettant un changement de niveau dans l’espace public.
status: 1
broad match: http://data.bnf.fr/ark:/12148/cb11944345f
broad match: Ascenseur

asile d'aliénés
type: Concept
modified: 2015-01-02T12:01:23+01:00
in scheme: Thésaurus de la désignation des œuvres architecturales et des espaces aménagés
preferred label: psychiatric hospitals @en-us
broader: hôpital
alternative label: hôpital psychiatrique
created: 2011-09-01T00:00:00+02:00
scope note: Ne pas confondre avec salle d'asile.
related: quartier d'aliénés
definition: Établissement hospitalier destiné au traitement des malades mentaux.
TermeAssocie: quartier d'aliénés
status: 1

quartier d'aliénés
type: Concept
modified: 2015-01-02T12:35:11+01:00
in scheme: Thésaurus de la désignation des œuvres architecturales et des espaces aménagés
broader: partie d'édifice hospitalier d'assistance ou de protection sociale
created: 2011-09-01T00:00:00+02:00
related: asile d'aliénés
definition: Partie d'un hôpital ou d'un hospice, nettement séparée des corps de bâtiment principaux, accueillant exclusivement les malades mentaux et généralement constituée de bâtiments bas distribués autour de cours fermées.
TermeAssocie: asile d'aliénés
status: 1

hôpital
type: Concept
modified: 2015-01-02T12:22:42+01:00
in scheme: Thésaurus de la désignation des œuvres architecturales et des espaces aménagés
preferred label: hospitals @en-us
narrower: asile d'aliénés
narrower: hôpital d'isolement
narrower: maternité
broader: édifice hospitalier
alternative label: centre hospitalier
alternative label: hôtel-Dieu
created: 2011-09-01T00:00:00+02:00
definition: Établissement dans lequel sont associés des services de médecine et de chirurgie générales à des services relevant des principales spécialités médico-chirurgicales ainsi qu'à des laboratoires. Quelle que soit sa taille, il abrite généralement une morgue et un lieu de prière (chapelle, etc.). Les différents services peuvent être répartis dans un ensemble de bâtiments ou sous un toit unique.
status: 1

atelier
type: Concept
modified: 2014-12-04T15:07:12+01:00
in scheme: Thésaurus de la désignation des œuvres architecturales et des espaces aménagés
preferred label: workshop @en-us
broader: édifice artisanal commercial ou tertiaire
created: 2011-09-01T00:00:00+02:00
scope note: Pour les parties d'édifices industriels, employer : atelier de fabrication, atelier de réparation, etc.
definition: Local destiné à la production ou la réparation d'objets manufacturés.
status: 1

atelier d'artiste
type: Concept
modified: 2014-12-12T14:28:45+01:00
in scheme: Thésaurus de la désignation des œuvres architecturales et des espaces aménagés
preferred label: studios (work spaces) @en-us
broader: édifice et aménagement de culture recherche sport ou loisir
created: 2011-09-01T00:00:00+02:00
definition: Édifice ou partie d'édifice dont les caractéristiques (surface, éclairage, etc.) facilitent le travail d'un artiste.
status: 1

atelier de charité
type: Concept
modified: 2014-10-14T15:21:23+02:00
in scheme: Thésaurus de la désignation des œuvres architecturales et des espaces aménagés
broader: établissement de bienfaisance
created: 2011-09-01T00:00:00+02:00
definition: Établissement municipal destiné à procurer du travail et des moyens momentanés d'existence à des indigents.
status: 1

établissement de bienfaisance
type: Concept
modified: 2015-01-02T11:33:51+01:00
in scheme: Thésaurus de la désignation des œuvres architecturales et des espaces aménagés
preferred label: welfare buildings @en-us
narrower: atelier de charité
narrower: aumônerie
narrower: hôpital général
narrower: orphelinat
narrower: ouvroir
broader: édifice d'assistance ou de protection sociale
alternative label: maison de charité
alternative label: établissement de charité
alternative label: bureau de bienfaisance
created: 2011-09-01T00:00:00+02:00
definition: Etablissement d'assistance privé ou public.
status: 1

atelier de conditionnement
type: Concept
modified: 2015-03-24T15:57:43+01:00
in scheme: Thésaurus de la désignation des œuvres architecturales et des espaces aménagés
broader: parties industrielles
created: 2011-09-01T00:00:00+02:00
definition: Bâtiment ou local de l'usine où l'on effectue la préparation du produit en vue de son expédition et de sa vente.
status: 1

atelier de fabrication
type: Concept
modified: 2015-03-24T16:19:25+01:00
in scheme: Thésaurus de la désignation des œuvres architecturales et des espaces aménagés
broader: parties industrielles
created: 2011-09-01T00:00:00+02:00
definition: Bâtiment ou local de l'usine où l'on effectue les différentes opérations de fabrication du produit.
status: 1

atelier de réparation
type: Concept
modified: 2015-03-25T11:11:43+01:00
in scheme: Thésaurus de la désignation des œuvres architecturales et des espaces aménagés
broader: parties industrielles
created: 2011-09-01T00:00:00+02:00
definition: Bâtiment ou local de l'usine où l'on effectue les différentes opérations de réparation ou d'entretien des moteurs et des machines de production.
status: 1

atrium
type: Concept
modified: 2015-02-25T11:49:41+01:00
in scheme: Thésaurus de la désignation des œuvres architecturales et des espaces aménagés
preferred label: atriums @en-us
broader: cour
created: 2011-09-01T00:00:00+02:00
definition: Dans l'architecture domestique antique, grand espace semi-découvert placé derrière le vestibule, commandant toute la distribution et servant de lieu de réunion. Un bassin central permettait de recueillir les eaux de pluie. Dans l'architecture religieuse, cour entourée de portiques, placée devant la façade antérieure ou, plus rarement, derrière le chevet d'une église.
status: 1

cour
type: Concept
modified: 2015-02-25T11:45:35+01:00
in scheme: Thésaurus de la désignation des œuvres architecturales et des espaces aménagés
preferred label: courtyards @en-us
narrower: atrium
broader: partie ou élément commun à tous les types d'architecture et aux espaces aménagés
alternative label: cour d'honneur
created: 2011-09-01T00:00:00+02:00
related: basse-cour
definition: Terrain délimité par des bâtiments ou des corps de bâtiment. La cour ouverte n'est pas délimitée sur un de ses côtés, ou seulement délimitée par un élément de clôture qui ne fait pas obstacle à la vue (fossé, grille, etc.). La cour peut être fermée.
TermeAssocie: basse-cour
status: 1

auberge
type: Concept
modified: 2014-12-04T15:08:53+01:00
in scheme: Thésaurus de la désignation des œuvres architecturales et des espaces aménagés
preferred label: inns @en-us
broader: édifice artisanal commercial ou tertiaire
created: 2011-09-01T00:00:00+02:00
scope note: Ne pas confondre avec hôtellerie.
definition: Édifice commercial destiné à loger les voyageurs et éventuellement à les nourrir.
status: 1

auberge de jeunesse
type: Concept
modified: 2014-12-12T14:29:40+01:00
in scheme: Thésaurus de la désignation des œuvres architecturales et des espaces aménagés
preferred label: youth hostels @en-us
broader: édifice et aménagement de culture recherche sport ou loisir
created: 2011-09-01T00:00:00+02:00
definition: Centre d'accueil hébergeant temporairement les jeunes voyageurs pour une somme modique.
status: 1

auditorium
type: Concept
modified: 2014-10-10T12:00:55+02:00
in scheme: Thésaurus de la désignation des œuvres architecturales et des espaces aménagés
preferred label: auditoriums @en-us
broader: salle de spectacle
created: 2011-09-01T00:00:00+02:00
definition: Édifice ou partie d'édifice abritant une salle destinée à accueillir des événements comme des concerts, des représentations théâtrales, des colloques, etc. et comportant souvent une scène et des gradins.
status: 1

aumônerie
type: Concept
modified: 2015-01-02T11:23:11+01:00
in scheme: Thésaurus de la désignation des œuvres architecturales et des espaces aménagés
preferred label: almshouses @en-us
broader: établissement de bienfaisance
created: 2011-09-01T00:00:00+02:00
related: hôtellerie
definition: Établissement médiéval d'assistance, souvent dépendant d'une abbaye ou d'une paroisse, destiné à l'hébergement et aux soins gratuits des pèlerins, des pauvres ou des malades. Dans un établissement conventuel, local aménagé pour recevoir les pauvres qui n’y séjournent pas.
TermeAssocie: hôtellerie
status: 1
broad match: cb13318795p

hôtellerie
type: Concept
modified: 2014-11-28T14:55:56+01:00
in scheme: Thésaurus de la désignation des œuvres architecturales et des espaces aménagés
preferred label: foresteria @it
preferred label: guest house @en-gb
preferred label: guesthouses @en-us
broader: partie d'édifice religieux
created: 2011-09-01T00:00:00+02:00
scope note: Ne pas confondre avec hôtel de voyageurs.
related: aumônerie
definition: Partie d'un établissement conventuel réservée à l'hébergement des hôtes.
TermeAssocie: aumônerie
status: 1

autoroute
type: Concept
modified: 2015-01-07T12:25:08+01:00
in scheme: Thésaurus de la désignation des œuvres architecturales et des espaces aménagés
preferred label: motorway @en-gb
preferred label: highways @en-us
broader: voie
alternative label: voie rapide
created: 2011-09-01T00:00:00+02:00
scope note: Quand la circulation sur l'autoroute est payante, cette dernière est ponctuée de stations de péage.
related: station de péage
definition: Artère réservée aux seuls véhicules motorisés, dont la chaussée, dédoublée par un séparateur de voie, comporte au moins quatre couloirs de circulation. Elle est reliée à la voirie ordinaire par des échangeurs.
TermeAssocie: station de péage
status: 1

station de péage
type: Concept
modified: 2014-10-09T11:38:01+02:00
in scheme: Thésaurus de la désignation des œuvres architecturales et des espaces aménagés
preferred label: tollbooths @en-us
broader: édifice artisanal commercial ou tertiaire
alternative label: péage
created: 2011-09-01T00:00:00+02:00
related: autoroute
definition: Installations permettant la perception d'un droit d'entrée sur une voie destinée à la circulation, généralement pont, tunnel ou autoroute.
TermeAssocie: autoroute
status: 1

avant-port
type: Concept
modified: 2014-12-01T13:28:01+01:00
in scheme: Thésaurus de la désignation des œuvres architecturales et des espaces aménagés
broader: port
created: 2011-09-01T00:00:00+02:00
definition: Sur une côte, partie du port formant rade, limitée par des digues et placée devant les ouvrages intérieurs que constituent les bassins.
status: 1

port
type: Concept
modified: 2014-12-01T13:26:26+01:00
in scheme: Thésaurus de la désignation des œuvres architecturales et des espaces aménagés
preferred label: ports @en-us
narrower: avant-port
broader: ensemble du génie civil
created: 2011-09-01T00:00:00+02:00
related: bassin de port
related: établissement portuaire
related: entrée de port
definition: Site aménagé sur une côte ou sur une voie navigable pour l'exercice permanent de diverses fonctions liées aux activités maritimes ou fluviales (port de plaisance, de pêche, etc.).
TermeAssocie: bassin de port
TermeAssocie: établissement portuaire
TermeAssocie: entrée de port
status: 1

avenue
type: Concept
modified: 2015-01-07T12:29:45+01:00
in scheme: Thésaurus de la désignation des œuvres architecturales et des espaces aménagés
preferred label: avenues @en-us
preferred label: viale urbano @it
preferred label: avenue (road) @en-gb
broader: voie
created: 2011-09-01T00:00:00+02:00
definition: Artère, bordée ou non d'arbres et généralement de bâtiments, disposée de façon radiale par rapport au centre d'une agglomération.
status: 1

avenue de jardin
type: Concept
modified: 2014-10-14T09:29:41+02:00
in scheme: Thésaurus de la désignation des œuvres architecturales et des espaces aménagés
broader: clôture et circulation de jardin
created: 2011-09-01T00:00:00+02:00
definition: Voie privée, carrossable, longue et large, souvent bordée d'arbres, précédant l'entrée d'un jardin. Elle présente en général un tracé rectiligne.
status: 1

aménagement de bac
type: Concept
modified: 2014-10-23T12:36:05+02:00
in scheme: Thésaurus de la désignation des œuvres architecturales et des espaces aménagés
broader: ouvrage d'art
created: 2011-09-01T00:00:00+02:00
definition: Aménagement établi sur les deux rives d'un cours d'eau, sur le rivage d'un lac, etc., permettant à un bateau traversier, d'accoster, d’embarquer et débarquer personnes, animaux ou véhicules. Dans un bac à traille, l’aménagement comprend également un câble ou traille assurant le guidage du bateau. La traille est généralement soutenue par des chevalets en maçonnerie ou en charpente.
status: 1

bagne
type: Concept
modified: 2015-01-05T10:50:45+01:00
in scheme: Thésaurus de la désignation des œuvres architecturales et des espaces aménagés
preferred label: penal colonies @en-us
broader: ensemble judiciaire pénitentiaire ou de police
alternative label: pénitentier
created: 2011-09-01T00:00:00+02:00
definition: Établissement pénitentiaire où sont internés les forçats condamnés à des peines de longue durée.
status: 1

baie
type: Concept
modified: 2015-02-24T16:40:39+01:00
in scheme: Thésaurus de la désignation des œuvres architecturales et des espaces aménagés
preferred label: openings (architectural elements) @en-us
narrower: fenêtre
narrower: niche
narrower: porte
narrower: rose d'architecture
broader: partie ou élément commun à tous les types d'architecture et aux espaces aménagés
created: 2011-09-01T00:00:00+02:00
definition: Ouverture de fonction quelconque, ménagée dans un mur ou une paroi, et son encadrement.
status: 1

fenêtre
type: Concept
modified: 2015-02-24T16:47:04+01:00
in scheme: Thésaurus de la désignation des œuvres architecturales et des espaces aménagés
preferred label: windows @en-us
broader: baie
created: 2011-09-01T00:00:00+02:00
scope note: Ne pas appeler fenêtre une baie sans huisserie. Voir aussi le Thesaurus des objets mobiliers.
definition: Baie ou groupement de baies dans un plan vertical, muni d'une huisserie et donnant du jour à l'intérieur d'un bâtiment.
status: 1

niche
type: Concept
modified: 2015-02-24T16:49:09+01:00
in scheme: Thésaurus de la désignation des œuvres architecturales et des espaces aménagés
preferred label: niches @en-us
broader: baie
created: 2011-09-01T00:00:00+02:00
scope note: Voir aussi le Thesaurus des objets mobiliers.
related: enfeu
related: niche-crédence
definition: Renfoncement dans l'épaisseur d'un mur, théoriquement destiné à recevoir un élément décoratif, et son encadrement.
TermeAssocie: enfeu
TermeAssocie: niche-crédence
status: 1

porte
type: Concept
modified: 2015-02-24T16:50:20+01:00
in scheme: Thésaurus de la désignation des œuvres architecturales et des espaces aménagés
preferred label: doors @en-us
narrower: portail
broader: baie
created: 2011-09-01T00:00:00+02:00
scope note: Voir aussi le Thesaurus des objets mobiliers.
definition: Baie de communication fermée par des vantaux. La porte se distingue des autres baies formant communication, comme certaines arcades, par sa fonction précise dans la distribution.
status: 1

rose d'architecture
type: Concept
modified: 2014-10-16T10:49:33+02:00
in scheme: Thésaurus de la désignation des œuvres architecturales et des espaces aménagés
preferred label: rose windows @en-us
broader: baie
created: 2011-09-01T00:00:00+02:00
scope note: Voir aussi le Thesaurus des objets mobiliers.
definition: Baie ou élément de baie généralement circulaire, à réseau, d'un diamètre dépassant 50 cm.
status: 1

bains douches
type: Concept
modified: 2014-10-10T10:24:51+02:00
in scheme: Thésaurus de la désignation des œuvres architecturales et des espaces aménagés
broader: bains publics
created: 2011-09-01T00:00:00+02:00
definition: Bains publics municipaux, où l'on vient essentiellement pour se laver.
status: 1
broad match: http://vocab.getty.edu/aat/300007353
broad match: cb11978599h

bains publics
type: Concept
modified: 2014-12-18T15:10:53+01:00
in scheme: Thésaurus de la désignation des œuvres architecturales et des espaces aménagés
preferred label: public baths @en-us
narrower: bains douches
broader: établissement de bains
created: 2011-09-01T00:00:00+02:00
definition: Établissement d'hygiène permettant à la clientèle de se laver, de se détendre et de laver son linge.
status: 1

établissement de bains
type: Concept
modified: 2014-09-08T11:48:18+02:00
in scheme: Thésaurus de la désignation des œuvres architecturales et des espaces aménagés
narrower: bains publics
narrower: établissement thermal
broader: édifice et aménagement de culture recherche sport ou loisir
created: 2011-09-01T00:00:00+02:00
scope note: Ne pas confondre avec piscine.
definition: Édifice où l'on peut se baigner ou se laver.
status: 1
broad match: http://vocab.getty.edu/aat/300007353

bains rituels
type: Concept
modified: 2014-10-15T13:36:20+02:00
in scheme: Thésaurus de la désignation des œuvres architecturales et des espaces aménagés
preferred label: cantaro @it
preferred label: Jewish ritual bath @en-gb
preferred label: mikvehs @en-us
broader: édifice religieux
alternative label: mikyé
created: 2011-09-01T00:00:00+02:00
related: piscine baptismale
definition: Lieu où l'on pratique des ablutions rituelles, notamment dans le culte juif.
TermeAssocie: piscine baptismale
status: 1

piscine baptismale
type: Concept
modified: 2014-10-15T14:04:36+02:00
in scheme: Thésaurus de la désignation des œuvres architecturales et des espaces aménagés
preferred label: immersion font @en-gb
preferred label: baptismal fonts @en-us
broader: partie d'édifice religieux
created: 2011-09-01T00:00:00+02:00
scope note: Ne pas confondre avec piscine.
related: bains rituels
definition: Bassin où l’on pratique le baptême par immersion.
TermeAssocie: bains rituels
status: 1

balcon
type: Concept
modified: 2015-02-25T10:14:33+01:00
in scheme: Thésaurus de la désignation des œuvres architecturales et des espaces aménagés
preferred label: balconies @en-us
broader: élévation
created: 2011-09-01T00:00:00+02:00
scope note: Ne pas confondre avec coursière en surplomb, ni avec tribune découverte. Voir aussi le Thesaurus des objets mobiliers.
definition: Élément d’élévation formé d’une étroite plate-forme à garde-corps, en surplomb devant une ou plusieurs baies.
status: 1

élévation
type: Concept
modified: 2015-02-25T13:59:46+01:00
in scheme: Thésaurus de la désignation des œuvres architecturales et des espaces aménagés
preferred label: elevations @en-us
narrower: balcon
narrower: élévation intérieure
narrower: oriel
broader: partie ou élément commun à tous les types d'architecture et aux espaces aménagés
alternative label: façade
alternative label: élévation extérieure
created: 2011-09-01T00:00:00+02:00
definition: Face verticale d'un bâtiment ou d'un corps de bâtiment.
status: 1

banc public
type: Concept
modified: 2015-02-24T11:39:36+01:00
in scheme: Thésaurus de la désignation des œuvres architecturales et des espaces aménagés
preferred label: benches @en-us
broader: édicule de l'administration ou de la vie publique
created: 2011-09-01T00:00:00+02:00
scope note: Ne pas confondre avec un banc extérieur disposé en façade d’une demeure. Voir aussi le Thesaurus des objets mobiliers.
definition: Siège à plusieurs places, fixé au sol, situé le long d'une allée, d'un trottoir, etc. ou dans un parc, un jardin public, etc.
status: 1

bande cyclable
type: Concept
modified: 2014-10-17T14:52:09+02:00
in scheme: Thésaurus de la désignation des œuvres architecturales et des espaces aménagés
broader: piste cyclable
created: 2011-09-01T00:00:00+02:00
definition: Aménagement réservé aux bicyclettes et cyclomoteurs, compris dans une voie, généralement placée latéralement et délimitée par un marquage au sol.
status: 1
broad match: cb11980836q
broad match: http://vocab.getty.edu/aat/300008324

piste cyclable
type: Concept
modified: 2015-01-07T13:18:35+01:00
in scheme: Thésaurus de la désignation des œuvres architecturales et des espaces aménagés
preferred label: cycle path @en-gb
preferred label: bicycle paths @en-us
narrower: bande cyclable
broader: voie
created: 2011-09-01T00:00:00+02:00
definition: Voie indépendante ou matériellement séparée de l’artère qu’elle longe, réservée aux bicyclettes et cyclomoteurs.
status: 1

banlieue
type: Concept
modified: 2014-10-17T14:52:57+02:00
in scheme: Thésaurus de la désignation des œuvres architecturales et des espaces aménagés
narrower: faubourg
narrower: périphérie
broader: secteur urbain
created: 2011-09-01T00:00:00+02:00
definition: Secteur urbain, plus ou moins étendu, qui entoure une ville en incluant ses faubourgs et sa périphérie, et qui dépend d'elle pour une ou plusieurs de ses fonctions.
status: 1
narrow match: http://vocab.getty.edu/aat/300000874

secteur urbain
type: Concept
modified: 2015-01-09T12:14:58+01:00
in scheme: Thésaurus de la désignation des œuvres architecturales et des espaces aménagés
preferred label: districts @en-us
narrower: banlieue
narrower: quartier
narrower: ensemble d'édifices à cour commune
narrower: ensemble d'édifices à desserte commune
narrower: ensemble d'édifices derrière façade
narrower: front bâti
narrower: secteur urbain concerté
narrower: îlot
broader: urbanisme et espaces aménagés
created: 2011-09-01T00:00:00+02:00
definition: Partie d'une agglomération, comprenant généralement plusieurs quartiers.
status: 1

faubourg
type: Concept
modified: 2015-01-08T10:15:47+01:00
in scheme: Thésaurus de la désignation des œuvres architecturales et des espaces aménagés
preferred label: sobborgo @it
preferred label: suburbs @en-us
preferred label: suburb @en-gb
broader: banlieue
created: 2011-09-01T00:00:00+02:00
definition: À l'origine, quartier développé à l'extérieur de l'enceinte d'une ville, généralement le long d'une voie conduisant à une porte. Par extension, quartier situé à l'extérieur d'un boulevard ou au-delà d’une barrière d’octroi enserrant un centre ancien.
status: 1
broad match: http://data.bnf.fr/ark:/12148/cb119382735

périphérie
type: Concept
modified: 2014-10-17T15:04:01+02:00
in scheme: Thésaurus de la désignation des œuvres architecturales et des espaces aménagés
preferred label: urban fringes @en-us
broader: banlieue
created: 2011-09-01T00:00:00+02:00
definition: Partie la plus excentrée d'une banlieue, caractérisée par une urbanisation moins dense ou en cours d'urbanisation.
status: 1
broad match: http://data.bnf.fr/ark:/12148/cb119382735

banque
type: Concept
modified: 2014-12-04T15:10:17+01:00
in scheme: Thésaurus de la désignation des œuvres architecturales et des espaces aménagés
preferred label: banks (financial institutions) @en-us
broader: édifice artisanal commercial ou tertiaire
created: 2011-09-01T00:00:00+02:00
definition: Établissement où se fait le commerce de l'argent et des titres fiduciaires de toute nature. Il abrite en général une salle des coffres.
status: 1

banque de France
type: Concept
modified: 2015-01-02T10:50:02+01:00
in scheme: Thésaurus de la désignation des œuvres architecturales et des espaces aménagés
broader: édifice financier public
created: 2011-09-01T00:00:00+02:00
definition: Édifice abritant l'institution nationale chargée de diverses opérations financières comme l'émission des billets, les ventes et achats d'or et de devises sur les marchés internationaux, le réescompte des effets de commerce, les avances sur titres, les avances à l'État, etc.
status: 1

baptistère
type: Concept
modified: 2014-11-27T15:40:53+01:00
in scheme: Thésaurus de la désignation des œuvres architecturales et des espaces aménagés
preferred label: baptisteries @en-us
preferred label: battistero @it
preferred label: baptistery @en-gb
broader: édifice religieux chrétien
created: 2011-09-01T00:00:00+02:00
scope note: Ne pas confondre avec chapelle des fonts.
definition: Bâtiment spécialement construit pour l'administration du baptême. Il est souvent isolé de l'église et généralement inclus dans un ensemble cathédral. Il comprend souvent une piscine baptismale.
status: 1

édifice religieux chrétien
type: Concept
modified: 2013-04-23T00:00:00+02:00
in scheme: Thésaurus de la désignation des œuvres architecturales et des espaces aménagés
preferred label: christian + religious buildings @en-us
narrower: établissement conventuel
narrower: baptistère
narrower: église
broader: édifice religieux
created: 2011-09-01T00:00:00+02:00
definition: Construction ou groupe de constructions où se réunit une communauté chrétienne pour pratiquer son culte.
status: 1

barrage
type: Concept
modified: 2014-12-01T14:00:58+01:00
in scheme: Thésaurus de la désignation des œuvres architecturales et des espaces aménagés
preferred label: dams @en-us
narrower: barrage mobile
broader: ouvrage d'art
alternative label: barrage fixe
created: 2011-09-01T00:00:00+02:00
related: centrale hydroélectrique
related: bassin de retenue
definition: Ouvrage d'art construit en travers d'un cours d’eau et de sa vallée et destiné à réguler son cours ou à stocker de l'eau pour différents usages : irrigation, industrie, hydroélectricité, pisciculture, réserve d'eau potable, etc.
TermeAssocie: centrale hydroélectrique
TermeAssocie: bassin de retenue
status: 1

centrale hydroélectrique
type: Concept
modified: 2015-02-19T15:57:33+01:00
in scheme: Thésaurus de la désignation des œuvres architecturales et des espaces aménagés
narrower: usine marémotrice
broader: centrale électrique
created: 2011-09-01T00:00:00+02:00
related: barrage
definition: Centrale électrique fonctionnant à l'énergie hydraulique et comprenant généralement un barrage, une conduite d'amenée, une salle des machines, un poste de transformation, etc.
TermeAssocie: barrage
status: 1

bassin de retenue
type: Concept
modified: 2015-03-25T11:58:56+01:00
in scheme: Thésaurus de la désignation des œuvres architecturales et des espaces aménagés
broader: parties industrielles
created: 2011-09-01T00:00:00+02:00
related: barrage
definition: Bassin formé par une masse d'eau retenue et emmagasinée pour alimenter le bief de dérivation d’une usine.
TermeAssocie: barrage
status: 1

barrage mobile
type: Concept
modified: 2014-12-01T14:04:06+01:00
in scheme: Thésaurus de la désignation des œuvres architecturales et des espaces aménagés
broader: barrage
alternative label: pertuis
alternative label: portereau
alternative label: barrage à niveau constant
created: 2011-09-01T00:00:00+02:00
definition: Infrastructure, équipée de pièces mobiles, construite sur un cours d'eau naturel afin de maintenir constante la hauteur d'eau disponible à la navigation. Il existe différents systèmes techniques : aiguilles, fermettes, clapets, battants, hausses, vannes, etc.
status: 1
broad match: Barrage

barrière d'octroi
type: Concept
modified: 2015-01-02T11:15:03+01:00
in scheme: Thésaurus de la désignation des œuvres architecturales et des espaces aménagés
broader: ensemble fiscal ou financier
created: 2011-09-01T00:00:00+02:00
related: bureau d'octroi
definition: Enceinte érigée autour d'une ville pour permettre le recouvrement des taxes sur les marchandises.
TermeAssocie: bureau d'octroi
status: 1

bureau d'octroi
type: Concept
modified: 2015-01-02T11:03:28+01:00
in scheme: Thésaurus de la désignation des œuvres architecturales et des espaces aménagés
preferred label: octrois @en-us
broader: édifice fiscal
created: 2011-09-01T00:00:00+02:00
related: barrière d'octroi
definition: Édifice construit à l’entrée d’une agglomération pour percevoir l'octroi, taxe sur les marchandises qui entrent dans la ville.
TermeAssocie: barrière d'octroi
status: 1

bas fourneau
type: Concept
modified: 2015-04-30T14:48:22+02:00
in scheme: Thésaurus de la désignation des œuvres architecturales et des espaces aménagés
broader: usine de fabrication des métaux
created: 2011-09-01T00:00:00+02:00
scope note: Voir aussi le Thesaurus des objets mobiliers (machine liée à la production industrielle).
definition: Usine où l'on fabrique du métal dans un four industriel à cuve de faible hauteur. L’équipement donne ici son nom au bâtiment de production.
status: 1

base aérienne
type: Concept
modified: 2015-01-05T11:59:50+01:00
in scheme: Thésaurus de la désignation des œuvres architecturales et des espaces aménagés
preferred label: air bases @en-us
broader: base militaire
created: 2011-09-01T00:00:00+02:00
definition: Base militaire dédiée aux forces aériennes et comprenant un aérodrome.
status: 1

base militaire
type: Concept
modified: 2014-10-14T15:54:10+02:00
in scheme: Thésaurus de la désignation des œuvres architecturales et des espaces aménagés
preferred label: military installations @en-us
narrower: base aérienne
narrower: base navale
broader: ensemble militaire
created: 2011-09-01T00:00:00+02:00
definition: Complexe réunissant des édifices et des infrastructures destinés à des activités militaires : logements, espaces d’exercices, bureaux, etc.
status: 1

base de loisirs
type: Concept
modified: 2014-10-17T16:21:55+02:00
in scheme: Thésaurus de la désignation des œuvres architecturales et des espaces aménagés
preferred label: recreation areas @en-us
broader: ensemble de culture recherche sport ou loisir
created: 2011-09-01T00:00:00+02:00
definition: Complexe réunissant des aménagements et des édifices dédiés aux sports nautiques ou aux activités de plein air.
status: 1

base navale
type: Concept
modified: 2015-01-05T12:01:17+01:00
in scheme: Thésaurus de la désignation des œuvres architecturales et des espaces aménagés
preferred label: naval bases @en-us
narrower: base sous-marine
broader: base militaire
created: 2011-09-01T00:00:00+02:00
definition: Base militaire dédiée aux forces navales et comprenant un port.
status: 1

base sous-marine
type: Concept
modified: 2014-10-14T15:58:40+02:00
in scheme: Thésaurus de la désignation des œuvres architecturales et des espaces aménagés
preferred label: submarine bases @en-us
broader: base navale
created: 2011-09-01T00:00:00+02:00
definition: Base navale destinée à l'entretien, au ravitaillement et à la mise à l'abri des sous-marins.
status: 1

basilique
type: Concept
modified: 2014-11-27T15:55:37+01:00
in scheme: Thésaurus de la désignation des œuvres architecturales et des espaces aménagés
preferred label: basilica @it
preferred label: basilican church @en-gb
preferred label: basilicas @en-us
broader: église
created: 2011-09-01T00:00:00+02:00
definition: Lieu de culte paléochrétien, en général en forme de nef accompagnée de bas-côtés, terminée par un court transept et une large abside. Au sens moderne, église dotée de privilèges honorifiques.
status: 1

église
type: Concept
modified: 2014-11-24T11:15:54+01:00
in scheme: Thésaurus de la désignation des œuvres architecturales et des espaces aménagés
preferred label: chiesa @it
preferred label: churches @en-us
preferred label: church @en-gb
narrower: basilique
narrower: cathédrale
narrower: chapelle
narrower: collégiale
narrower: église paroissiale
narrower: temple
broader: édifice religieux chrétien
alternative label: église luthérienne
alternative label: église orthodoxe
alternative label: église catholique
created: 2011-09-01T00:00:00+02:00
scope note: Pour les églises n'appartenant pas ou plus au rite catholique, noter les destinataires : d'orthodoxes, de luthériens, etc. Pour une église où sont célébrés alternativement les cultes des rites catholique et luthérien, simultaneum constitue une précision sur la dénomination.
definition: Édifice consacré au culte de la religion chrétienne, faisant ou ayant fait l'objet d'une desserte régulière.
status: 1

basse-cour
type: Concept
modified: 2014-12-31T15:32:08+01:00
in scheme: Thésaurus de la désignation des œuvres architecturales et des espaces aménagés
preferred label: baileys @en-us
broader: communs
alternative label: baile
created: 2011-09-01T00:00:00+02:00
related: cour
definition: Cour réservée au service, autour de laquelle peuvent se trouver les remises, les écuries, etc.
TermeAssocie: cour
status: 1

communs
type: Concept
modified: 2014-12-31T16:08:23+01:00
in scheme: Thésaurus de la désignation des œuvres architecturales et des espaces aménagés
narrower: basse-cour
narrower: buanderie
narrower: bûcher
narrower: cellier
narrower: chenil
narrower: écurie
narrower: logement
narrower: remise
narrower: resserre
narrower: sellerie
narrower: volière
broader: partie d'édifice domestique
created: 2011-09-01T00:00:00+02:00
scope note: Les demeures dans lesquelles les pièces de service font partie des appartements n'ont pas de communs.
definition: Partie de la demeure dans laquelle sont regroupées les pièces de service (logement de domestique, office, buanderie, écurie, etc.).
status: 1

bassin
type: Concept
modified: 2014-12-31T10:13:46+01:00
in scheme: Thésaurus de la désignation des œuvres architecturales et des espaces aménagés
broader: pièce d'eau
created: 2011-09-01T00:00:00+02:00
scope note: Bassin et fontaine sont complémentaires : on donne le nom de bassin à l'ensemble composé de ces deux éléments lorsque le réservoir a plus d'importance que le traitement monumental de l'arrivée de l'eau.
definition: Réservoir d'eau formé par une fosse, souvent maçonnée. Il est généralement alimenté par une fontaine.
status: 1

pièce d'eau
type: Concept
modified: 2014-12-31T10:10:03+01:00
in scheme: Thésaurus de la désignation des œuvres architecturales et des espaces aménagés
narrower: bassin
narrower: canal de jardin
narrower: goulette de jardin
narrower: miroir d'eau
narrower: parterre d'eau
broader: eaux de jardin
created: 2011-09-01T00:00:00+02:00
definition: Étendue d'eau dormante affectant un aspect plus naturel que le lac de jardin et de plus petite taille.
status: 1
broad match: Bassin (jardinage)

bassin à flot
type: Concept
modified: 2014-12-01T14:06:25+01:00
in scheme: Thésaurus de la désignation des œuvres architecturales et des espaces aménagés
preferred label: wet docks @en-us
broader: bassin de port
created: 2011-09-01T00:00:00+02:00
definition: Sur les mers à marée, bassin de port fermé par un système permettant de maintenir une hauteur d'eau suffisante pour éviter l'échouage des bateaux à marée basse.
status: 1

bassin de port
type: Concept
modified: 2014-12-01T14:05:20+01:00
in scheme: Thésaurus de la désignation des œuvres architecturales et des espaces aménagés
preferred label: docks @en-us
narrower: bassin à flot
narrower: bassin d'échouage
narrower: bassin de radoub
narrower: darse
broader: ouvrage d'art
created: 2011-09-01T00:00:00+02:00
related: port
related: établissement portuaire
definition: Partie d'un port réservée à l'ancrage des bateaux, limitée par des quais ou des digues.
TermeAssocie: port
TermeAssocie: établissement portuaire
status: 1

bassin d'échouage
type: Concept
modified: 2014-09-23T16:17:57+02:00
in scheme: Thésaurus de la désignation des œuvres architecturales et des espaces aménagés
broader: bassin de port
created: 2011-09-01T00:00:00+02:00
definition: Bassin de port ouvert au mouvement des marées.
status: 1

bassin de décantation
type: Concept
modified: 2015-04-30T16:26:38+02:00
in scheme: Thésaurus de la désignation des œuvres architecturales et des espaces aménagés
broader: parties industrielles
created: 2011-09-01T00:00:00+02:00
definition: Bassin aménagé pour y faire décanter des matières solides ou liquides : industrie céramique, industrie chimique, industrie extractive, station d'épuration, etc.
status: 1

bassin de natation
type: Concept
modified: 2014-10-10T12:19:28+02:00
in scheme: Thésaurus de la désignation des œuvres architecturales et des espaces aménagés
broader: partie d'édifice de culture recherche sport ou loisir
created: 2011-09-01T00:00:00+02:00
related: piscine
related: plongeoir
definition: Bassin couvert ou découvert, réservé à la natation.
TermeAssocie: piscine
TermeAssocie: plongeoir
status: 1
broad match: http://vocab.getty.edu/aat/300007376
broad match: http://data.bnf.fr/ark:/12148/cb119354432
broad match: Piscine

piscine
type: Concept
modified: 2014-12-18T15:06:25+01:00
in scheme: Thésaurus de la désignation des œuvres architecturales et des espaces aménagés
preferred label: swimming pools @en-us
broader: édifice sportif
created: 2011-09-01T00:00:00+02:00
scope note: Ne pas confondre avec piscine baptismale, ni avec établissement de bains.
related: bassin de natation
definition: Ensemble des bassins de natation couverts ou découverts, et des installations qui les accompagnent.
TermeAssocie: bassin de natation
status: 1

plongeoir
type: Concept
modified: 2014-10-17T15:40:12+02:00
in scheme: Thésaurus de la désignation des œuvres architecturales et des espaces aménagés
broader: édicule de culture recherche sport ou loisir
created: 2011-09-01T00:00:00+02:00
related: bassin de natation
definition: Tremplin ou plate-forme plus ou moins haute, au-dessus d'une piscine ou d'un plan d'eau aménagé, permettant de plonger.
TermeAssocie: bassin de natation
status: 1
broad match: http://vocab.getty.edu/aat/300222065

établissement portuaire
type: Concept
modified: 2014-11-28T16:51:57+01:00
in scheme: Thésaurus de la désignation des œuvres architecturales et des espaces aménagés
broader: édifice du génie civil
created: 2011-09-01T00:00:00+02:00
related: port
related: bassin de port
definition: Édifice lié à la gestion d'un port ou de ses équipements et dépendances.
TermeAssocie: port
TermeAssocie: bassin de port
status: 1

bassin de radoub
type: Concept
modified: 2014-12-01T14:07:35+01:00
in scheme: Thésaurus de la désignation des œuvres architecturales et des espaces aménagés
preferred label: dry docks @en-us
broader: bassin de port
alternative label: cale sèche
alternative label: radoub
alternative label: forme de radoub
created: 2011-09-01T00:00:00+02:00
related: usine de construction navale
definition: Bassin que l'on peut fermer par un système ou un bateau-porte pour l'assécher, destiné à la construction, la réparation ou l'entretien des bateaux.
TermeAssocie: usine de construction navale
status: 1

darse
type: Concept
modified: 2014-10-16T14:38:12+02:00
in scheme: Thésaurus de la désignation des œuvres architecturales et des espaces aménagés
broader: bassin de port
created: 2011-09-01T00:00:00+02:00
definition: Compartiment à l’intérieur d’un bassin de port, limité par deux jetées parallèles ou creusé dans la terre ferme.
status: 1
broad match: cb11949490r

usine de construction navale
type: Concept
modified: 2015-01-29T16:21:21+01:00
in scheme: Thésaurus de la désignation des œuvres architecturales et des espaces aménagés
broader: usine de construction mécanique
alternative label: chantier naval
created: 2011-09-01T00:00:00+02:00
related: bassin de radoub
related: cale de construction
definition: Usine où l'on construit et répare des bateaux et des sous-marins. Elle comprend généralement des cales, des cales de construction, des bassins de radoub, etc.
TermeAssocie: bassin de radoub
TermeAssocie: cale de construction
status: 1

bastillon
type: Concept
modified: 2015-01-05T12:25:43+01:00
in scheme: Thésaurus de la désignation des œuvres architecturales et des espaces aménagés
broader: ouvrage fortifié
created: 2011-09-01T00:00:00+02:00
definition: Ouvrage de transition entre la tour et le bastion, occupant les mêmes emplacements et remplissant les mêmes fonctions que ceux-ci : il possède le plan pentagonal du bastion et le développement en hauteur de la tour.
status: 1

ouvrage fortifié
type: Concept
modified: 2015-01-05T13:31:56+01:00
in scheme: Thésaurus de la désignation des œuvres architecturales et des espaces aménagés
preferred label: fortification elements @en-us
narrower: bastillon
narrower: bastion
narrower: batterie d'artillerie
narrower: casemate
narrower: chemin de ronde
narrower: courtine
narrower: ouvrage extérieur
narrower: donjon
narrower: double caponnière
narrower: fossé
narrower: enceinte
narrower: éperon barré
narrower: hourd
narrower: motte
narrower: mur défensif
narrower: ouvrage d'entrée
narrower: ouvrage Maginot
narrower: pont-levis
narrower: position fortifiée
narrower: poterne
narrower: réduit
broader: ouvrage militaire
alternative label: édicule fortifié
created: 2011-09-01T00:00:00+02:00
definition: Construction fortifiée généralement isolée ou incluse dans un édifice ou un ensemble fortifié.
status: 1

bastion
type: Concept
modified: 2015-01-05T12:28:04+01:00
in scheme: Thésaurus de la désignation des œuvres architecturales et des espaces aménagés
preferred label: bastions @en-us
broader: ouvrage fortifié
created: 2011-09-01T00:00:00+02:00
definition: Dans la fortification classique et moderne, ouvrage remparé, bas et pentagonal faisant avant-corps sur une enceinte.
status: 1

bâtiment administratif d'entreprise
type: Concept
modified: 2015-03-25T12:09:40+01:00
in scheme: Thésaurus de la désignation des œuvres architecturales et des espaces aménagés
narrower: bureau d'entreprise
broader: parties industrielles
created: 2011-09-01T00:00:00+02:00
definition: Bâtiment accueillant les services administratifs de l'usine.
status: 1

bureau d'entreprise
type: Concept
modified: 2015-03-25T15:03:39+01:00
in scheme: Thésaurus de la désignation des œuvres architecturales et des espaces aménagés
broader: bâtiment administratif d'entreprise
created: 2011-09-01T00:00:00+02:00
related: immeuble de bureaux
definition: Bâtiment ou local où s'effectue le travail de gestion de l'entreprise.
TermeAssocie: immeuble de bureaux
status: 1

bâtiment conventuel
type: Concept
modified: 2014-11-28T14:23:34+01:00
in scheme: Thésaurus de la désignation des œuvres architecturales et des espaces aménagés
narrower: cloître
narrower: dortoir
narrower: lavabo de cloître
narrower: réfectoire
narrower: salle capitulaire
broader: partie d'édifice religieux
alternative label: partie conventuelle
created: 2011-09-01T00:00:00+02:00
definition: Au sein d'un établissement conventuel, bâtiment pouvant regrouper le dortoir commun ou les cellules, le chauffoir, la salle capitulaire, le réfectoire, la grande salle de travail des moines, etc.
status: 1

cloître
type: Concept
modified: 2014-11-28T15:09:55+01:00
in scheme: Thésaurus de la désignation des œuvres architecturales et des espaces aménagés
preferred label: chiostro @it
preferred label: cloister @en-gb
preferred label: cloisters @en-us
broader: bâtiment conventuel
created: 2011-09-01T00:00:00+02:00
scope note: Ne pas confondre avec ossuaire, qui peut avoir les mêmes dispositions.
definition: Dans l'architecture religieuse, galerie ouverte délimitant une cour centrale ou un préau. Le cloître est généralement carré. La disposition de la galerie ouverte est quelquefois répétée à l'étage (cloître à galeries hautes).
status: 1

dortoir
type: Concept
modified: 2014-10-15T13:59:31+02:00
in scheme: Thésaurus de la désignation des œuvres architecturales et des espaces aménagés
preferred label: dormitorio @it
preferred label: dormitory @en-gb
preferred label: dormitories (rooms) @en-us
broader: bâtiment conventuel
created: 2011-09-01T00:00:00+02:00
scope note: Ne pas confondre avec internat.
definition: Salle commune où dorment les membres d'une communauté religieuse. Les dortoirs sont quelquefois divisés en cellules par des cloisons ou par des rideaux.
status: 1

lavabo de cloître
type: Concept
modified: 2014-10-23T10:45:31+02:00
in scheme: Thésaurus de la désignation des œuvres architecturales et des espaces aménagés
preferred label: lavabo del chiostro @it
preferred label: cloister + lavaboes @en-us
broader: bâtiment conventuel
created: 2011-09-01T00:00:00+02:00
definition: Petite construction particulière placée dans le cloître et contenant la fontaine aux ablutions.
status: 1

réfectoire
type: Concept
modified: 2014-11-28T15:11:17+01:00
in scheme: Thésaurus de la désignation des œuvres architecturales et des espaces aménagés
preferred label: refettorio @it
preferred label: refectory @en-gb
preferred label: refectories @en-us
broader: bâtiment conventuel
created: 2011-09-01T00:00:00+02:00
scope note: Ne pas confondre avec cantine.
definition: Salle des repas pris en commun par une communauté religieuse.
status: 1

salle capitulaire
type: Concept
modified: 2014-11-28T15:12:31+01:00
in scheme: Thésaurus de la désignation des œuvres architecturales et des espaces aménagés
preferred label: chapter houses @en-us
preferred label: sala capitolare @it
preferred label: chapter house @en-gb
broader: bâtiment conventuel
created: 2011-09-01T00:00:00+02:00
definition: Salle où se réunit le chapitre d'une communauté religieuse.
status: 1

bâtiment d'eau
type: Concept
modified: 2015-04-09T15:22:51+02:00
in scheme: Thésaurus de la désignation des œuvres architecturales et des espaces aménagés
broader: parties industrielles
created: 2011-09-01T00:00:00+02:00
definition: Bâtiment où se trouve le moteur hydraulique.
status: 1

bâtiment de la machine d'extraction
type: Concept
modified: 2015-04-30T16:38:49+02:00
in scheme: Thésaurus de la désignation des œuvres architecturales et des espaces aménagés
broader: parties industrielles
created: 2011-09-01T00:00:00+02:00
related: chevalement
definition: Dans une usine d’extraction, bâtiment abritant le dispositif d'enroulement du câble (tambour, bobine ou poulie) en provenance du chevalement et le moteur qui le met en mouvement.
TermeAssocie: chevalement
status: 1

chevalement
type: Concept
modified: 2015-04-30T16:48:10+02:00
in scheme: Thésaurus de la désignation des œuvres architecturales et des espaces aménagés
narrower: tour d'extraction
broader: parties industrielles
created: 2011-09-01T00:00:00+02:00
related: bâtiment de la machine d'extraction
definition: Construction qui domine un puits de mine et qui supporte à son sommet un dispositif assurant le renvoi du câble d'extraction vers l'appareil d'enroulement.
TermeAssocie: bâtiment de la machine d'extraction
status: 1

bâtiment de la soufflerie
type: Concept
modified: 2015-03-25T16:30:58+01:00
in scheme: Thésaurus de la désignation des œuvres architecturales et des espaces aménagés
broader: parties industrielles
created: 2011-09-01T00:00:00+02:00
scope note: Ne pas confondre avec soufflerie aérodynamique, qui est un laboratoire d'essais.
definition: Bâtiment abritant la machine ou l'ensemble des machines destinées à produire l'air sous faible pression, nécessaire au fonctionnement d'une installation métallurgique (haut fourneau, convertisseur), à l'aération d'une mine ou au séchage de divers produits industriels, etc.
status: 1

bâtiment de recette
type: Concept
modified: 2015-04-30T16:38:01+02:00
in scheme: Thésaurus de la désignation des œuvres architecturales et des espaces aménagés
broader: parties industrielles
created: 2011-09-01T00:00:00+02:00
definition: Bâtiment d'un site minier où sont reçus au jour les produits extraits du fond ainsi que le personnel.
status: 1
broad match: http://vocab.getty.edu/aat/300006361

batterie d'artillerie
type: Concept
modified: 2015-01-05T12:30:02+01:00
in scheme: Thésaurus de la désignation des œuvres architecturales et des espaces aménagés
preferred label: batteries (platforms) @en-us
broader: ouvrage fortifié
created: 2011-09-01T00:00:00+02:00
definition: Groupement de quelques pièces d'artillerie. Par extension, petit ouvrage pour recevoir la batterie.
status: 1

beffroi
type: Concept
modified: 2014-12-05T12:06:14+01:00
in scheme: Thésaurus de la désignation des œuvres architecturales et des espaces aménagés
preferred label: bell towers @en-us
broader: édifice de l'administration ou de la vie publique
alternative label: beffroi communal
created: 2011-09-01T00:00:00+02:00
definition: Tour contenant la cloche de la communauté des habitants.
status: 1

charpente
type: Concept
modified: 2015-02-24T16:56:08+01:00
in scheme: Thésaurus de la désignation des œuvres architecturales et des espaces aménagés
preferred label: structural frames @en-us
narrower: charpente de toit
narrower: plancher
broader: partie ou élément commun à tous les types d'architecture et aux espaces aménagés
alternative label: pan-de-bois
created: 2011-09-01T00:00:00+02:00
scope note: Voir aussi le Thesaurus des objets mobiliers.
definition: Ouvrage formant le comble et portant le matériau de couverture, le plus souvent des pièces de bois ou de fer assemblées. Désigne également les éléments d'une structure porteuse lorsqu'elle n'est pas en maçonnerie.
status: 1

béguinage
type: Concept
modified: 2014-10-15T13:46:13+02:00
in scheme: Thésaurus de la désignation des œuvres architecturales et des espaces aménagés
preferred label: beghinaggio @it
preferred label: beguinages @en-us
preferred label: lay sisters house @en-gb
broader: établissement conventuel
created: 2011-09-01T00:00:00+02:00
definition: Établissement abritant une communauté de veuves, appelées béguines. Ne se rencontre guère hors des Flandres.
status: 1

belvédère
type: Concept
modified: 2015-02-25T11:53:49+01:00
in scheme: Thésaurus de la désignation des œuvres architecturales et des espaces aménagés
preferred label: belvederes @en-us
broader: couverture et accessoire du toit
created: 2011-09-01T00:00:00+02:00
scope note: Ne pas confondre avec lanternon.
definition: Petit abri couvert, placé au faîte d'un toit.
status: 1

couverture et accessoire du toit
type: Concept
modified: 2015-02-24T17:05:42+01:00
in scheme: Thésaurus de la désignation des œuvres architecturales et des espaces aménagés
preferred label: roofs or roof components @en-us
narrower: belvédère
narrower: clocher
narrower: flèche en couverture
narrower: lanternon
narrower: lucarne
narrower: souche de cheminée
narrower: toit en shed
narrower: verrière en couverture
broader: partie ou élément commun à tous les types d'architecture et aux espaces aménagés
created: 2011-09-01T00:00:00+02:00
scope note: Ne pas confondre avec couvrement. Voir aussi le Thesaurus des objets mobiliers.
definition: Ouvrage couvrant extérieurement une construction ou complémentaire de la toiture.
status: 1

belvédère de jardin
type: Concept
modified: 2014-12-31T11:23:18+01:00
in scheme: Thésaurus de la désignation des œuvres architecturales et des espaces aménagés
broader: relief artificiel de jardin
alternative label: point de vue
created: 2011-09-01T00:00:00+02:00
scope note: Ne pas confondre avec belvédère.
related: fabrique en belvédère
definition: Terre-plein, parfois gazonné, aménagé sur un point culminant, butte artificielle ou terrasse en terre-plein offrant une vue. Le belvédère de jardin peut être surmonté d'une fabrique (voir fabrique en belvédère) et accueille généralement des sièges de jardin.
TermeAssocie: fabrique en belvédère
status: 1
broad match: http://vocab.getty.edu/aat/300008024

fabrique en belvédère
type: Concept
modified: 2014-12-30T15:30:20+01:00
in scheme: Thésaurus de la désignation des œuvres architecturales et des espaces aménagés
broader: fabrique de jardin
created: 2011-09-01T00:00:00+02:00
related: belvédère de jardin
definition: Fabrique située sur un point élevé, pour ménager des vues sur le jardin ou le paysage environnant.
TermeAssocie: belvédère de jardin
status: 1

berge aménagée
type: Concept
modified: 2014-10-16T14:40:42+02:00
in scheme: Thésaurus de la désignation des œuvres architecturales et des espaces aménagés
broader: ouvrage d'art
created: 2011-09-01T00:00:00+02:00
related: quai
related: plage aménagée
definition: Rive d’un plan d’eau ou d’un cours d’eau, modifiée pour la stabiliser et pour faciliter l’accès à l’eau.
TermeAssocie: quai
TermeAssocie: plage aménagée
status: 1

quai
type: Concept
modified: 2014-12-02T14:44:08+01:00
in scheme: Thésaurus de la désignation des œuvres architecturales et des espaces aménagés
preferred label: quays @en-us
narrower: embarcadère
broader: ouvrage d'art
created: 2011-09-01T00:00:00+02:00
related: berge aménagée
related: gare
definition: Aménagement formé d'un terre-plein supérieur et d'un mur vertical ou taluté. Dans les gares de chemin de fer, de transbordement, etc., plate-forme située le long des voies permettant l'embarquement des voyageurs et le chargement des marchandises ; dans les édifices industriels ou commerciaux, plate-forme permettant le transbordement à niveau des marchandises.
TermeAssocie: berge aménagée
TermeAssocie: gare
status: 1

plage aménagée
type: Concept
modified: 2014-12-19T10:48:35+01:00
in scheme: Thésaurus de la désignation des œuvres architecturales et des espaces aménagés
broader: édifice et aménagement de culture recherche sport ou loisir
alternative label: plage artificielle
created: 2011-09-01T00:00:00+02:00
related: berge aménagée
definition: Plage d’origine naturelle ou non dont le traitement des abords, des accès et l'installation de commodités diverses permettent d’accueillir le public.
TermeAssocie: berge aménagée
status: 1

bergerie
type: Concept
modified: 2014-12-30T14:16:51+01:00
in scheme: Thésaurus de la désignation des œuvres architecturales et des espaces aménagés
preferred label: sheepfolds @en-us
broader: étable
created: 2011-09-01T00:00:00+02:00
definition: Étable à moutons ou à chèvres.
status: 1

étable
type: Concept
modified: 2014-12-30T14:25:48+01:00
in scheme: Thésaurus de la désignation des œuvres architecturales et des espaces aménagés
preferred label: stables (animal housing) @en-us
narrower: bergerie
narrower: étable à chevaux
narrower: étable à vaches
narrower: porcherie
broader: partie d'édifice agricole
created: 2011-09-01T00:00:00+02:00
definition: Abri pour les bestiaux, plus particulièrement pour les bovidés. L'étable ouverte est une étable sans division intérieure et sans fermeture pouvant contenir plusieurs bêtes qui ne sont pas attachées.
status: 1

bibliothèque
type: Concept
modified: 2014-12-12T14:32:30+01:00
in scheme: Thésaurus de la désignation des œuvres architecturales et des espaces aménagés
preferred label: libraries (buildings) @en-us
broader: édifice et aménagement de culture recherche sport ou loisir
alternative label: médiathèque
created: 2011-09-01T00:00:00+02:00
scope note: Dans l'architecture médiévale, cette construction s'appelle librairie.
definition: Édifice ou partie d'édifice réservé au rangement, au catalogage et à la consultation des livres, des périodiques et autres médias.
status: 1

bief
type: Concept
modified: 2014-12-01T13:52:09+01:00
in scheme: Thésaurus de la désignation des œuvres architecturales et des espaces aménagés
preferred label: sections of watercourse @en-us
narrower: gare d'eau
broader: voie navigable
alternative label: bief de navigation
created: 2011-09-01T00:00:00+02:00
scope note: Ne pas confondre avec bief de dérivation.
definition: Fraction d'une voie navigable entre deux chutes (entre deux écluses à sas, entre une écluse à sas et un barrage, etc.).
status: 1
broad match: cb11935887s

voie navigable
type: Concept
modified: 2014-12-01T13:50:44+01:00
in scheme: Thésaurus de la désignation des œuvres architecturales et des espaces aménagés
preferred label: waterways @en-us
narrower: bief
narrower: chaîne d'écluses
broader: ensemble du génie civil
created: 2011-09-01T00:00:00+02:00
scope note: Ne pas confondre avec rivière aménagée.
related: canal de navigation
related: réseau de navigation fluviale
definition: Voie d’eau naturelle (fleuve, rivière) ou/et artificielle (canal de navigation) aménagée, équipée et ouverte à la circulation et au transport fluvial.
TermeAssocie: canal de navigation
TermeAssocie: réseau de navigation fluviale
status: 1

gare d'eau
type: Concept
modified: 2014-12-01T13:53:41+01:00
in scheme: Thésaurus de la désignation des œuvres architecturales et des espaces aménagés
broader: bief
created: 2011-09-01T00:00:00+02:00
definition: Bief ou partie de bief assez large pour permettre à deux bateaux de se croiser ou de se doubler ; il permet en outre aux bateaux de stationner ou d'attendre leur tour pour franchir une dénivelée sans gêner la navigation. Il peut abriter des fonctions portuaires (chargement, déchargement, stockage).
status: 1
broad match: Bief

bief de dérivation
type: Concept
modified: 2014-12-02T12:23:22+01:00
in scheme: Thésaurus de la désignation des œuvres architecturales et des espaces aménagés
broader: ouvrage lié à l'alimentation en eau
alternative label: bief de moulin
created: 2011-09-01T00:00:00+02:00
scope note: Ne pas confondre avec bief.
definition: Canal d'alimentation du moteur hydraulique d'un site industriel ou artisanal comprenant les installations hydrauliques d'amont, de la prise d'eau au moteur hydraulique (canal d'amenée, déversoir de superficie, canal de décharge, etc.), et des installations hydrauliques d'aval (canal de fuite, etc.).
status: 1
broad match: http://data.bnf.fr/ark:/12148/cb11992319f

ouvrage lié à l'alimentation en eau
type: Concept
modified: 2013-04-23T00:00:00+02:00
in scheme: Thésaurus de la désignation des œuvres architecturales et des espaces aménagés
narrower: pont aqueduc
narrower: bief de dérivation
narrower: fontaine
narrower: réservoir
narrower: conduite forcée
narrower: puits
narrower: regard
narrower: rigole
narrower: siphon
narrower: station de captage
narrower: station de pompage
narrower: vanne
broader: ouvrage d'art
created: 2011-09-01T00:00:00+02:00
definition: Ouvrage, appartenant le plus souvent à un réseau, permettant à l’aide d’un dispositif de recueillir, puiser, pomper, acheminer, distribuer, etc. de l’eau.
status: 1

biscotterie
type: Concept
modified: 2015-04-29T15:26:50+02:00
in scheme: Thésaurus de la désignation des œuvres architecturales et des espaces aménagés
broader: usine de boulangerie
created: 2011-09-01T00:00:00+02:00
definition: Usine où l'on fabrique des biscottes. Elle comprend généralement un bureau, un four industriel, un magasin industriel, etc.
status: 1

usine de boulangerie
type: Concept
modified: 2015-01-21T15:05:05+01:00
in scheme: Thésaurus de la désignation des œuvres architecturales et des espaces aménagés
narrower: biscotterie
narrower: biscuiterie
broader: usine de produits agro-alimentaires
created: 2011-09-01T00:00:00+02:00
definition: Usine où l'on fabrique différentes sortes de pains, de pâtes et pâtons préfermentés surgelés, etc. Elle comprend généralement un laboratoire, un four industriel, un atelier de conditionnement, etc.
status: 1

biscuiterie
type: Concept
modified: 2015-01-21T15:03:52+01:00
in scheme: Thésaurus de la désignation des œuvres architecturales et des espaces aménagés
broader: usine de boulangerie
created: 2011-09-01T00:00:00+02:00
definition: Usine spécialisée dans la fabrication des biscuits, gâteaux secs, petits fours, etc. Elle comprend généralement un four industriel, un atelier de conditionnement, un magasin industriel, etc.
status: 1

blanchisserie
type: Concept
modified: 2014-10-09T11:24:15+02:00
in scheme: Thésaurus de la désignation des œuvres architecturales et des espaces aménagés
preferred label: laundries (businesses) @en-us
broader: édifice artisanal commercial ou tertiaire
created: 2011-09-01T00:00:00+02:00
related: blanchisserie industrielle
definition: Établissement artisanal où l'on blanchit le linge.
TermeAssocie: blanchisserie industrielle
status: 1

blanchisserie industrielle
type: Concept
modified: 2015-04-30T15:29:19+02:00
in scheme: Thésaurus de la désignation des œuvres architecturales et des espaces aménagés
broader: usine textile
created: 2011-09-01T00:00:00+02:00
scope note: Ne pas confondre avec usine de blanchiment.
related: blanchisserie
definition: Usine où l'on effectue, suivant des procédés industriels, le nettoyage et le blanchissage du linge (triage, trempage, essangeage, lessivage, savonnage, rinçage, essorage, séchage, calandrage, repassage). Elle comprend généralement un entrepôt industriel, une pièce de séchage, une chaufferie, etc.
TermeAssocie: blanchisserie
status: 1

usine textile
type: Concept
modified: 2015-03-17T16:14:48+01:00
in scheme: Thésaurus de la désignation des œuvres architecturales et des espaces aménagés
narrower: blanchisserie industrielle
narrower: corderie
narrower: filature
narrower: usine d'apprêt des étoffes
narrower: tissage
narrower: usine d'impression sur étoffes
narrower: usine de produit textile non tissé
narrower: usine de bonneterie
narrower: usine de broderie mécanique
narrower: usine de dentelle mécanique
narrower: usine de préparation de produits textiles
narrower: usine de teinturerie
broader: usine
created: 2011-09-01T00:00:00+02:00
definition: Usine où l'on traite et travaille les fibres textiles (filature, tissage, broderie, apprêt, teinture, etc.).
status: 1

blockhaus
type: Concept
modified: 2015-01-05T12:33:48+01:00
in scheme: Thésaurus de la désignation des œuvres architecturales et des espaces aménagés
preferred label: blockhouses @en-us
broader: casemate
alternative label: bloc
created: 2011-09-01T00:00:00+02:00
definition: Dans la fortification moderne (type ligne Maginot ou mur de l’Atlantique), casemate active en béton armé, parfois cuirassée, formant un ouvrage extérieur distinct.
status: 1
broad match: Casemate

casemate
type: Concept
modified: 2015-01-05T12:31:28+01:00
in scheme: Thésaurus de la désignation des œuvres architecturales et des espaces aménagés
preferred label: casemates @en-us
narrower: blockhaus
broader: ouvrage fortifié
created: 2011-09-01T00:00:00+02:00
definition: Dans la fortification classique et moderne, chambre voûtée à l'épreuve des tirs. La casemate est dite cuirassée, lorsque le métal a été employé dans pour compléter sa protection par des cuirassements (blindages). Elle est dite passive lorsqu'elle est destinée à abriter la troupe ou le matériel. La casemate active protège des pièces d’artillerie et possède un système de ventilation pour l'évacuation des fumées de tir.
status: 1

bocage de jardin
type: Concept
modified: 2014-10-14T10:38:12+02:00
in scheme: Thésaurus de la désignation des œuvres architecturales et des espaces aménagés
broader: couvert de jardin
created: 2011-09-01T00:00:00+02:00
definition: Composition de moyennes dimensions constituée de massifs d’arbres et de groupes d'arbres irrégulièrement espacés, reliés par des clairières, de façon à conserver un aspect naturel.
status: 1

bois de jardin
type: Concept
modified: 2014-10-14T10:41:38+02:00
in scheme: Thésaurus de la désignation des œuvres architecturales et des espaces aménagés
broader: couvert de jardin
created: 2011-09-01T00:00:00+02:00
definition: Couvert de très vastes dimensions ne s'étendant pas en principe au-delà des limites du jardin.
status: 1

bordure
type: Concept
modified: 2014-10-14T09:40:28+02:00
in scheme: Thésaurus de la désignation des œuvres architecturales et des espaces aménagés
broader: clôture de jardin
created: 2011-09-01T00:00:00+02:00
definition: Délimitation de faible hauteur ne faisant pas obstacle au passage, isolant les découverts, les voies de communication ou les pièces d'eau d'un jardin.
status: 1

clôture de jardin
type: Concept
modified: 2014-12-30T15:13:52+01:00
in scheme: Thésaurus de la désignation des œuvres architecturales et des espaces aménagés
narrower: bordure
narrower: palissade de verdure
narrower: saut de loup
broader: clôture et circulation de jardin
created: 2011-09-01T00:00:00+02:00
related: clôture
definition: Ouvrage divisant ou délimitant un jardin et faisant obstacle au passage.
TermeAssocie: clôture
status: 1

borne
type: Concept
modified: 2015-02-24T11:23:56+01:00
in scheme: Thésaurus de la désignation des œuvres architecturales et des espaces aménagés
preferred label: marker @en-us
narrower: borne routière
narrower: montjoie
broader: ouvrage d'art
alternative label: borne de juridiction
alternative label: borne de propriété
alternative label: borne frontière
alternative label: borne kilométrique
alternative label: borne géodésique
alternative label: borne frontalière
created: 2011-09-01T00:00:00+02:00
scope note: Voir aussi le Thesaurus des objets mobiliers.
definition: Pierre ou autre marque signalant la limite d’une propriété, d’un territoire, indiquant les distances ou servant de repère.
status: 1

borne routière
type: Concept
modified: 2015-02-24T11:23:06+01:00
in scheme: Thésaurus de la désignation des œuvres architecturales et des espaces aménagés
preferred label: milestones @en-us
narrower: milliaire
broader: borne
created: 2011-09-01T00:00:00+02:00
scope note: Voir aussi le Thesaurus des objets mobiliers.
definition: Borne indiquant les distances sur les routes ou les désignations de ces dernières.
status: 1

montjoie
type: Concept
modified: 2015-02-24T11:25:02+01:00
in scheme: Thésaurus de la désignation des œuvres architecturales et des espaces aménagés
broader: borne
created: 2011-09-01T00:00:00+02:00
definition: Édicule ou monticule de pierres élevé sur certains itinéraires, notamment sur les routes de pèlerinage, pour aider à se repérer.
status: 1

milliaire
type: Concept
modified: 2014-12-01T14:12:42+01:00
in scheme: Thésaurus de la désignation des œuvres architecturales et des espaces aménagés
broader: borne routière
alternative label: borne milliaire
created: 2011-09-01T00:00:00+02:00
scope note: Un mille vaut environ 1472 mètres. En Gaule, les milliaires marquent souvent les lieues, soit 2222 mètres.
definition: Borne marquant les milles sur les routes romaines.
status: 1

bosquet
type: Concept
modified: 2014-12-30T16:20:49+01:00
in scheme: Thésaurus de la désignation des œuvres architecturales et des espaces aménagés
preferred label: boskets @en-us
broader: couvert de jardin
created: 2011-09-01T00:00:00+02:00
definition: Couvert de petites dimensions comprenant une ou plusieurs pièces découvertes et constituant un ensemble boisé homogène, dont les arbres sont renouvelés avant d'atteindre le stade de la haute futaie.
status: 1

boulangerie
type: Concept
modified: 2014-12-04T15:43:04+01:00
in scheme: Thésaurus de la désignation des œuvres architecturales et des espaces aménagés
preferred label: bakeries @en-us
broader: édifice artisanal commercial ou tertiaire
created: 2011-09-01T00:00:00+02:00
scope note: Le décor de la boutique fait l’objet d’un dossier objet mobilier.
definition: Édifice ou partie d'édifice artisanal où l'on fabrique et vend le pain.
status: 1

boulevard
type: Concept
modified: 2015-01-07T12:31:39+01:00
in scheme: Thésaurus de la désignation des œuvres architecturales et des espaces aménagés
preferred label: viale di circonvallazione @it
preferred label: boulevards @en-us
narrower: rocade
broader: voie
created: 2011-09-01T00:00:00+02:00
definition: Artère, généralement plantée d'arbres, établie de façon concentrique autour du cœur d'une agglomération, souvent à l'emplacement ou à l'extérieur d'une enceinte ou d'un octroi.
status: 1

rocade
type: Concept
modified: 2014-10-17T14:50:10+02:00
in scheme: Thésaurus de la désignation des œuvres architecturales et des espaces aménagés
broader: boulevard
alternative label: beltways @en-us
created: 2011-09-01T00:00:00+02:00
status: 1

boulingrin
type: Concept
modified: 2014-12-30T16:33:30+01:00
in scheme: Thésaurus de la désignation des œuvres architecturales et des espaces aménagés
broader: découvert de jardin
created: 2011-09-01T00:00:00+02:00
definition: Pièce découverte en forme de cuvette à fond plat limitée par un talus ou un glacis.
status: 1
broad match: http://data.bnf.fr/ark:/12148/cb11965436d
broad match: http://vocab.getty.edu/aat/300008889

boulodrome
type: Concept
modified: 2014-12-12T14:50:52+01:00
in scheme: Thésaurus de la désignation des œuvres architecturales et des espaces aménagés
broader: édifice sportif
alternative label: terrain de boule
created: 2011-09-01T00:00:00+02:00
definition: Terrain ou salle de sport aménagé pour le jeu de boules ou de quilles.
status: 1

édifice sportif
type: Concept
modified: 2014-12-12T14:42:11+01:00
in scheme: Thésaurus de la désignation des œuvres architecturales et des espaces aménagés
narrower: établissement de tir
narrower: piscine
narrower: boulodrome
narrower: parcours de golf
narrower: court de tennis
narrower: établissement nautique
narrower: gymnase
narrower: hippodrome
narrower: jeu de paume
narrower: manège
narrower: patinoire
narrower: fronton de pelote basque
narrower: salle d'armes
narrower: stade
narrower: vélodrome
broader: édifice et aménagement de culture recherche sport ou loisir
created: 2011-09-01T00:00:00+02:00
definition: Édifice destiné à la pratique d'une activité sportive.
status: 1

bourse
type: Concept
modified: 2014-12-04T15:46:03+01:00
in scheme: Thésaurus de la désignation des œuvres architecturales et des espaces aménagés
preferred label: stock exchanges @en-us
narrower: bourse de commerce
broader: édifice artisanal commercial ou tertiaire
created: 2011-09-01T00:00:00+02:00
related: édifice financier public
definition: Édifice où se négocient les valeurs mobilières ou des opérations sur des marchandises.
TermeAssocie: édifice financier public
status: 1
broad match: http://data.bnf.fr/ark:/12148/cb119500555

bourse de commerce
type: Concept
modified: 2014-10-06T13:02:34+02:00
in scheme: Thésaurus de la désignation des œuvres architecturales et des espaces aménagés
preferred label: commodity exchanges @en-us
broader: bourse
created: 2011-09-01T00:00:00+02:00
definition: Édifice où se concluent la vente et l'achat en gros de certaines marchandises.
status: 1

bourse du travail
type: Concept
modified: 2014-12-12T10:45:55+01:00
in scheme: Thésaurus de la désignation des œuvres architecturales et des espaces aménagés
broader: siège d'association ou d'organisation
created: 2011-09-01T00:00:00+02:00
scope note: Ne pas confondre avec local syndical.
definition: Édifice abritant les activités et les bureaux des divers syndicats d'une même ville ou région.
status: 1

siège d'association ou d'organisation
type: Concept
modified: 2014-10-17T15:32:31+02:00
in scheme: Thésaurus de la désignation des œuvres architecturales et des espaces aménagés
narrower: bourse du travail
narrower: cercle de sociabilité
narrower: chambre de commerce
narrower: maison du peuple
narrower: siège de parti politique
narrower: siège d'organisation internationale
narrower: temple maçonnique
broader: édifice de l'administration ou de la vie publique
created: 2011-09-01T00:00:00+02:00
definition: Édifice abritant les activités ou les services d'associations ou d'organisations.
status: 1

boutique
type: Concept
modified: 2014-12-05T11:40:45+01:00
in scheme: Thésaurus de la désignation des œuvres architecturales et des espaces aménagés
broader: parties commerciales
created: 2011-09-01T00:00:00+02:00
scope note: Le décor de boutique fait l’objet d’un dossier objet mobilier.
related: magasin de commerce
definition: Local au rez-de-chaussée d'un édifice, ouvert sur la voie publique, destiné à une activité commerciale.
TermeAssocie: magasin de commerce
status: 1

magasin de commerce
type: Concept
modified: 2014-10-06T13:25:50+02:00
in scheme: Thésaurus de la désignation des œuvres architecturales et des espaces aménagés
preferred label: stores @en-us
narrower: échoppe
narrower: galerie marchande
narrower: grand magasin
narrower: hypermarché
narrower: magasin coopératif
narrower: superette
narrower: supermarché
broader: édifice artisanal commercial ou tertiaire
created: 2011-09-01T00:00:00+02:00
scope note: Ne pas confondre avec boutique.
related: boutique
definition: Édifice, bâtiment ou corps de bâtiment servant de lieu de dépôt, d'exposition et de vente de marchandises.
TermeAssocie: boutique
status: 1

brasserie
type: Concept
modified: 2015-01-07T11:53:42+01:00
in scheme: Thésaurus de la désignation des œuvres architecturales et des espaces aménagés
broader: usine de produits agro-alimentaires
created: 2011-09-01T00:00:00+02:00
scope note: Ne pas confondre avec brasserie (restaurant).
definition: Usine où l'on fabrique de la bière à partir de céréales germées et de houblon. Elle comprend généralement une pièce de séchage (touraille), une salle de brassage avec les chaudières à moût, une salle de fermentation (cuvage), un atelier de conditionnement, etc.
status: 1

usine de produits agro-alimentaires
type: Concept
modified: 2014-12-16T16:37:49+01:00
in scheme: Thésaurus de la désignation des œuvres architecturales et des espaces aménagés
narrower: usine de boulangerie
narrower: brasserie
narrower: brûlerie
narrower: distillerie
narrower: établissement vinicole
narrower: chocolaterie
narrower: cidrerie
narrower: confiserie
narrower: conserverie
narrower: féculerie
narrower: fromagerie industrielle
narrower: huilerie
narrower: moulin à huile
narrower: laiterie industrielle
narrower: usine de préparation d'un produit agroalimentaire
narrower: minoterie
narrower: moulin à farine
narrower: sucrerie
narrower: usine frigorifique
narrower: usine de boissons non alcoolisées
narrower: usine de mise en bouteilles
narrower: usine de moutarde
narrower: usine de pâtes alimentaires
narrower: usine de produits pour l'alimentation animale
narrower: usine de tabac
narrower: vinaigrerie
broader: usine
alternative label: usine de produits alimentaires
created: 2011-09-01T00:00:00+02:00
definition: Usine où l'on transforme les produits d'origine animale ou végétale, issus de l'agriculture, en denrées alimentaires destinées à la consommation humaine et animale.
status: 1

brasserie (restaurant)
type: Concept
modified: 2014-12-05T10:58:27+01:00
in scheme: Thésaurus de la désignation des œuvres architecturales et des espaces aménagés
preferred label: brasseries @en-us
broader: restaurant
created: 2011-09-01T00:00:00+02:00
scope note: Ne pas confondre avec brasserie (usine).
definition: Établissement où, à l'origine, on consommait de la bière fabriquée sur place. Par extension, café-restaurant de grande taille.
status: 1
narrow match: http://data.bnf.fr/ark:/12148/cb120370164

restaurant
type: Concept
modified: 2014-12-05T10:57:26+01:00
in scheme: Thésaurus de la désignation des œuvres architecturales et des espaces aménagés
preferred label: restaurants @en-us
narrower: brasserie (restaurant)
broader: édifice artisanal commercial ou tertiaire
created: 2011-09-01T00:00:00+02:00
definition: Établissement où l'on sert des repas moyennant paiement.
status: 1

briqueterie
type: Concept
modified: 2015-01-23T16:38:57+01:00
in scheme: Thésaurus de la désignation des œuvres architecturales et des espaces aménagés
broader: usine de céramique
created: 2011-09-01T00:00:00+02:00
related: usine de fabrication de matériaux de construction
definition: Usine où l'on fabrique des briques et comprenant généralement un four industriel, une pièce de séchage, une excavation, etc.
TermeAssocie: usine de fabrication de matériaux de construction
status: 1

usine de fabrication de matériaux de construction
type: Concept
modified: 2015-04-28T15:30:01+02:00
in scheme: Thésaurus de la désignation des œuvres architecturales et des espaces aménagés
narrower: cimenterie
narrower: usine de chaux
narrower: plâtrière
narrower: usine d'agglomérés
narrower: usine d'éléments préfabriqués
broader: usine
created: 2011-09-01T00:00:00+02:00
related: briqueterie
related: faïencerie
related: tuilerie
definition: Usine où l'on fabrique différents types de matériaux de construction tels que plâtre, ciment, chaux, agglomérés ou préfabriqués.
TermeAssocie: briqueterie
TermeAssocie: faïencerie
TermeAssocie: tuilerie
status: 1

usine de céramique
type: Concept
modified: 2015-01-27T12:11:49+01:00
in scheme: Thésaurus de la désignation des œuvres architecturales et des espaces aménagés
narrower: briqueterie
narrower: faïencerie
narrower: tuilerie
narrower: usine de grès
narrower: usine de porcelaine
narrower: usine de poterie
broader: usine
created: 2011-09-01T00:00:00+02:00
definition: Usine où l'on fabrique des produits céramiques poreux et imperméables, y compris la céramique pour le bâtiment (dallage, carrelage, canalisation, etc.).
status: 1

brosserie
type: Concept
modified: 2015-03-11T11:49:50+01:00
in scheme: Thésaurus de la désignation des œuvres architecturales et des espaces aménagés
broader: usine liée au travail du bois
created: 2011-09-01T00:00:00+02:00
definition: Usine où l'on fabrique différentes sortes de brosses destinées à des usages variés (nettoyage, hygiène corporelle, peintures et vernis, usages industriels, etc.). Elle comprend généralement un entrepôt industriel, un atelier de conditionnement, un magasin industriel, etc.
status: 1

usine liée au travail du bois
type: Concept
modified: 2015-03-11T12:06:21+01:00
in scheme: Thésaurus de la désignation des œuvres architecturales et des espaces aménagés
narrower: brosserie
narrower: scierie
narrower: tonnellerie
narrower: usine d'ébénisterie
narrower: usine de bimbeloterie
narrower: usine de boissellerie
narrower: usine de transformation du liège
narrower: usine de contre-plaqué
narrower: usine de fibre de bois
narrower: usine de menuiserie
narrower: usine de tabletterie
narrower: usine de traitement du bois
broader: usine
created: 2011-09-01T00:00:00+02:00
definition: Usine où l'on traite et travaille le bois, le liège, etc.
status: 1

brûlerie
type: Concept
modified: 2015-01-07T12:11:48+01:00
in scheme: Thésaurus de la désignation des œuvres architecturales et des espaces aménagés
broader: usine de produits agro-alimentaires
created: 2011-09-01T00:00:00+02:00
definition: Usine où l'on grille des cafés en grain. Elle comprend généralement une salle de torréfaction, un atelier de conditionnement, un magasin industriel, etc.
status: 1

buanderie
type: Concept
modified: 2014-12-31T15:33:40+01:00
in scheme: Thésaurus de la désignation des œuvres architecturales et des espaces aménagés
broader: communs
created: 2011-09-01T00:00:00+02:00
scope note: Une buanderie à usage public peut être associée à un lavoir.
related: lavoir
definition: Local où l'on fait la lessive.
TermeAssocie: lavoir
status: 1

lavoir
type: Concept
modified: 2014-12-05T11:51:11+01:00
in scheme: Thésaurus de la désignation des œuvres architecturales et des espaces aménagés
preferred label: washhouses @en-us
broader: édicule de l'administration ou de la vie publique
created: 2011-09-01T00:00:00+02:00
scope note: Il peut être associé à une buanderie.
related: buanderie
definition: Bassin ou aire aménagée le long d’un cours ou d’un plan d’eau, couvert ou en plein air, généralement à usage collectif, où l'on lave le linge.
TermeAssocie: buanderie
status: 1

bûcher
type: Concept
modified: 2014-12-31T15:35:01+01:00
in scheme: Thésaurus de la désignation des œuvres architecturales et des espaces aménagés
preferred label: woodsheds @en-us
broader: communs
alternative label: séchoir à bois
created: 2011-09-01T00:00:00+02:00
definition: Local où l'on abrite le bois de chauffage, généralement ouvert sur un côté pour être correctement ventilé.
status: 1

buffet d'eau
type: Concept
modified: 2014-10-15T12:29:45+02:00
in scheme: Thésaurus de la désignation des œuvres architecturales et des espaces aménagés
broader: fontaine
created: 2011-09-01T00:00:00+02:00
definition: Fontaine monumentale adossée, constituée de vasques ou de bassins superposés en gradins.
status: 1
broad match: Fontaine (bassin)

fontaine
type: Concept
modified: 2015-02-24T15:39:06+01:00
in scheme: Thésaurus de la désignation des œuvres architecturales et des espaces aménagés
preferred label: fountains @en-us
narrower: buffet d'eau
broader: ouvrage lié à l'alimentation en eau
alternative label: fontaine monumentale
created: 2011-09-01T00:00:00+02:00
scope note: On distingue la fontaine adossée et la fontaine isolée. Voir aussi le Thesaurus des objets mobiliers (fontaine, borne-fontaine).
definition: Aménagement monumental d'une arrivée d'eau dans l’espace public, une cour, un jardin, etc. La fontaine comprend généralement un bassin d’ornement ou fait partie du bassin.
status: 1

immeuble de bureaux
type: Concept
modified: 2014-12-04T16:33:48+01:00
in scheme: Thésaurus de la désignation des œuvres architecturales et des espaces aménagés
preferred label: office buildings @en-us
broader: édifice artisanal commercial ou tertiaire
created: 2011-09-01T00:00:00+02:00
related: bureau d'entreprise
definition: Immeuble dont la destination principale est l’activité tertiaire, regroupant des bureaux, des salles de réunion, etc.
TermeAssocie: bureau d'entreprise
status: 1

bureau d'embauche
type: Concept
modified: 2014-10-20T09:48:17+02:00
in scheme: Thésaurus de la désignation des œuvres architecturales et des espaces aménagés
broader: édifice d'assistance ou de protection sociale
created: 2011-09-01T00:00:00+02:00
definition: Bâtiment ou local où s'effectue le recrutement du personnel d'une entreprise, d'un chantier, d'un port, etc.
status: 1

édifice d'assistance ou de protection sociale
type: Concept
modified: 2013-04-23T00:00:00+02:00
in scheme: Thésaurus de la désignation des œuvres architecturales et des espaces aménagés
narrower: établissement de bienfaisance
narrower: bureau d'embauche
narrower: centre social
narrower: dépôt de mendicité
narrower: foyer
narrower: garderie d'enfants
narrower: établissement pour les handicapés physiques
narrower: maison de retraite
narrower: hospice
broader: édifice hospitalier d'assistance ou de protection sociale
created: 2011-09-01T00:00:00+02:00
related: caisse d'épargne
related: mont-de-piété
definition: Construction ou groupe de constructions abritant des activités d'assistance privée, religieuse ou civile, ou de protection sociale.
TermeAssocie: caisse d'épargne
TermeAssocie: mont-de-piété
status: 1

bureau d'études
type: Concept
modified: 2015-03-25T16:42:44+01:00
in scheme: Thésaurus de la désignation des œuvres architecturales et des espaces aménagés
broader: parties industrielles
created: 2011-09-01T00:00:00+02:00
definition: Bâtiment ou local où sont effectués les divers travaux d'études techniques nécessaires à la fabrication d’un produit.
status: 1

bureau de douane
type: Concept
modified: 2015-01-02T11:04:43+01:00
in scheme: Thésaurus de la désignation des œuvres architecturales et des espaces aménagés
preferred label: customhouses @en-us
broader: édifice fiscal
alternative label: douane
alternative label: hôtel des douanes
created: 2011-09-01T00:00:00+02:00
definition: Édifice où est établie l'administration des douanes chargée du recouvrement des droits imposés sur les marchandises, à la sortie ou à l'entrée d'un territoire national.
status: 1

butte artificielle
type: Concept
modified: 2014-12-31T11:24:46+01:00
in scheme: Thésaurus de la désignation des œuvres architecturales et des espaces aménagés
broader: relief artificiel de jardin
created: 2011-09-01T00:00:00+02:00
definition: Levée de terre dont le sommet est généralement aplani.
status: 1

buvette
type: Concept
modified: 2014-10-06T13:07:03+02:00
in scheme: Thésaurus de la désignation des œuvres architecturales et des espaces aménagés
broader: débit de boissons
created: 2011-09-01T00:00:00+02:00
definition: Dans un espace public, édicule destiné à la vente de boissons ou de nourriture.
status: 1

débit de boissons
type: Concept
modified: 2014-12-04T15:47:08+01:00
in scheme: Thésaurus de la désignation des œuvres architecturales et des espaces aménagés
narrower: buvette
narrower: café
narrower: salon de thé
broader: édifice artisanal commercial ou tertiaire
created: 2011-09-01T00:00:00+02:00
definition: Établissement où l'on vend des boissons à consommer sur place.
status: 1

cabane de jardin
type: Concept
modified: 2014-12-30T15:23:27+01:00
in scheme: Thésaurus de la désignation des œuvres architecturales et des espaces aménagés
broader: construction de jardin
created: 2011-09-01T00:00:00+02:00
definition: Fabrique rustique en bois, en pierre sèche ou en matériaux artificiels, parfois couverte en chaume. Elle peut servir à abriter le promeneur ou à entreposer des outils de jardinage.
status: 1

cabaret
type: Concept
modified: 2014-12-19T11:06:51+01:00
in scheme: Thésaurus de la désignation des œuvres architecturales et des espaces aménagés
broader: salle de spectacle
alternative label: café-concert
alternative label: music-hall
created: 2011-09-01T00:00:00+02:00
definition: Établissement où l'on présente un spectacle et où la clientèle peut consommer des boissons, dîner, danser.
status: 1

cabine de bain
type: Concept
modified: 2014-12-12T11:09:32+01:00
in scheme: Thésaurus de la désignation des œuvres architecturales et des espaces aménagés
preferred label: bathhouses @en-us
broader: édicule de culture recherche sport ou loisir
created: 2011-09-01T00:00:00+02:00
scope note: Voir aussi le Thesaurus des objets mobiliers.
definition: Édicule ou petit réduit où l'on se change pour le bain en piscine ou dans la mer.
status: 1
broad match: Mobilier de plage

cabinet-pièce
type: Concept
modified: 2014-12-31T16:13:57+01:00
in scheme: Thésaurus de la désignation des œuvres architecturales et des espaces aménagés
preferred label: cabinets (rooms) @en-us
broader: logis
created: 2011-09-01T00:00:00+02:00
definition: Petite pièce où l'on peut s'isoler, notamment dans l'architecture médiévale et moderne. Elle peut accueillir des activités liées au travail, à la détente, etc.
status: 1

logis
type: Concept
modified: 2014-10-20T10:41:39+02:00
in scheme: Thésaurus de la désignation des œuvres architecturales et des espaces aménagés
narrower: cabinet-pièce
narrower: chambre
narrower: cuisine
narrower: jardin d'hiver
narrower: latrine
narrower: salle
narrower: salle à manger
narrower: salle de bains
narrower: salon
broader: partie d'édifice domestique
created: 2011-09-01T00:00:00+02:00
related: logement
definition: Partie de la demeure contenant le ou les appartements. On ne parle de corps de logis que lorsque les appartements sont groupés dans un seul corps de bâtiment.
TermeAssocie: logement
status: 1

câblerie
type: Concept
modified: 2015-01-28T12:02:36+01:00
in scheme: Thésaurus de la désignation des œuvres architecturales et des espaces aménagés
broader: usine de construction électrique
created: 2011-09-01T00:00:00+02:00
definition: Usine où l'on fabrique les fils et les câbles électriques, et comprenant généralement un atelier de conditionnement, un magasin industriel, une aire des produits manufacturés, etc.
status: 1

usine de construction électrique
type: Concept
modified: 2015-04-28T14:57:57+02:00
in scheme: Thésaurus de la désignation des œuvres architecturales et des espaces aménagés
narrower: câblerie
narrower: usine de matériel électrique industriel
narrower: usine de matériel électroménager
narrower: usine de matériel radioélectrique
narrower: usine de petit matériel électrique
broader: usine
created: 2011-09-01T00:00:00+02:00
definition: Usine où l'on fabrique divers matériels électriques, industriels ou domestiques.
status: 1

café
type: Concept
modified: 2014-12-04T16:00:12+01:00
in scheme: Thésaurus de la désignation des œuvres architecturales et des espaces aménagés
preferred label: cafés (restaurants) @en-us
broader: débit de boissons
alternative label: bar
created: 2011-09-01T00:00:00+02:00
scope note: Le décor d'une salle de café ou de sa devanture fait l’objet d’un dossier objet mobilier.
definition: Lieu de convivialité organisé primitivement autour de la consommation du café et, par la suite, de tout type de boissons.
status: 1

cairn
type: Concept
modified: 2015-02-24T16:24:50+01:00
in scheme: Thésaurus de la désignation des œuvres architecturales et des espaces aménagés
preferred label: cairns @en-us
preferred label: galgal
preferred label: burial cairn @en-gb
broader: tumulus
created: 2011-09-01T00:00:00+02:00
definition: Tumulus construit en pierres sèches.
status: 1

tumulus
type: Concept
modified: 2015-02-24T16:23:16+01:00
in scheme: Thésaurus de la désignation des œuvres architecturales et des espaces aménagés
preferred label: tumulo @it
preferred label: barrow
preferred label: burial mounds @en-us
narrower: cairn
broader: mégalithe
alternative label: montissel
alternative label: dolmen sous tumulus
created: 2011-09-01T00:00:00+02:00
scope note: Ne pas confondre avec motte.
definition: Tertre artificiel recouvrant une ou plusieurs tombes. Son entrée est quelquefois précédée par une aire semi-circulaire délimitée par deux murs ou deux rangées de pierres dressées appelées antennes.
status: 1

caisse d'épargne
type: Concept
modified: 2015-01-02T10:52:41+01:00
in scheme: Thésaurus de la désignation des œuvres architecturales et des espaces aménagés
preferred label: saving banks @en-us
broader: édifice financier public
created: 2011-09-01T00:00:00+02:00
related: édifice d'assistance ou de protection sociale
definition: Établissement financier à l'origine lié à la protection sociale, ayant pour objet de recevoir en dépôt de petites sommes et de les faire fructifier.
TermeAssocie: édifice d'assistance ou de protection sociale
status: 1

cale
type: Concept
modified: 2014-12-01T14:15:49+01:00
in scheme: Thésaurus de la désignation des œuvres architecturales et des espaces aménagés
preferred label: slipways @en-us
broader: ouvrage d'art
alternative label: slipway
created: 2011-09-01T00:00:00+02:00
scope note: Le slipway est une cale équipée de rails, permettant ainsi de mettre à l'eau ou haler à sec bateau ou hydravion au moyen d'un chariot.
definition: Plan incliné permettant de mettre à l'eau ou de hisser hors de l'eau un bateau ou un hydravion.
status: 1

cale de construction
type: Concept
modified: 2015-03-26T11:48:04+01:00
in scheme: Thésaurus de la désignation des œuvres architecturales et des espaces aménagés
broader: parties industrielles
created: 2011-09-01T00:00:00+02:00
related: usine de construction navale
definition: Dans les chantiers navals, plan incliné sur lequel on construit un navire et d'où on le lance à l'eau.
TermeAssocie: usine de construction navale
status: 1

calvaire monumental
type: Concept
modified: 2015-02-24T11:44:09+01:00
in scheme: Thésaurus de la désignation des œuvres architecturales et des espaces aménagés
preferred label: calvario @it
preferred label: calvary crosses + monuments @en-us
preferred label: calvary @en-gb
broader: édicule religieux chrétien
alternative label: calvaire extérieur
alternative label: croix calvaire
created: 2011-09-01T00:00:00+02:00
scope note: Ne pas appeler calvaire une croix isolée ; ne pas confondre avec mont calvaire. Voir aussi le Thesaurus des objets mobiliers.
definition: Groupe sculpté, et par extension l’édicule qui peut l’abriter, représentant un Christ en croix, au pied duquel se tiennent les personnages de la Passion, au moins la Vierge et saint Jean.
status: 1

édicule religieux chrétien
type: Concept
modified: 2015-02-24T11:42:54+01:00
in scheme: Thésaurus de la désignation des œuvres architecturales et des espaces aménagés
preferred label: christian + religious structures @en-us
narrower: calvaire monumental
narrower: croix monumentale
narrower: grotte de Lourdes
narrower: oratoire
narrower: reposoir
narrower: sanctuaire de plein air
narrower: fontaine de dévotion
broader: édicule religieux
created: 2011-09-01T00:00:00+02:00
scope note: Voir aussi le Thesaurus des objets mobiliers.
definition: Construction autonome non habitable liée à la religion chrétienne.
status: 1

camp
type: Concept
modified: 2015-01-05T11:03:35+01:00
in scheme: Thésaurus de la désignation des œuvres architecturales et des espaces aménagés
preferred label: army camp @en-gb
preferred label: military camps @en-us
broader: édifice fortifié
created: 2011-09-01T00:00:00+02:00
scope note: Préciser éventuellement dans la désignation : camp de manœuvres.
definition: Terrain entouré d'une ligne de défense pour le stationnement d'une armée.
status: 1

édifice fortifié
type: Concept
modified: 2015-01-05T11:29:17+01:00
in scheme: Thésaurus de la désignation des œuvres architecturales et des espaces aménagés
narrower: camp
narrower: château fort
narrower: forteresse
narrower: fort
broader: édifice militaire
created: 2011-09-01T00:00:00+02:00
definition: Édifice militaire muni d'ouvrages ou d'éléments de défense.
status: 1

camp de concentration
type: Concept
modified: 2015-01-05T10:55:46+01:00
in scheme: Thésaurus de la désignation des œuvres architecturales et des espaces aménagés
preferred label: concentration camps @en-us
broader: ensemble judiciaire pénitentiaire ou de police
alternative label: camp d'internement
created: 2011-09-01T00:00:00+02:00
definition: Camp où une autorité publique décide de regrouper les étrangers, les réfugiés et les individus considérés comme ennemis du régime en place. Il peut comprendre les installations nécessaires à la vie du groupe et du personnel de surveillance.
status: 1

campanile
type: Concept
modified: 2015-02-25T11:57:02+01:00
in scheme: Thésaurus de la désignation des œuvres architecturales et des espaces aménagés
broader: clocher
created: 2011-09-01T00:00:00+02:00
scope note: Ne pas appeler campanile un clocher isolé. Ne pas confondre avec beffroi de charpente. Voir aussi le Thesaurus des objets mobiliers.
definition: Clocher formant édicule sur le faîte d'un bâtiment. Il est souvent construit en charpente.
status: 1
broad match: http://data.bnf.fr/ark:/12148/cb11934126d
broad match: http://vocab.getty.edu/aat/300004848
broad match: Clocher

clocher
type: Concept
modified: 2015-02-25T11:55:45+01:00
in scheme: Thésaurus de la désignation des œuvres architecturales et des espaces aménagés
preferred label: bell towers (churches) @en-us
narrower: campanile
broader: couverture et accessoire du toit
created: 2011-09-01T00:00:00+02:00
scope note: Ne pas appeler clocher la tour d'une église qui n'est pas destinée à porter des cloches. Voir aussi le Thesaurus des objets mobiliers.
definition: Ouvrage destiné à recevoir les cloches. Certaines tours sont des clochers (tour-clocher).
status: 1

campement
type: Concept
modified: 2014-12-31T13:51:13+01:00
in scheme: Thésaurus de la désignation des œuvres architecturales et des espaces aménagés
broader: ensemble domestique
created: 2011-09-01T00:00:00+02:00
definition: Espace accueillant des unités d’habitation démontables ou mobiles.
status: 1

camping
type: Concept
modified: 2014-12-19T11:19:47+01:00
in scheme: Thésaurus de la désignation des œuvres architecturales et des espaces aménagés
preferred label: campgrounds @en-us
broader: ensemble de culture recherche sport ou loisir
created: 2011-09-01T00:00:00+02:00
definition: Terrain aménagé comprenant les services et infrastructures destinés à accueillir des résidences secondaires mobiles ou démontables (tentes, caravanes, etc.).
status: 1

campus universitaire
type: Concept
modified: 2014-10-16T10:33:27+02:00
in scheme: Thésaurus de la désignation des œuvres architecturales et des espaces aménagés
preferred label: Campuses @en-us
broader: ensemble scolaire
alternative label: campus
created: 2011-09-01T00:00:00+02:00
related: quartier
related: université
related: cité universitaire
definition: Complexe d’enseignement supérieur, généralement planifié, réunissant les édifices d’enseignement, de logement, de restauration, de loisir, de sport, etc., utiles à la vie des étudiants.
TermeAssocie: quartier
TermeAssocie: université
TermeAssocie: cité universitaire
status: 1

quartier
type: Concept
modified: 2015-01-08T10:46:20+01:00
in scheme: Thésaurus de la désignation des œuvres architecturales et des espaces aménagés
preferred label: circoscrizione @it
preferred label: town quarter @en-gb
preferred label: quarters @en-us
narrower: centre-ville
narrower: forum
narrower: marina
narrower: technopole
narrower: village olympique
broader: secteur urbain
created: 2011-09-01T00:00:00+02:00
related: campus universitaire
related: cité universitaire
related: quartier canonial
definition: Secteur urbain présentant une certaine unité architecturale, sociale, économique, fonctionnelle, etc.
TermeAssocie: campus universitaire
TermeAssocie: cité universitaire
TermeAssocie: quartier canonial
status: 1

université
type: Concept
modified: 2014-12-01T17:22:10+01:00
in scheme: Thésaurus de la désignation des œuvres architecturales et des espaces aménagés
preferred label: universities @en-us
broader: édifice d'enseignement supérieur
created: 2011-09-01T00:00:00+02:00
related: campus universitaire
definition: Édifice dans lequel sont dispensés des cours d'enseignement supérieur. Il regroupe des salles de cours, des amphithéâtres d'enseignement, des services administratifs, la bibliothèque, etc.
TermeAssocie: campus universitaire
status: 1

cité universitaire
type: Concept
modified: 2014-12-31T13:56:08+01:00
in scheme: Thésaurus de la désignation des œuvres architecturales et des espaces aménagés
preferred label: campuses @en-us
broader: ensemble domestique
alternative label: résidence universitaire
created: 2011-09-01T00:00:00+02:00
related: campus universitaire
related: quartier
definition: Complexe, généralement planifié, réunissant les édifices utiles à la vie des étudiants en dehors de leurs activités de formation (logements, lieux culturels et sportifs, etc.).
TermeAssocie: campus universitaire
TermeAssocie: quartier
status: 1

canal
type: Concept
modified: 2014-12-01T12:54:44+01:00
in scheme: Thésaurus de la désignation des œuvres architecturales et des espaces aménagés
preferred label: canals @en-us
narrower: canal d'irrigation
narrower: canal de navigation
broader: ensemble du génie civil
created: 2011-09-01T00:00:00+02:00
scope note: Ne pas confondre avec rivière aménagée.
definition: Cours d'eau artificiel de section ouverte, navigable ou non. On distingue les canaux qui servent à transporter de l'eau (canaux d'alimentation, de drainage, d'irrigation, etc.) et les canaux où l'eau sert à porter des engins de transport (canaux de navigation).
status: 1

canal d'irrigation
type: Concept
modified: 2014-12-01T12:57:28+01:00
in scheme: Thésaurus de la désignation des œuvres architecturales et des espaces aménagés
preferred label: Irrigation systems @en-us
broader: canal
created: 2011-09-01T00:00:00+02:00
related: réseau d'irrigation
definition: Canal ayant pour but d’acheminer de l’eau d’un cours d’eau, d’un réservoir, etc. afin d’irriguer des terres. Il est équipé d’ouvrages hydrauliques (vannes, etc.) afin de garantir le débit, distribuer et gérer la ressource.
TermeAssocie: réseau d'irrigation
status: 1

canal de navigation
type: Concept
modified: 2014-12-01T13:07:15+01:00
in scheme: Thésaurus de la désignation des œuvres architecturales et des espaces aménagés
broader: canal
alternative label: canal à point de partage
alternative label: canal de dérivation
alternative label: canal latéral
created: 2011-09-01T00:00:00+02:00
related: voie navigable
definition: Canal créé pour le transport des biens et des personnes sur des bateaux. On distingue : - le canal latéral qui est une simple doublure, prenant l’eau dans un cours d’eau en amont et la lui restituant en aval ; - le canal de dérivation qui permet de passer d’un cours d’eau plus élevé dans un autre plus bas ; - le canal à point de partage, c’est-à-dire à deux pentes, reliant deux bassins versants, deux cours d’eau séparés par un relief.
TermeAssocie: voie navigable
status: 1
broad match: cb11937681n
broad match: http://vocab.getty.edu/aat/300006075
broad match: Canal (voie d'eau)

réseau d'irrigation
type: Concept
modified: 2014-10-06T12:01:57+02:00
in scheme: Thésaurus de la désignation des œuvres architecturales et des espaces aménagés
preferred label: irrigation systems @en-us
broader: ensemble agricole
created: 2011-09-01T00:00:00+02:00
related: canal d'irrigation
definition: Réseau d'installations nécessaires à l'irrigation des terres agricoles. Il peut comprendre un réservoir, des canaux d’irrigation, des vannes, etc.
TermeAssocie: canal d'irrigation
status: 1
narrow match: http://data.bnf.fr/ark:/12148/cb120187653

canal de jardin
type: Concept
modified: 2014-12-31T10:18:14+01:00
in scheme: Thésaurus de la désignation des œuvres architecturales et des espaces aménagés
broader: pièce d'eau
created: 2011-09-01T00:00:00+02:00
definition: Grand bassin étroit et allongé. La tête de canal est la fontaine de ce bassin, adossée à une des extrémités.
status: 1

caniveau
type: Concept
modified: 2015-01-07T12:35:02+01:00
in scheme: Thésaurus de la désignation des œuvres architecturales et des espaces aménagés
preferred label: gutters @en-us
broader: voie
alternative label: drain @en-us
created: 2011-09-01T00:00:00+02:00
definition: Dans une rue, ouvrage latéral ou central, destiné à recueillir les eaux s’écoulant de la chaussée, du trottoir ou de tout autre espace libre. Un caniveau central est aussi appelé ruisseau.
status: 1

cantine
type: Concept
modified: 2015-02-25T11:31:18+01:00
in scheme: Thésaurus de la désignation des œuvres architecturales et des espaces aménagés
preferred label: lunchrooms @en-us
broader: partie ou élément commun à tous les types d'architecture et aux espaces aménagés
alternative label: restaurant administratif
alternative label: mess
created: 2011-09-01T00:00:00+02:00
scope note: Ne pas confondre avec réfectoire.
definition: Édifice ou partie d'édifice où les élèves, les militaires, le personnel d'une entreprise, etc. prennent leurs repas. Le mess est réservé aux officiers et sous-officiers.
status: 1

carré de jardin
type: Concept
modified: 2014-10-22T10:16:18+02:00
in scheme: Thésaurus de la désignation des œuvres architecturales et des espaces aménagés
broader: découvert de jardin
created: 2011-09-01T00:00:00+02:00
definition: Pièce découverte de plan carré isolée par un passe-pied, parfois limitée par une bordure et parfois constituée de planches de jardin. Selon sa destination, on distingue le carré de potager (carré de légumes) et le carré de jardin d'agrément.
status: 1

carrefour
type: Concept
modified: 2015-01-07T12:01:37+01:00
in scheme: Thésaurus de la désignation des œuvres architecturales et des espaces aménagés
preferred label: crossroads, road junction @en-gb
preferred label: intersections @en-us
narrower: carrefour giratoire
narrower: carrefour en demi-étoile
narrower: échangeur
narrower: carrefour en étoile
narrower: carrefour en patte d'oie
broader: espace libre
alternative label: croisement
created: 2011-09-01T00:00:00+02:00
definition: Lieu du croisement de plusieurs voies.
status: 1

espace libre
type: Concept
modified: 2014-09-24T11:29:08+02:00
in scheme: Thésaurus de la désignation des œuvres architecturales et des espaces aménagés
preferred label: urban spaces @en-gb
narrower: voie
narrower: carrefour
narrower: place
narrower: espace public à usage privé
narrower: ruelle d'écoulement
broader: urbanisme et espaces aménagés
alternative label: voirie
created: 2011-09-01T00:00:00+02:00
related: espace vert
definition: Aménagement hors sol destiné notamment à la circulation, à la déambulation, parfois à des fonctions de détente ou d'usage privatif.
TermeAssocie: espace vert
status: 1

carrefour giratoire
type: Concept
modified: 2015-01-07T11:59:33+01:00
in scheme: Thésaurus de la désignation des œuvres architecturales et des espaces aménagés
preferred label: roundabout @en-gb
preferred label: traffic circles @en-us
broader: carrefour
alternative label: rond-point
created: 2011-09-01T00:00:00+02:00
definition: Carrefour de forme circulaire ou ovale dont le centre est constitué d'un îlot que doivent contourner les véhicules.
status: 1

carrefour en demi-étoile
type: Concept
modified: 2014-10-17T14:30:20+02:00
in scheme: Thésaurus de la désignation des œuvres architecturales et des espaces aménagés
broader: carrefour
created: 2011-09-01T00:00:00+02:00
definition: Carrefour à plus de trois branches rayonnantes formant ensemble un angle de 180°.
status: 1
broad match: Carrefour .C3.A0 branches multiples

échangeur
type: Concept
modified: 2014-10-17T14:34:19+02:00
in scheme: Thésaurus de la désignation des œuvres architecturales et des espaces aménagés
preferred label: interchanges @en-us
broader: carrefour
created: 2011-09-01T00:00:00+02:00
definition: Carrefour dont l'une des artères au moins est une autoroute ou une voie rapide.
status: 1
broad match: http://data.bnf.fr/ark:/12148/cb119328098

carrefour en étoile
type: Concept
modified: 2014-11-18T12:39:52+01:00
in scheme: Thésaurus de la désignation des œuvres architecturales et des espaces aménagés
broader: carrefour
created: 2011-09-01T00:00:00+02:00
definition: Système de voies établies comme autant de rayons orientés vers un même point, comportant au minimum cinq voies.
status: 1
broad match: Carrefour

carrefour en patte d'oie
type: Concept
modified: 2014-10-17T14:32:01+02:00
in scheme: Thésaurus de la désignation des œuvres architecturales et des espaces aménagés
broader: carrefour
alternative label: carrefour en trident
created: 2011-09-01T00:00:00+02:00
scope note: Une patte d’oie formée de trois voies séparées par les mêmes angles aigus est appelée trident.
definition: Point d'embranchement de plusieurs routes.
status: 1

excavation
type: Concept
modified: 2015-03-27T16:19:06+01:00
in scheme: Thésaurus de la désignation des œuvres architecturales et des espaces aménagés
broader: parties industrielles
created: 2011-09-01T00:00:00+02:00
related: carrière
definition: Dans un terrain, cavité provoquée par l'exploitation d'une carrière.
TermeAssocie: carrière
status: 1

usine d'extraction
type: Concept
modified: 2015-04-28T14:19:18+02:00
in scheme: Thésaurus de la désignation des œuvres architecturales et des espaces aménagés
narrower: carrière
narrower: puits de pétrole
narrower: marais salant
narrower: mine
narrower: puits de gaz naturel
narrower: saline
narrower: usine de préparation de produit minéral
narrower: usine de taille de matériaux de construction
narrower: usine de taille de pierre pour la joaillerie et l'industrie
broader: usine
created: 2011-09-01T00:00:00+02:00
definition: Usine où l'on extrait du sol ou du sous-sol différentes matières premières (sable, pierre, charbon, minerai, etc.) et où on leur fait subir des processus divers de transformation.
status: 1

carrière souterraine
type: Concept
modified: 2015-01-21T15:22:54+01:00
in scheme: Thésaurus de la désignation des œuvres architecturales et des espaces aménagés
broader: carrière
created: 2011-09-01T00:00:00+02:00
definition: Usine souterraine d'extraction de matériaux de construction.
status: 1

cartonnerie
type: Concept
modified: 2015-04-28T15:59:08+02:00
in scheme: Thésaurus de la désignation des œuvres architecturales et des espaces aménagés
broader: usine de papeterie
created: 2011-09-01T00:00:00+02:00
definition: Usine où l'on fabrique divers types de cartons à l'aide de machines à table plate ou de machines à formes rondes (tambours rotatifs). Elle comprend généralement un bureau, un entrepôt industriel, un magasin industriel, etc.
status: 1

usine de papeterie
type: Concept
modified: 2015-04-28T15:52:23+02:00
in scheme: Thésaurus de la désignation des œuvres architecturales et des espaces aménagés
narrower: cartonnerie
narrower: moulin à papier
narrower: usine à papier
narrower: usine d'emballage et conditionnement
narrower: usine de pâte à papier
narrower: usine de façonnage du papier
broader: usine
created: 2011-09-01T00:00:00+02:00
definition: Usine où l'on fabrique et traite le papier, le carton, etc.
status: 1

cascade
type: Concept
modified: 2014-12-30T17:01:55+01:00
in scheme: Thésaurus de la désignation des œuvres architecturales et des espaces aménagés
preferred label: cascades @en-us
broader: chute d'eau
created: 2011-09-01T00:00:00+02:00
definition: Fontaine composée d'une succession de chutes d'eau. La cascatelle est une petite cascade.
status: 1
broad match: http://data.bnf.fr/ark:/12148/cb122040133
broad match: Chute d'eau

chute d'eau
type: Concept
modified: 2014-12-30T16:57:35+01:00
in scheme: Thésaurus de la désignation des œuvres architecturales et des espaces aménagés
preferred label: waterfalls @en-us
narrower: cascade
broader: eaux de jardin
created: 2011-09-01T00:00:00+02:00
definition: Ruissellement d'eau sans pression apparente. La chute d'eau peut être architecturée (sa structure est alors maçonnée) ou champêtre (elle est aménagée au moyen d'artifices divers : rochers naturels ou artificiels, troncs d'arbre, etc.).
status: 1

caserne
type: Concept
modified: 2015-01-05T11:37:08+01:00
in scheme: Thésaurus de la désignation des œuvres architecturales et des espaces aménagés
preferred label: barracks @en-us
narrower: gendarmerie
narrower: quartier de cavalerie
broader: édifice logistique
created: 2011-09-01T00:00:00+02:00
related: caserne de pompiers
related: école militaire
definition: Construction destinée au logement des troupes. La caserne est un édifice isolé ou un bâtiment compris dans un ouvrage de fortification : dans ce dernier cas, elle est souvent casematée.
TermeAssocie: caserne de pompiers
TermeAssocie: école militaire
status: 1

caserne de pompiers
type: Concept
modified: 2014-10-09T11:58:21+02:00
in scheme: Thésaurus de la désignation des œuvres architecturales et des espaces aménagés
preferred label: fire stations @en-us
narrower: remise de matériel d'incendie
broader: édifice de l'administration ou de la vie publique
created: 2011-09-01T00:00:00+02:00
related: caserne
definition: Édifice destiné à abriter le matériel et le personnel de lutte contre les incendies. Il comporte généralement des remises et des garages pour les véhicules, des logements, une tour et des salles d'entraînement, une tour de séchage pour les tuyaux, des bureaux, etc.
TermeAssocie: caserne
status: 1

école militaire
type: Concept
modified: 2014-12-01T16:08:16+01:00
in scheme: Thésaurus de la désignation des œuvres architecturales et des espaces aménagés
preferred label: military academies @en-us
broader: école professionnelle
created: 2011-09-01T00:00:00+02:00
related: caserne
definition: École professionnelle préparant aux carrières militaires.
TermeAssocie: caserne
status: 1

gendarmerie
type: Concept
modified: 2015-01-05T11:41:05+01:00
in scheme: Thésaurus de la désignation des œuvres architecturales et des espaces aménagés
preferred label: policestations @en-us
broader: caserne
created: 2011-09-01T00:00:00+02:00
definition: Édifice destiné aux bureaux et logements des gendarmes.
status: 1

quartier de cavalerie
type: Concept
modified: 2015-01-05T11:42:44+01:00
in scheme: Thésaurus de la désignation des œuvres architecturales et des espaces aménagés
broader: caserne
created: 2011-09-01T00:00:00+02:00
definition: Casernement des unités de cavalerie.
status: 1

remise de matériel d'incendie
type: Concept
modified: 2014-12-05T12:15:14+01:00
in scheme: Thésaurus de la désignation des œuvres architecturales et des espaces aménagés
broader: caserne de pompiers
alternative label: remise de pompiers
alternative label: remise de la pompe à incendie
created: 2011-09-01T00:00:00+02:00
definition: Bâtiment où l'on abrite le matériel nécessaire à la lutte contre le feu.
status: 1
broad match: Caserne de pompiers

casino
type: Concept
modified: 2014-12-12T14:33:58+01:00
in scheme: Thésaurus de la désignation des œuvres architecturales et des espaces aménagés
preferred label: gambling casinos @en-us
broader: édifice et aménagement de culture recherche sport ou loisir
alternative label: salle de jeu
created: 2011-09-01T00:00:00+02:00
definition: Établissement de jeux d’argent et de hasard pourvu ou non d’une salle de spectacle.
status: 1

cathédrale
type: Concept
modified: 2014-11-27T16:08:35+01:00
in scheme: Thésaurus de la désignation des œuvres architecturales et des espaces aménagés
preferred label: cattedrale @it
preferred label: cathedral @en-gb
preferred label: cathedrals (buildings) @en-us
broader: église
alternative label: primatiale
created: 2011-09-01T00:00:00+02:00
scope note: Ne pas appeler cathédrale une église de grandes dimensions qui n'a jamais été le siège d'un évêque. La primatiale est une cathédrale, siège d'un primat.
definition: Église principale d'un diocèse, siège de l'évêque, desservie autrefois par un chapitre de chanoines.
status: 1

ceinture de forts
type: Concept
modified: 2015-01-05T12:11:00+01:00
in scheme: Thésaurus de la désignation des œuvres architecturales et des espaces aménagés
broader: fortification d'agglomération
created: 2011-09-01T00:00:00+02:00
definition: Ensemble constitué par des forts disposés en ceinture autour d'une ville. Le fort de ceinture est généralement affaibli à l'arrière pour que, s'il tombe aux mains de l'ennemi, celui-ci ne puisse s'y retrancher.
status: 1
broad match: cb11931504g
broad match: http://vocab.getty.edu/aat/300006888
broad match: Fort

fortification d'agglomération
type: Concept
modified: 2015-01-05T12:10:11+01:00
in scheme: Thésaurus de la désignation des œuvres architecturales et des espaces aménagés
preferred label: city walls @en-us
narrower: ceinture de forts
broader: fortification
alternative label: rempart de ville
alternative label: enceinte de ville
created: 2011-09-01T00:00:00+02:00
related: enceinte
definition: Ensemble des ouvrages qui concourent à la défense d'une agglomération.
TermeAssocie: enceinte
status: 1

cellier
type: Concept
modified: 2014-12-31T15:38:03+01:00
in scheme: Thésaurus de la désignation des œuvres architecturales et des espaces aménagés
preferred label: wine cellars @en-us
broader: communs
created: 2011-09-01T00:00:00+02:00
scope note: Ne pas confondre avec chai.
definition: Local où l'on garde les réserves alimentaires.
status: 1

cénotaphe
type: Concept
modified: 2015-02-24T14:37:18+01:00
in scheme: Thésaurus de la désignation des œuvres architecturales et des espaces aménagés
preferred label: cenotaph @en-gb
preferred label: cenotaphs @en-us
broader: monument funéraire
created: 2011-09-01T00:00:00+02:00
scope note: Le cénotaphe présente toutes les caractéristiques du tombeau. En cas d'incertitude sur la présence de la sépulture lors de sa construction, employer tombeau. Voir aussi le Thesaurus des objets mobiliers.
definition: Monument funéraire élevé à la mémoire d'un mort, ailleurs que sur le lieu de sa sépulture.
status: 1
broad match: cb11932525p

monument funéraire
type: Concept
modified: 2015-02-24T14:30:31+01:00
in scheme: Thésaurus de la désignation des œuvres architecturales et des espaces aménagés
preferred label: sepulchral monuments @en-us
narrower: mégalithe
narrower: cénotaphe
narrower: tombeau
narrower: mausolée
broader: édifices et édicules funéraires
created: 2011-09-01T00:00:00+02:00
definition: Voir aussi le Thesaurus des objets mobiliers.
definition: Monument élevé à la mémoire d’un ou plusieurs morts.
status: 1

central téléphonique
type: Concept
modified: 2014-11-28T16:08:00+01:00
in scheme: Thésaurus de la désignation des œuvres architecturales et des espaces aménagés
preferred label: telephone exchanges @en-us
broader: édifice du génie civil
created: 2011-09-01T00:00:00+02:00
related: réseau téléphonique
definition: Édifice où aboutissent les circuits téléphoniques d'un groupe d'abonnés.
TermeAssocie: réseau téléphonique
status: 1

réseau téléphonique
type: Concept
modified: 2014-10-17T10:02:31+02:00
in scheme: Thésaurus de la désignation des œuvres architecturales et des espaces aménagés
preferred label: telephone systems @en-us
broader: réseau de communication
created: 2011-09-01T00:00:00+02:00
related: central téléphonique
definition: Réseau de communication n’assurant à l’origine que la transmission de la voix.
TermeAssocie: central téléphonique
status: 1

édifice du génie civil
type: Concept
modified: 2013-04-23T00:00:00+02:00
in scheme: Thésaurus de la désignation des œuvres architecturales et des espaces aménagés
narrower: établissement aéronautique
narrower: établissement portuaire
narrower: central téléphonique
narrower: dépôt d'autobus
narrower: dépôt de tramways
narrower: établissement des eaux
narrower: gare
narrower: gare routière
narrower: pas de tir
narrower: phare
narrower: poste de secours
narrower: remise ferroviaire
narrower: station d'autobus
narrower: station de traitement des déchets
broader: génie civil
alternative label: ponts et chaussées
created: 2011-09-01T00:00:00+02:00
definition: Construction ou groupe de constructions abritant des activités relevant du génie civil (transports publics, distribution d'eau ou d'énergie, etc.).
status: 1

centrale électrique
type: Concept
modified: 2015-02-19T12:18:29+01:00
in scheme: Thésaurus de la désignation des œuvres architecturales et des espaces aménagés
narrower: centrale hydroélectrique
narrower: centrale nucléaire
narrower: centrale solaire
narrower: centrale thermique
broader: usine génératrice d'énergie
created: 2011-09-01T00:00:00+02:00
definition: Usine comprenant l'ensemble des bâtiments et installations nécessaires à la production d'électricité.
status: 1

usine génératrice d'énergie
type: Concept
modified: 2015-02-19T11:37:40+01:00
in scheme: Thésaurus de la désignation des œuvres architecturales et des espaces aménagés
narrower: centrale électrique
narrower: station d'air comprimé
narrower: usine à gaz
broader: usine
created: 2011-09-01T00:00:00+02:00
definition: Usine génératrice d'énergie électrique, d'air comprimé ou de gaz.
status: 1

centrale nucléaire
type: Concept
modified: 2015-02-19T16:26:49+01:00
in scheme: Thésaurus de la désignation des œuvres architecturales et des espaces aménagés
broader: centrale électrique
alternative label: centrale atomique
created: 2011-09-01T00:00:00+02:00
definition: Centrale électrique fonctionnant à l'énergie nucléaire et comprenant un bâtiment réacteur, une salle des machines, une station de pompage ou une tour aéroréfrigérante, un poste de transformation, etc.
status: 1

centrale solaire
type: Concept
modified: 2015-02-19T16:36:43+01:00
in scheme: Thésaurus de la désignation des œuvres architecturales et des espaces aménagés
broader: centrale électrique
created: 2011-09-01T00:00:00+02:00
definition: Centrale électrique fonctionnant à l'énergie solaire.
status: 1

centrale thermique
type: Concept
modified: 2015-02-19T16:58:40+01:00
in scheme: Thésaurus de la désignation des œuvres architecturales et des espaces aménagés
broader: centrale électrique
created: 2011-09-01T00:00:00+02:00
definition: Centrale électrique fonctionnant à l'énergie thermique de combustion et comprenant généralement une chaufferie, une salle des machines, une aire de stockage du combustible, etc.
status: 1

usine marémotrice
type: Concept
modified: 2015-02-19T16:04:39+01:00
in scheme: Thésaurus de la désignation des œuvres architecturales et des espaces aménagés
broader: centrale hydroélectrique
created: 2011-09-01T00:00:00+02:00
definition: Centrale électrique utilisant la force motrice des marées.
status: 1

centre administratif
type: Concept
modified: 2014-10-17T15:35:51+02:00
in scheme: Thésaurus de la désignation des œuvres architecturales et des espaces aménagés
preferred label: administrative centers @en-us
broader: ensemble de l'administration ou de la vie publique
alternative label: cité administrative
created: 2011-09-01T00:00:00+02:00
definition: Complexe regroupant des édifices consacrés à des administrations dépendant de l'État ou des collectivités territoriales.
status: 1
broad match: cb13318747t

centre aéré
type: Concept
modified: 2014-10-17T15:50:02+02:00
in scheme: Thésaurus de la désignation des œuvres architecturales et des espaces aménagés
preferred label: day camps @en-us
broader: centre de loisirs
created: 2011-09-01T00:00:00+02:00
definition: En dehors du temps scolaire, établissement offrant aux enfants des loisirs de proximité, sans assurer d'hébergement.
status: 1

centre de loisirs
type: Concept
modified: 2014-12-12T14:44:55+01:00
in scheme: Thésaurus de la désignation des œuvres architecturales et des espaces aménagés
preferred label: recreation centers @en-us
narrower: centre aéré
narrower: colonie de vacances
broader: édifice et aménagement de culture recherche sport ou loisir
created: 2011-09-01T00:00:00+02:00
definition: Édifice regroupant un certain nombre d'installations permettant de s'adonner à des activités de détente.
status: 1

centre artisanal
type: Concept
modified: 2013-04-23T00:00:00+02:00
in scheme: Thésaurus de la désignation des œuvres architecturales et des espaces aménagés
broader: ensemble artisanal commercial ou tertiaire
created: 2011-09-01T00:00:00+02:00
definition: Complexe regroupant des ateliers, et parfois les logements d’artisans dont les productions peuvent être différenciées.
status: 1

centre commercial
type: Concept
modified: 2014-12-05T11:24:58+01:00
in scheme: Thésaurus de la désignation des œuvres architecturales et des espaces aménagés
preferred label: shopping centers @en-us
broader: ensemble artisanal commercial ou tertiaire
created: 2011-09-01T00:00:00+02:00
definition: Ensemble regroupant des magasins de détail comprenant généralement un magasin à grande surface, des boutiques ou commerces et divers services (telles poste, banque, etc.), et accompagné d'un ou plusieurs parcs de stationnement, dans une zone urbaine ou à proximité.
status: 1

centre culturel
type: Concept
modified: 2014-10-09T13:22:06+02:00
in scheme: Thésaurus de la désignation des œuvres architecturales et des espaces aménagés
preferred label: cultural centers (buildings) @en-us
broader: édifice et aménagement de culture recherche sport ou loisir
alternative label: maison de la culture
created: 2011-09-01T00:00:00+02:00
definition: Édifice public regroupant des salles destinées aux activités culturelles : il peut comprendre salle de théâtre, de cinéma, de répétition, d'exposition et des ateliers, une bibliothèque, etc.
status: 1

centre d'affaires
type: Concept
modified: 2014-10-17T15:15:10+02:00
in scheme: Thésaurus de la désignation des œuvres architecturales et des espaces aménagés
broader: ensemble artisanal commercial ou tertiaire
created: 2011-09-01T00:00:00+02:00
definition: Complexe formé principalement d’édifices destinés à des activités tertiaires et de services nécessaires à son fonctionnement (restaurants, etc.).
status: 1

colonie de vacances
type: Concept
modified: 2014-12-12T14:49:39+01:00
in scheme: Thésaurus de la désignation des œuvres architecturales et des espaces aménagés
preferred label: summer camps @en-us
broader: centre de loisirs
created: 2011-09-01T00:00:00+02:00
definition: Établissement, privé ou public, accueillant pour plusieurs jours des groupes d'enfants, leur assurant des loisirs durant les vacances scolaires.
status: 1

centre hospitalier universitaire
type: Concept
modified: 2015-01-02T12:28:27+01:00
in scheme: Thésaurus de la désignation des œuvres architecturales et des espaces aménagés
preferred label: teaching hospitals @en-us
broader: ensemble hospitalier d'assistance ou de protection sociale
alternative label: CHU
created: 2011-09-01T00:00:00+02:00
definition: Centre hospitalier lié à une université, permettant la formation théorique et pratique des futurs professionnels médicaux. Il comporte donc des locaux d'enseignement situés à proximité des départements hospitaliers. Il peut regrouper des logements pour étudiants, etc.
status: 1

centre paroissial
type: Concept
modified: 2014-11-28T13:01:47+01:00
in scheme: Thésaurus de la désignation des œuvres architecturales et des espaces aménagés
preferred label: Parish houses @en-us
broader: ensemble religieux
alternative label: foyer paroissial
created: 2011-09-01T00:00:00+02:00
related: salle paroissiale
definition: Ensemble composé de l'église, du presbytère et de différents bâtiments annexes (salle de réunion, école, salle des fêtes, centre sportif, etc.).
TermeAssocie: salle paroissiale
status: 1

salle paroissiale
type: Concept
modified: 2014-12-19T10:56:25+01:00
in scheme: Thésaurus de la désignation des œuvres architecturales et des espaces aménagés
preferred label: parish houses @en-us
broader: salle des fêtes
created: 2011-09-01T00:00:00+02:00
related: centre paroissial
definition: Bâtiment destiné à accueillir les activités sociales ou culturelles de la paroisse. Il est souvent situé dans le même enclos que l'église ou le presbytère.
TermeAssocie: centre paroissial
status: 1

centre social
type: Concept
modified: 2015-01-02T11:19:02+01:00
in scheme: Thésaurus de la désignation des œuvres architecturales et des espaces aménagés
broader: édifice d'assistance ou de protection sociale
alternative label: centre socio-culturel
created: 2011-09-01T00:00:00+02:00
scope note: Ne pas confondre avec centre d'action sociale qui est un établissement administratif chargé de l'assistance sociale dans une collectivité territoriale.
definition: Édifice offrant à une population de proximité des activités et des services à vocation sociale, familiale, culturelle, etc.
status: 1

centre-ville
type: Concept
modified: 2015-01-08T10:37:56+01:00
in scheme: Thésaurus de la désignation des œuvres architecturales et des espaces aménagés
preferred label: downtowns @en-us
broader: quartier
created: 2011-09-01T00:00:00+02:00
definition: Quartier caractérisé par la forte continuité et la densité du bâti, regroupant généralement les principaux équipements collectifs et édifices commerciaux d'une agglomération.
status: 1

cercle de sociabilité
type: Concept
modified: 2014-12-12T10:48:54+01:00
in scheme: Thésaurus de la désignation des œuvres architecturales et des espaces aménagés
preferred label: clubhouses @en-us
broader: siège d'association ou d'organisation
alternative label: cercle
created: 2011-09-01T00:00:00+02:00
scope note: Ne pas confondre avec club-house.
definition: Édifice réunissant un certain nombre de services à l'usage des membres d'une association née d'un intérêt commun ou plus généralement du désir d'occuper leurs loisirs en société.
status: 1

chai
type: Concept
modified: 2015-03-26T12:58:29+01:00
in scheme: Thésaurus de la désignation des œuvres architecturales et des espaces aménagés
broader: parties industrielles
created: 2011-09-01T00:00:00+02:00
scope note: Ne pas confondre avec cellier.
related: distillerie
related: établissement vinicole
definition: Bâtiment ou local où l'on garde le vin ou les eaux-de-vie en fûts.
TermeAssocie: distillerie
TermeAssocie: établissement vinicole
status: 1

distillerie
type: Concept
modified: 2015-01-08T15:45:03+01:00
in scheme: Thésaurus de la désignation des œuvres architecturales et des espaces aménagés
broader: usine de produits agro-alimentaires
created: 2011-09-01T00:00:00+02:00
related: chai
definition: Usine où l'on distille certains produits (betteraves, grains, fruits, vins, etc.) pour obtenir des eaux-de-vie, des liqueurs, etc. Elle comprend généralement un chai, un magasin industriel, un réservoir industriel, etc.
TermeAssocie: chai
status: 1

établissement vinicole
type: Concept
modified: 2015-04-29T14:50:28+02:00
in scheme: Thésaurus de la désignation des œuvres architecturales et des espaces aménagés
narrower: établissement de vins spéciaux
broader: usine de produits agro-alimentaires
alternative label: coopérative vinicole
created: 2011-09-01T00:00:00+02:00
related: chai
related: cuvage
definition: Établissement où l'on produit du vin, suivant différentes opérations de vinification (traitement mécanique de la vendange, fermentation, conservation, etc.). Il comprend généralement un cuvage, un laboratoire, un magasin industriel, etc.
TermeAssocie: chai
TermeAssocie: cuvage
status: 1

chaîne d'écluses
type: Concept
modified: 2014-10-23T12:23:04+02:00
in scheme: Thésaurus de la désignation des œuvres architecturales et des espaces aménagés
broader: voie navigable
alternative label: escalier d'eau
created: 2011-09-01T00:00:00+02:00
scope note: Ne pas confondre avec site d’écluse, ni avec échelle d'écluses.
definition: Sur une portion de voie navigable, succession d'écluses à sas et de biefs formant un ensemble hydraulique cohérent.
status: 1
broad match: http://vocab.getty.edu/aat/300235059
broad match: http://data.bnf.fr/ark:/12148/cb124445427
broad match: Écluse

chaire à prêcher extérieure
type: Concept
modified: 2014-10-15T17:12:05+02:00
in scheme: Thésaurus de la désignation des œuvres architecturales et des espaces aménagés
preferred label: pulpito esterno @it
preferred label: exterior + pulpits @en-us
preferred label: pulpit @en-gb
broader: partie d'église
created: 2011-09-01T00:00:00+02:00
definition: Chaire placée sur un des murs extérieurs de l'église pour l'enseignement religieux en plein air.
status: 1
broad match: Chaire (église)

chambre
type: Concept
modified: 2014-12-31T16:15:57+01:00
in scheme: Thésaurus de la désignation des œuvres architecturales et des espaces aménagés
preferred label: bedrooms @en-us
broader: logis
created: 2011-09-01T00:00:00+02:00
definition: À l'origine, il s'agit de la pièce d'habitation par excellence, sans fonction plus précise. Par la suite, pièce consacrée au sommeil et aux activités de lever et de coucher : habillement, toilette, etc.
status: 1

chambre de commerce
type: Concept
modified: 2014-12-12T10:51:51+01:00
in scheme: Thésaurus de la désignation des œuvres architecturales et des espaces aménagés
narrower: siège de corporation
broader: siège d'association ou d'organisation
created: 2011-09-01T00:00:00+02:00
definition: Édifice abritant les réunions et les services de l'assemblée représentative des commerçants auprès des pouvoirs publics.
status: 1

siège de corporation
type: Concept
modified: 2014-12-12T10:52:57+01:00
in scheme: Thésaurus de la désignation des œuvres architecturales et des espaces aménagés
preferred label: guildhalls @en-us
broader: chambre de commerce
created: 2011-09-01T00:00:00+02:00
definition: Sous l'Ancien Régime, édifice où se réunissent les membres d'une corporation d'artisans, groupés en vue de réglementer leur profession et de défendre leurs intérêts.
status: 1

chambre froide
type: Concept
modified: 2015-03-26T13:04:12+01:00
in scheme: Thésaurus de la désignation des œuvres architecturales et des espaces aménagés
broader: parties industrielles
created: 2011-09-01T00:00:00+02:00
definition: Pièce ou bâtiment maintenu à basse température, servant généralement à la conservation des denrées périssables.
status: 1

chamoiserie
type: Concept
modified: 2015-04-28T16:34:53+02:00
in scheme: Thésaurus de la désignation des œuvres architecturales et des espaces aménagés
broader: tannerie
created: 2011-09-01T00:00:00+02:00
definition: Usine où l'on pratique le tannage à l'huile de poisson des peaux qui seront utilisées dans la ganterie, la maroquinerie, la chapellerie ou pour les articles de nettoyage. Elle comprend généralement un entrepôt industriel, une pièce de séchage, etc.
status: 1

tannerie
type: Concept
modified: 2014-12-08T11:41:50+01:00
in scheme: Thésaurus de la désignation des œuvres architecturales et des espaces aménagés
narrower: chamoiserie
narrower: mégisserie
narrower: moulin à tan
broader: usine de peausserie
created: 2011-09-01T00:00:00+02:00
definition: Usine où l'on traite les peaux mécaniquement et chimiquement à l'aide de tanin ou de produits de synthèse, pour les rendre souples et imputrescibles. Elle comprend généralement des cuves de trempage, des tonneaux de tannage, une pièce de séchage, etc.
status: 1

champ de bataille
type: Concept
modified: 2015-01-05T12:04:08+01:00
in scheme: Thésaurus de la désignation des œuvres architecturales et des espaces aménagés
preferred label: battlefields @en-us
broader: ensemble militaire
created: 2011-09-01T00:00:00+02:00
definition: Lieu d'un affrontement militaire, qui peut en conserver les traces (tranchées, casemates, trous d'obus, etc.), et habituellement ponctué d'un ou plusieurs lieux de mémoire, témoins ou monuments.
status: 1

champ de foire
type: Concept
modified: 2014-12-05T11:22:29+01:00
in scheme: Thésaurus de la désignation des œuvres architecturales et des espaces aménagés
preferred label: fairgrounds @en-us
broader: ensemble artisanal commercial ou tertiaire
created: 2011-09-01T00:00:00+02:00
related: parc d'exposition
related: marché
definition: Espace libre destiné à un grand marché public qui se tient à date fixe, avec une périodicité variable.
TermeAssocie: parc d'exposition
TermeAssocie: marché
status: 1

parc d'exposition
type: Concept
modified: 2014-10-17T15:18:12+02:00
in scheme: Thésaurus de la désignation des œuvres architecturales et des espaces aménagés
preferred label: exhibition buildings @en-us
broader: ensemble artisanal commercial ou tertiaire
created: 2011-09-01T00:00:00+02:00
related: champ de foire
definition: Espace où sont rassemblées pour être présentées au public, en plein air ou à l'intérieur de constructions appelées pavillons d’exposition , les réalisations des arts ou de l'industrie.
TermeAssocie: champ de foire
status: 1

marché
type: Concept
modified: 2014-12-05T10:24:55+01:00
in scheme: Thésaurus de la désignation des œuvres architecturales et des espaces aménagés
preferred label: markets (structures) @en-us
narrower: marché couvert
broader: édifice artisanal commercial ou tertiaire
created: 2011-09-01T00:00:00+02:00
related: champ de foire
related: entrepôt public
definition: Espace public ou édifice où l'on vend toutes sortes de marchandises, sur des étals fixes ou mobiles.
TermeAssocie: champ de foire
TermeAssocie: entrepôt public
status: 1

chapelle
type: Concept
modified: 2014-11-27T16:11:16+01:00
in scheme: Thésaurus de la désignation des œuvres architecturales et des espaces aménagés
preferred label: cappella 1 @it
preferred label: chapels 1 @en-us
preferred label: chapel 1 @en-gb
narrower: chapelle des morts
broader: église
alternative label: église dite chapelle
created: 2011-09-01T00:00:00+02:00
scope note: Ne pas confondre avec chapelle d’église, ni avec oratoire.
definition: Petite église isolée sans fonction paroissiale.
status: 1

chapelle des morts
type: Concept
modified: 2014-11-27T16:19:40+01:00
in scheme: Thésaurus de la désignation des œuvres architecturales et des espaces aménagés
broader: chapelle
created: 2011-09-01T00:00:00+02:00
scope note: Ne pas confondre avec chapelle funéraire.
definition: Chapelle réservée aux prières pour les morts, généralement élevée dans un cimetière.
status: 1
broad match: Chapelle

chapelle d'église
type: Concept
modified: 2014-10-15T17:13:11+02:00
in scheme: Thésaurus de la désignation des œuvres architecturales et des espaces aménagés
preferred label: cappella 2 @it
preferred label: chapels 2 @en-us
preferred label: chapel 2 @en-gb
narrower: chapelle des fonts
narrower: chapelle funéraire
narrower: chapelle seigneuriale
broader: partie d'église
created: 2011-09-01T00:00:00+02:00
scope note: Ne pas appeler chapelle un autel secondaire placé directement dans le vaisseau d'une église. Ne pas confondre avec chapelle.
definition: Pièce ou petit vaisseau contenant ou ayant contenu un autel ou des fonts baptismaux et formant partie constituante d'une église ou d'un édifice civil.
status: 1

chapelle des fonts
type: Concept
modified: 2014-09-22T16:25:19+02:00
in scheme: Thésaurus de la désignation des œuvres architecturales et des espaces aménagés
broader: chapelle d'église
created: 2011-09-01T00:00:00+02:00
scope note: Ne pas confondre avec baptistère.
definition: Chapelle d'une église destinée à accueillir les fonts baptismaux ; à l’origine, elle n’abrite pas d’autel.
status: 1

chapelle funéraire
type: Concept
modified: 2014-09-22T16:20:32+02:00
in scheme: Thésaurus de la désignation des œuvres architecturales et des espaces aménagés
preferred label: cappella signorile @it
preferred label: funeral chapel @en-gb
preferred label: sepulchral chapels @en-us
broader: chapelle d'église
created: 2011-09-01T00:00:00+02:00
scope note: Ne pas confondre avec tombeau en forme de chapelle, ni avec chapelle des morts.
related: tombeau
definition: Chapelle d'une église ou d'un autre édifice religieux abritant un autel et accueillant un ou plusieurs tombeaux.
TermeAssocie: tombeau
status: 1

chapelle seigneuriale
type: Concept
modified: 2014-09-22T16:24:20+02:00
in scheme: Thésaurus de la désignation des œuvres architecturales et des espaces aménagés
broader: chapelle d'église
created: 2011-09-01T00:00:00+02:00
definition: Chapelle d'une église, d'un autre édifice religieux ou d’un édifice civil, destinée à l'usage d'un seigneur et de ses proches.
status: 1

tombeau
type: Concept
modified: 2015-02-24T15:26:07+01:00
in scheme: Thésaurus de la désignation des œuvres architecturales et des espaces aménagés
preferred label: tomba @it
preferred label: tombs @en-us
preferred label: tomb @en-gb
broader: monument funéraire
created: 2011-09-01T00:00:00+02:00
scope note: Voir aussi le Thesaurus des objets mobiliers.
related: chapelle funéraire
definition: Monument funéraire élevé au-dessus d’une ou plusieurs tombes.
TermeAssocie: chapelle funéraire
status: 1

charmille
type: Concept
modified: 2014-12-30T15:19:39+01:00
in scheme: Thésaurus de la désignation des œuvres architecturales et des espaces aménagés
broader: palissade de verdure
created: 2011-09-01T00:00:00+02:00
definition: Palissade de verdure composée de charmes.
status: 1

palissade de verdure
type: Concept
modified: 2014-10-14T09:41:40+02:00
in scheme: Thésaurus de la désignation des œuvres architecturales et des espaces aménagés
narrower: charmille
broader: clôture de jardin
created: 2011-09-01T00:00:00+02:00
definition: Clôture de jardin constituée par des arbres de basse-tige, des arbrisseaux ou des arbustes de basse-tige taillés de façon régulière.
status: 1

charnier
type: Concept
modified: 2014-10-15T12:59:33+02:00
in scheme: Thésaurus de la désignation des œuvres architecturales et des espaces aménagés
preferred label: fossa comune @it
preferred label: charnel pit @en-gb
broader: édifices et édicules funéraires
created: 2011-09-01T00:00:00+02:00
scope note: Ne pas confondre avec ossuaire.
definition: Cimetière ou partie d'un cimetière où les morts sont inhumés dans une fosse commune ou dans des tombes non individualisées.
status: 1
broad match: http://vocab.getty.edu/aat/300008027

charpente de toit
type: Concept
modified: 2015-02-24T17:02:24+01:00
in scheme: Thésaurus de la désignation des œuvres architecturales et des espaces aménagés
preferred label: roof frames @en-us
broader: charpente
alternative label: charpente d'assemblage
alternative label: charpente à la Philibert de L'Orme
created: 2011-09-01T00:00:00+02:00
scope note: Voir aussi le Thesaurus des objets mobiliers.
definition: Ensemble des pièces de charpente en bois ou en fer, formant le toit, et portant le matériau de couverture.
status: 1
broad match: http://data.bnf.fr/ark:/12148/cb11977467c

plancher
type: Concept
modified: 2015-02-25T11:35:04+01:00
in scheme: Thésaurus de la désignation des œuvres architecturales et des espaces aménagés
broader: charpente
created: 2011-09-01T00:00:00+02:00
definition: Pan de charpente horizontal, séparant les étages d'un bâtiment et portant le sol (parquet, carrelage, etc.). Sa surface inférieure, lorsqu'elle est dégagée et horizontale, se nomme plafond.
status: 1

charretterie
type: Concept
modified: 2014-12-30T14:51:28+01:00
in scheme: Thésaurus de la désignation des œuvres architecturales et des espaces aménagés
preferred label: carriage houses @en-us
broader: remise agricole
created: 2011-09-01T00:00:00+02:00
definition: Remise agricole où sont rangées charrettes et machines.
status: 1
broad match: cb11979024g

remise agricole
type: Concept
modified: 2014-12-30T14:49:41+01:00
in scheme: Thésaurus de la désignation des œuvres architecturales et des espaces aménagés
narrower: charretterie
broader: partie d'édifice agricole
created: 2011-09-01T00:00:00+02:00
scope note: Ne pas confondre avec hangar.
definition: Local où l'on abrite les véhicules et l'outillage agricoles.
status: 1
broad match: cb15582327q

château
type: Concept
modified: 2014-12-31T12:18:54+01:00
in scheme: Thésaurus de la désignation des œuvres architecturales et des espaces aménagés
preferred label: castles & châteaux @en-us
broader: demeure
alternative label: maison de plaisance
created: 2011-09-01T00:00:00+02:00
scope note: Ne pas appeler château une simple maison de villégiature sans domaine agricole et/ou forestier contemporain de sa construction. Si nécessaire, préciser dans la désignation complète de l’édifice : « dit château ... ».
related: château fort
definition: Au Moyen Âge, demeure seigneuriale ou royale, en général fortifiée et défendue par des douves. Par la suite, demeure de grandes dimensions liée à une vaste propriété et comprenant généralement parc, domaine forestier et dépendances, ainsi qu’une ferme située à l’écart.
TermeAssocie: château fort
status: 1

château fort
type: Concept
modified: 2015-01-05T11:06:45+01:00
in scheme: Thésaurus de la désignation des œuvres architecturales et des espaces aménagés
broader: édifice fortifié
created: 2011-09-01T00:00:00+02:00
scope note: Ne pas appeler château fort un château présentant des éléments de fortification décoratifs ou à mission défensive limitée. Ne pas confondre avec fort, ni avec forteresse.
related: château
related: maison forte
definition: Dans l'architecture médiévale, demeure seigneuriale fortifiée.
TermeAssocie: château
TermeAssocie: maison forte
status: 1

demeure
type: Concept
modified: 2014-12-31T13:03:17+01:00
in scheme: Thésaurus de la désignation des œuvres architecturales et des espaces aménagés
preferred label: dwellings @en-us
narrower: château
narrower: maison forte
narrower: hôtel
narrower: immeuble
narrower: immeuble à logements
narrower: maison
narrower: manoir
narrower: palais
narrower: presbytère
narrower: rendez-vous de chasse
narrower: villa antique
broader: édifice domestique
alternative label: habitation
created: 2011-09-01T00:00:00+02:00
related: logis abbatial
related: logis prieural
related: ferme
related: logement de contremaître
related: logement d'ouvriers
related: logement patronal
definition: Édifice à usage d'habitation, rural ou urbain, formé d'un logis souvent accompagné de communs et de dépendances. Suivant ses dimensions, sa localisation, la qualité ou l'activité de ses habitants, la demeure peut porter des dénominations différentes (palais, hôtel, château, manoir, etc.), comme des appellations régionales (mas, bastide, etc.).
TermeAssocie: logis abbatial
TermeAssocie: logis prieural
TermeAssocie: ferme
TermeAssocie: logement de contremaître
TermeAssocie: logement d'ouvriers
TermeAssocie: logement patronal
status: 1

château d'eau
type: Concept
modified: 2014-12-02T12:49:39+01:00
in scheme: Thésaurus de la désignation des œuvres architecturales et des espaces aménagés
preferred label: water towers @en-us
broader: réservoir
created: 2011-09-01T00:00:00+02:00
definition: Construction abritant un réservoir surélevé permettant la distribution de l'eau.
status: 1

réservoir
type: Concept
modified: 2014-12-02T12:41:41+01:00
in scheme: Thésaurus de la désignation des œuvres architecturales et des espaces aménagés
preferred label: reservoirs @en-us
narrower: château d'eau
narrower: citerne
broader: ouvrage lié à l'alimentation en eau
created: 2011-09-01T00:00:00+02:00
scope note: Ne pas confondre avec bassin de retenue.
definition: Ouvrage dans lequel l'eau peut s'accumuler et être gardée en réserve.
status: 1

maison forte
type: Concept
modified: 2014-12-31T12:38:43+01:00
in scheme: Thésaurus de la désignation des œuvres architecturales et des espaces aménagés
broader: demeure
created: 2011-09-01T00:00:00+02:00
related: château fort
definition: Au Moyen Âge et sous l'Ancien Régime, demeure munie d’éléments défensifs mais dont le possesseur ne détient pas en principe les droits seigneuriaux permettant d'élever un château muni de défenses importantes : tours, donjons, etc.
TermeAssocie: château fort
status: 1
broad match: http://vocab.getty.edu/aat/300387238

chaufferie
type: Concept
modified: 2015-03-26T13:38:32+01:00
in scheme: Thésaurus de la désignation des œuvres architecturales et des espaces aménagés
broader: parties industrielles
created: 2011-09-01T00:00:00+02:00
definition: Bâtiment ou local de chauffe renfermant les chaudières.
status: 1

chaussée
type: Concept
modified: 2015-01-07T12:37:26+01:00
in scheme: Thésaurus de la désignation des œuvres architecturales et des espaces aménagés
preferred label: roadways @en-us
broader: voie
created: 2011-09-01T00:00:00+02:00
definition: Partie centrale d'une voie, sur laquelle roulent des véhicules.
status: 1

chemin
type: Concept
modified: 2015-01-07T12:43:28+01:00
in scheme: Thésaurus de la désignation des œuvres architecturales et des espaces aménagés
preferred label: trackway @en-gb
preferred label: paths @en-us
broader: voie
alternative label: chemin carrossable
created: 2011-09-01T00:00:00+02:00
definition: Voie assez étroite et non revêtue, généralement située à la campagne, pouvant être empruntée par des véhicules.
status: 1

chemin de ceinture
type: Concept
modified: 2013-04-23T00:00:00+02:00
in scheme: Thésaurus de la désignation des œuvres architecturales et des espaces aménagés
broader: chemin de jardin
created: 2011-09-01T00:00:00+02:00
definition: Chemin établi à l'intérieur d'un jardin dont il longe les limites ; il ne comporte aucune vue vers l'extérieur et favorise au contraire les vues vers le jardin.
status: 1

chemin de jardin
type: Concept
modified: 2014-10-14T09:30:41+02:00
in scheme: Thésaurus de la désignation des œuvres architecturales et des espaces aménagés
preferred label: garden walks @en-us
narrower: chemin de ceinture
broader: clôture et circulation de jardin
created: 2011-09-01T00:00:00+02:00
definition: Voie de formes et de dimensions variées, ménagée à l'intérieur d'un jardin. Le sol du chemin est généralement bombé ou incliné pour favoriser l'évacuation des eaux. Il peut être revêtu de divers matériaux.
status: 1

chemin de halage
type: Concept
modified: 2015-01-07T12:45:49+01:00
in scheme: Thésaurus de la désignation des œuvres architecturales et des espaces aménagés
preferred label: tow path @en-gb
preferred label: tow paths @en-us
broader: voie
created: 2011-09-01T00:00:00+02:00
definition: Circulation longeant la rive d'une voie navigable, destinée aux hommes, aux animaux de trait, aux engins, etc., qui tirent les bateaux.
status: 1

chemin de ronde
type: Concept
modified: 2015-01-05T12:34:36+01:00
in scheme: Thésaurus de la désignation des œuvres architecturales et des espaces aménagés
broader: ouvrage fortifié
created: 2011-09-01T00:00:00+02:00
scope note: Ne pas confondre avec hourd, ni avec mâchicoulis, qui sont situés en avant de l'aplomb de l'enceinte.
definition: Coursière régnant intérieurement au sommet d'une enceinte et bordée par un parapet.
status: 1

cheminée
type: Concept
modified: 2015-02-25T10:07:16+01:00
in scheme: Thésaurus de la désignation des œuvres architecturales et des espaces aménagés
preferred label: fireplaces @en-us
broader: partie ou élément commun à tous les types d'architecture et aux espaces aménagés
created: 2011-09-01T00:00:00+02:00
scope note: Ne pas confondre avec souche de cheminée. Voir aussi le Thesaurus des objets mobiliers.
related: cheminée d'usine
definition: Ouvrage de maçonnerie pour le chauffage, formé d'un foyer ouvert et d'un conduit pour l'évacuation de la fumée.
TermeAssocie: cheminée d'usine
status: 1

cheminée d'usine
type: Concept
modified: 2015-03-26T14:25:56+01:00
in scheme: Thésaurus de la désignation des œuvres architecturales et des espaces aménagés
broader: parties industrielles
created: 2011-09-01T00:00:00+02:00
related: cheminée
definition: Conduit vertical en maçonnerie ou en tôle, destiné à évacuer les fumées de combustion et à produire le tirage nécessaire au passage de l'air et des gaz à travers le foyer.
TermeAssocie: cheminée
status: 1

chenal
type: Concept
modified: 2014-12-01T14:16:50+01:00
in scheme: Thésaurus de la désignation des œuvres architecturales et des espaces aménagés
preferred label: channels @en-us
broader: ouvrage d'art
alternative label: chenal de navigation
created: 2011-09-01T00:00:00+02:00
definition: Passage naturel ou artificiel formant l'entrée d'un port, ou assurant la navigation dans une zone de profondeur insuffisante ou présentant un danger.
status: 1

chenil
type: Concept
modified: 2014-12-31T15:39:03+01:00
in scheme: Thésaurus de la désignation des œuvres architecturales et des espaces aménagés
preferred label: kennels @en-us
broader: communs
created: 2011-09-01T00:00:00+02:00
definition: Abri pour chiens, généralement composé d'une cour et de niches couvertes, et entouré d'une grille.
status: 1

tour d'extraction
type: Concept
modified: 2015-04-30T16:48:47+02:00
in scheme: Thésaurus de la désignation des œuvres architecturales et des espaces aménagés
broader: chevalement
created: 2011-09-01T00:00:00+02:00
definition: Dans une mine, chevalement en maçonnerie ou en béton armé avec machine d'extraction au sommet, à l'aplomb du puits d'extraction.
status: 1
broad match: Chevalement
broad match: cb16774136w

chevet
type: Concept
modified: 2014-10-15T17:14:23+02:00
in scheme: Thésaurus de la désignation des œuvres architecturales et des espaces aménagés
preferred label: chevets @en-us
broader: partie d'église
created: 2011-09-01T00:00:00+02:00
scope note: Ne pas confondre avec abside : l'abside du chœur n'est souvent qu'une partie du chevet et il y a des chevets sans abside (chevet plat).
definition: Extrémité extérieure de l'église du côté du maître-autel.
status: 1

chocolaterie
type: Concept
modified: 2015-01-07T12:38:48+01:00
in scheme: Thésaurus de la désignation des œuvres architecturales et des espaces aménagés
broader: usine de produits agro-alimentaires
created: 2011-09-01T00:00:00+02:00
definition: Usine où l'on fabrique du chocolat et comprenant généralement des machines de torréfaction, de broyage, de mélange, un atelier de conditionnement , un magasin industriel, etc.
status: 1

choeur
type: Concept
modified: 2015-03-09T11:09:01+01:00
in scheme: Thésaurus de la désignation des œuvres architecturales et des espaces aménagés
preferred label: coro @it
preferred label: choirs @en-us
preferred label: choir @en-gb
broader: partie d'église
alternative label: chœur
created: 2011-09-01T00:00:00+02:00
scope note: Ne pas confondre avec chœur liturgique, qui peut s'étendre sur les dernières travées de la nef.
status: 1

cidrerie
type: Concept
modified: 2015-01-07T12:52:59+01:00
in scheme: Thésaurus de la désignation des œuvres architecturales et des espaces aménagés
broader: usine de produits agro-alimentaires
created: 2011-09-01T00:00:00+02:00
definition: Usine où l'on fabrique le cidre et comprenant généralement des machines à broyer, à pressurer, des cuves de stockage, un pont-bascule, un chai, un magasin industriel, etc.
status: 1

cimenterie
type: Concept
modified: 2015-02-03T11:28:48+01:00
in scheme: Thésaurus de la désignation des œuvres architecturales et des espaces aménagés
broader: usine de fabrication de matériaux de construction
created: 2011-09-01T00:00:00+02:00
definition: Usine où l'on fabrique le ciment et comprenant généralement une aire des matières premières, une aire de concassage, un four industriel, des silos, etc.
status: 1

cimetière
type: Concept
modified: 2014-10-15T13:13:57+02:00
in scheme: Thésaurus de la désignation des œuvres architecturales et des espaces aménagés
preferred label: cemeteries @en-us
preferred label: cimitero @it
preferred label: cemetery 1 @en-gb
broader: ensemble funéraire
alternative label: churchyard @en-gb
created: 2011-09-01T00:00:00+02:00
definition: Terrain dédié aux sépultures.
status: 1

cinéma
type: Concept
modified: 2014-12-19T11:08:31+01:00
in scheme: Thésaurus de la désignation des œuvres architecturales et des espaces aménagés
preferred label: motion picture theaters @en-us
broader: salle de spectacle
alternative label: salle de cinéma
created: 2011-09-01T00:00:00+02:00
definition: Salle de spectacle où l'on projette des films cinématographiques.
status: 1

cirque
type: Concept
modified: 2014-12-19T11:14:16+01:00
in scheme: Thésaurus de la désignation des œuvres architecturales et des espaces aménagés
preferred label: circuses @en-us
broader: salle de spectacle
created: 2011-09-01T00:00:00+02:00
definition: Dans l'Antiquité, édifice à gradins destiné aux courses de chars. Son plan est rectangulaire, arrondi à une de ses extrémités. À l'époque moderne, édifice à gradins, pérenne ou non, généralement de plan circulaire ou ovale, et destiné aux représentations de cirque.
status: 1

citadelle
type: Concept
modified: 2015-01-05T11:26:36+01:00
in scheme: Thésaurus de la désignation des œuvres architecturales et des espaces aménagés
preferred label: citadels @en-us
broader: forteresse
created: 2011-09-01T00:00:00+02:00
definition: Fort ou forteresse commandant une ville, souvent placé à cheval sur son enceinte, plus rarement à l'intérieur de celle-ci. La citadelle sert habituellement d'arsenal et de caserne, éventuellement de réduit ; elle a quelquefois pour fonction de surveiller la ville elle-même et d'y réprimer les subversions internes. Elle peut abriter un quartier de la ville.
status: 1

forteresse
type: Concept
modified: 2015-01-05T11:21:38+01:00
in scheme: Thésaurus de la désignation des œuvres architecturales et des espaces aménagés
preferred label: fortresses @en-us
narrower: citadelle
broader: édifice fortifié
created: 2011-09-01T00:00:00+02:00
scope note: Ne pas confondre avec château fort.
definition: Dans l'architecture médiévale, édifice fortifié dont la fonction est strictement militaire.
status: 1
narrow match: cb15086573j

cité jardin
type: Concept
modified: 2015-01-09T11:18:18+01:00
in scheme: Thésaurus de la désignation des œuvres architecturales et des espaces aménagés
preferred label: garden cities @en-us
preferred label: garden city @en-gb
broader: lotissement concerté
created: 2011-09-01T00:00:00+02:00
definition: Lotissement concerté où les habitations et la voirie sont intégrées aux espaces verts publics ou privés, et destiné généralement en France à un usage social.
status: 1

lotissement concerté
type: Concept
modified: 2015-01-09T11:28:29+01:00
in scheme: Thésaurus de la désignation des œuvres architecturales et des espaces aménagés
narrower: cité jardin
narrower: cité ouvrière
narrower: courée
broader: lotissement
created: 2011-09-01T00:00:00+02:00
definition: Ensemble accompagné de servitudes déterminant l'aspect architectural des bâtiments, ou intégrant la construction par un même investisseur des bâtiments sur les lots selon un ordonnancement commun.
status: 1
broad match: Lotissement

cité ouvrière
type: Concept
modified: 2015-01-09T11:22:17+01:00
in scheme: Thésaurus de la désignation des œuvres architecturales et des espaces aménagés
preferred label: città operaia + quartiere operaio @it
preferred label: industrial housings @en-us
preferred label: worker's village @en-gb
broader: lotissement concerté
created: 2011-09-01T00:00:00+02:00
definition: Lotissement concerté d'habitat ouvrier, généralement mono-familial.
status: 1
broad match: cb11933705v

cité pavillonnaire
type: Concept
modified: 2014-10-17T15:06:15+02:00
in scheme: Thésaurus de la désignation des œuvres architecturales et des espaces aménagés
preferred label: tract houses @en-us
broader: lotissement
created: 2011-09-01T00:00:00+02:00
definition: Lotissement formé d'habitations mono-familiales isolées, jumelées, combinées ou en série. La cité pavillonnaire peut comprendre des équipements et des commerces.
status: 1
broad match: http://data.bnf.fr/ark:/12148/cb126475053
broad match: Lotissement

lotissement
type: Concept
modified: 2015-01-09T12:08:54+01:00
in scheme: Thésaurus de la désignation des œuvres architecturales et des espaces aménagés
narrower: lotissement concerté
narrower: cité pavillonnaire
broader: secteur urbain concerté
created: 2011-09-01T00:00:00+02:00
related: ensemble domestique
definition: Parcelle ou fonds de parcelle divisé en plusieurs lots, en vue de la vente, de la location ou de la concession.
TermeAssocie: ensemble domestique
status: 1

citerne
type: Concept
modified: 2014-12-02T12:48:56+01:00
in scheme: Thésaurus de la désignation des œuvres architecturales et des espaces aménagés
preferred label: cisterns @en-us
broader: réservoir
created: 2011-09-01T00:00:00+02:00
definition: Réservoir destiné à recueillir les eaux de pluie.
status: 1

clairière ornementale
type: Concept
modified: 2014-12-30T16:35:07+01:00
in scheme: Thésaurus de la désignation des œuvres architecturales et des espaces aménagés
broader: découvert de jardin
created: 2011-09-01T00:00:00+02:00
definition: Découvert généralement planté de végétaux rampants et gazonnants, aménagé dans un bois paysager de façon à produire un effet naturel.
status: 1

cloison
type: Concept
modified: 2015-02-25T10:28:01+01:00
in scheme: Thésaurus de la désignation des œuvres architecturales et des espaces aménagés
preferred label: partitions (interior walls) @en-us
broader: mur - garde-corps - clôture
created: 2011-09-01T00:00:00+02:00
definition: Mur mince, en pan-de-bois, en briques, etc. formant une division intérieure. La cloison ne porte que son propre poids, contrairement au mur de refend.
status: 1

mur - garde-corps - clôture
type: Concept
modified: 2015-02-25T10:27:09+01:00
in scheme: Thésaurus de la désignation des œuvres architecturales et des espaces aménagés
preferred label: walls - railings - fences @en-us
narrower: cloison
narrower: clôture
narrower: mur de soutènement
narrower: pignon
broader: partie ou élément commun à tous les types d'architecture et aux espaces aménagés
created: 2011-09-01T00:00:00+02:00
scope note: Voir aussi le Thesaurus des objets mobiliers.
definition: Ouvrage vertical délimitant un espace, formant une protection ou faisant obstacle au passage, etc., à l’intérieur ou à l’extérieur d’un édifice.
status: 1

clôture
type: Concept
modified: 2015-02-25T10:29:02+01:00
in scheme: Thésaurus de la désignation des œuvres architecturales et des espaces aménagés
preferred label: fences @en-us
narrower: mur de clôture
broader: mur - garde-corps - clôture
created: 2011-09-01T00:00:00+02:00
scope note: Ne pas confondre avec enceinte. Voir aussi le Thesaurus des objets mobiliers.
related: clôture de jardin
related: enclos
definition: Ouvrage divisant ou délimitant un espace et faisant obstacle au passage. Le terme est réservé aux édifices civils.
TermeAssocie: clôture de jardin
TermeAssocie: enclos
status: 1

enclos
type: Concept
modified: 2015-02-25T14:28:53+01:00
in scheme: Thésaurus de la désignation des œuvres architecturales et des espaces aménagés
broader: partie ou élément commun à tous les types d'architecture et aux espaces aménagés
created: 2011-09-01T00:00:00+02:00
related: clôture
definition: Terrain délimité par une clôture (mur, fossé, etc.).
TermeAssocie: clôture
status: 1

mur de clôture
type: Concept
modified: 2015-02-25T16:20:40+01:00
in scheme: Thésaurus de la désignation des œuvres architecturales et des espaces aménagés
broader: clôture
created: 2011-09-01T00:00:00+02:00
definition: Clôture en maçonnerie, en pierre sèche ou en terre.
status: 1
narrow match: http://data.bnf.fr/ark:/12148/cb119401379

clôture de chapelle
type: Concept
modified: 2014-10-23T10:57:43+02:00
in scheme: Thésaurus de la désignation des œuvres architecturales et des espaces aménagés
preferred label: balaustrata della cappella @it
preferred label: parcloses @en-us
preferred label: screen @en-gb
broader: partie d'église
created: 2011-09-01T00:00:00+02:00
scope note: Voir aussi le Thesaurus des objets mobiliers.
definition: Ouvrage séparant une chapelle des autres parties de l'église.
status: 1

clôture de choeur
type: Concept
modified: 2015-03-09T11:11:12+01:00
in scheme: Thésaurus de la désignation des œuvres architecturales et des espaces aménagés
preferred label: recinto del coro @it
preferred label: choir screens @en-us
preferred label: choir screen @en-gb
narrower: iconostase
narrower: jubé
broader: partie d'église
alternative label: chancel
alternative label: clôture de chœur
created: 2011-09-01T00:00:00+02:00
scope note: Voir aussi le Thesaurus des objets mobiliers.
definition: Ouvrage séparant le chœur liturgique des autres parties de l'église. Dans les églises paléochrétiennes, cette clôture se nomme chancel.
status: 1

iconostase
type: Concept
modified: 2014-10-15T17:24:04+02:00
in scheme: Thésaurus de la désignation des œuvres architecturales et des espaces aménagés
preferred label: iconostasi @it
preferred label: iconostasis @en-gb
preferred label: iconostases @en-us
broader: clôture de choeur
created: 2011-09-01T00:00:00+02:00
scope note: Voir aussi le Thesaurus des objets mobiliers.
definition: Clôture élevée d'une église orthodoxe, sur laquelle sont accrochées des icônes, qui sépare le sanctuaire, réservé au clergé, de la nef réservée aux fidèles.
status: 1

jubé
type: Concept
modified: 2015-03-09T11:12:45+01:00
in scheme: Thésaurus de la désignation des œuvres architecturales et des espaces aménagés
preferred label: pontile @it
preferred label: rood screen @en-gb
preferred label: chancel screens @en-us
broader: clôture de choeur
created: 2011-09-01T00:00:00+02:00
scope note: Voir aussi le Thesaurus des objets mobiliers.
definition: Clôture monumentale séparant le chœur liturgique de la nef. Il abrite souvent deux petits autels de part et d'autre de l'entrée et porte généralement une plate-forme ou une coursière à laquelle on accède par des escaliers.
status: 1

saut de loup
type: Concept
modified: 2014-10-14T09:44:30+02:00
in scheme: Thésaurus de la désignation des œuvres architecturales et des espaces aménagés
preferred label: ha-has @en-us
broader: clôture de jardin
created: 2011-09-01T00:00:00+02:00
definition: Fossé sec et court placé devant un ahah ou devant une entrée : dans ce dernier cas, le saut-de-loup est franchi par un pont.
status: 1

entrée de jardin
type: Concept
modified: 2014-10-14T09:32:11+02:00
in scheme: Thésaurus de la désignation des œuvres architecturales et des espaces aménagés
broader: clôture et circulation de jardin
created: 2011-09-01T00:00:00+02:00
definition: Dégagement ménagé à la limite d'un jardin afin de relier le système de circulation intérieure à une voie de communication extérieure. L'entrée peut présenter des espaces libres et divers systèmes de fermeture. Lorsqu'il y a plusieurs entrées, on distingue les entrées principales et les entrées secondaires.
status: 1

pas japonais
type: Concept
modified: 2014-09-30T12:55:51+02:00
in scheme: Thésaurus de la désignation des œuvres architecturales et des espaces aménagés
preferred label: Japanese paving stones @en-us
broader: clôture et circulation de jardin
created: 2011-09-01T00:00:00+02:00
definition: Chemin de jardin régulier ou irrégulier, souvent établi sur une pelouse et constitué de dalles ou de rondelles de bois isolées les unes des autres.
status: 1
broad match: cb12301597s

club-house
type: Concept
modified: 2014-12-19T11:24:30+01:00
in scheme: Thésaurus de la désignation des œuvres architecturales et des espaces aménagés
broader: partie d'édifice de culture recherche sport ou loisir
created: 2011-09-01T00:00:00+02:00
scope note: Ne pas confondre avec cercle.
related: parcours de golf
related: court de tennis
definition: Bâtiment réservé aux membres d'un club sportif.
TermeAssocie: parcours de golf
TermeAssocie: court de tennis
status: 1

parcours de golf
type: Concept
modified: 2014-12-12T15:27:56+01:00
in scheme: Thésaurus de la désignation des œuvres architecturales et des espaces aménagés
preferred label: golf courses @en-us
broader: édifice sportif
created: 2011-09-01T00:00:00+02:00
related: club-house
definition: Espace et installations destinés à la pratique du golf.
TermeAssocie: club-house
status: 1

court de tennis
type: Concept
modified: 2014-10-09T13:40:17+02:00
in scheme: Thésaurus de la désignation des œuvres architecturales et des espaces aménagés
broader: édifice sportif
created: 2011-09-01T00:00:00+02:00
related: club-house
definition: terrain de sport rectangulaire destiné à la pratique du tennis. Les courts peuvent être bordés de tribunes du public, de vestiaires pour les sportifs, d’un club-house, etc.
TermeAssocie: club-house
status: 1

cokerie
type: Concept
modified: 2015-03-27T11:24:30+01:00
in scheme: Thésaurus de la désignation des œuvres architecturales et des espaces aménagés
broader: parties industrielles
created: 2011-09-01T00:00:00+02:00
definition: Installation technique pour la production ou le traitement du coke.
status: 1

collatéral
type: Concept
modified: 2014-11-28T15:58:21+01:00
in scheme: Thésaurus de la désignation des œuvres architecturales et des espaces aménagés
preferred label: navata laterale @it
preferred label: aisle @en-gb
preferred label: side + aisles @en-us
broader: partie d'église
alternative label: bas-côté
created: 2011-09-01T00:00:00+02:00
definition: Vaisseau latéral, parallèle au vaisseau central ou principal.
status: 1

collège
type: Concept
modified: 2014-12-01T16:25:13+01:00
in scheme: Thésaurus de la désignation des œuvres architecturales et des espaces aménagés
preferred label: junior high schools @en-us
broader: école secondaire
created: 2011-09-01T00:00:00+02:00
definition: Établissement public ou privé d'enseignement. Sous l'Ancien Régime, il dépendait souvent d'une institution religieuse. À partir du XIXe siècle, il désigne fréquemment un établissement d'enseignement du premier cycle.
status: 1

école secondaire
type: Concept
modified: 2014-12-01T16:16:19+01:00
in scheme: Thésaurus de la désignation des œuvres architecturales et des espaces aménagés
preferred label: junior highschools & highschools @en-us
narrower: collège
narrower: lycée
narrower: petit séminaire
broader: école
created: 2011-09-01T00:00:00+02:00
definition: Établissement d'enseignement du second degré, généralement destiné à des élèves de la sixième à la terminale. Il réunit des salles de cours, d'activités sportives et artistiques, de travaux pratiques, etc.
status: 1

collège universitaire
type: Concept
modified: 2014-09-22T17:45:22+02:00
in scheme: Thésaurus de la désignation des œuvres architecturales et des espaces aménagés
broader: édifice d'enseignement supérieur
created: 2011-09-01T00:00:00+02:00
definition: Maison destinée primitivement à héberger les étudiants fréquentant l'Université. Dès le XIIIe siècle, les collèges universitaires deviennent également des édifices d'enseignement.
status: 1

édifice d'enseignement supérieur
type: Concept
modified: 2014-12-01T17:14:04+01:00
in scheme: Thésaurus de la désignation des œuvres architecturales et des espaces aménagés
preferred label: university and college buildings @en-us
narrower: université
narrower: collège universitaire
narrower: école normale
narrower: école supérieure
broader: édifice scolaire
created: 2011-09-01T00:00:00+02:00
status: 1

collégiale
type: Concept
modified: 2014-11-27T16:31:34+01:00
in scheme: Thésaurus de la désignation des œuvres architecturales et des espaces aménagés
preferred label: collegiata @it
preferred label: collegiate churches @en-us
preferred label: collegiate church @en-gb
broader: église
created: 2011-09-01T00:00:00+02:00
definition: Église desservie par un chapitre de chanoines, généralement entourée de bâtiments conventuels.
status: 1

colombier
type: Concept
modified: 2014-12-30T14:37:57+01:00
in scheme: Thésaurus de la désignation des œuvres architecturales et des espaces aménagés
broader: pigeonnier
alternative label: pigeonnier à pied
created: 2011-09-01T00:00:00+02:00
definition: En forme de tour, le colombier comprend une charpente formée d'un poteau central et d'une échelle tournante permettant d'atteindre les boulins abritant les pigeons.
status: 1

pigeonnier
type: Concept
modified: 2014-12-30T14:35:56+01:00
in scheme: Thésaurus de la désignation des œuvres architecturales et des espaces aménagés
preferred label: dovecotes @en-us
narrower: colombier
broader: partie d'édifice agricole
alternative label: fuie
created: 2011-09-01T00:00:00+02:00
definition: Construction servant d'abri pour les pigeons.
status: 1
narrow match: Colombier (édifice)

colonie pénitentiaire
type: Concept
modified: 2015-01-05T10:57:23+01:00
in scheme: Thésaurus de la désignation des œuvres architecturales et des espaces aménagés
preferred label: reformatories @en-us
broader: ensemble judiciaire pénitentiaire ou de police
alternative label: camp pénitentiaire
created: 2011-09-01T00:00:00+02:00
definition: Établissement fermé pour les jeunes délinquants.
status: 1
broad match: Colonie pénitentiaire

colonnade
type: Concept
modified: 2015-02-25T11:37:19+01:00
in scheme: Thésaurus de la désignation des œuvres architecturales et des espaces aménagés
preferred label: colonnades @en-us
narrower: péristyle
broader: partie ou élément commun à tous les types d'architecture et aux espaces aménagés
created: 2011-09-01T00:00:00+02:00
scope note: Ne pas confondre avec portique, qui n'est pas nécessairement bordé par une colonnade.
related: colonnade de jardin
definition: File de colonnes et leur couvrement : la colonnade est formée de travées ou d'arcades.
TermeAssocie: colonnade de jardin
status: 1

colonnade de jardin
type: Concept
modified: 2014-10-14T10:19:07+02:00
in scheme: Thésaurus de la désignation des œuvres architecturales et des espaces aménagés
broader: fabrique de jardin
created: 2011-09-01T00:00:00+02:00
related: colonnade
definition: Fabrique constituée d'une file de colonnes avec leur couvrement, établie sur un plan rectiligne ou circulaire. Les colonnes peuvent être remplacées par des arbres (colonnade de verdure).
TermeAssocie: colonnade
status: 1

péristyle
type: Concept
modified: 2015-02-25T11:42:16+01:00
in scheme: Thésaurus de la désignation des œuvres architecturales et des espaces aménagés
preferred label: peristyles (colonnades) @en-us
broader: colonnade
created: 2011-09-01T00:00:00+02:00
definition: Colonnade à plusieurs retours, sur le périmètre complet ou presque complet d'un bâtiment, d'une cour, d'une place, etc. Elle peut être interne ou externe.
status: 1

fabrique de jardin
type: Concept
modified: 2014-12-30T15:50:28+01:00
in scheme: Thésaurus de la désignation des œuvres architecturales et des espaces aménagés
narrower: fabrique en belvédère
narrower: colonnade de jardin
narrower: fabrique de treillage
narrower: grotte artificielle
narrower: kiosque
narrower: pergola
narrower: portique de jardin
narrower: rocher artificiel
narrower: rotonde de jardin
narrower: ruine artificielle
narrower: temple de jardin
narrower: tente de jardin
narrower: théâtre de jardin
narrower: tour de jardin
broader: construction de jardin
alternative label: fabrique
created: 2011-09-01T00:00:00+02:00
scope note: Ne pas confondre avec folie.
related: grotte de Lourdes
related: obélisque
definition: Petite construction aménagée pour le promeneur, intégrée à la composition d'un jardin ou d'un parc et présentant un caractère ornemental. Toutes les formes architecturales peuvent être mises en œuvre : pavillon, rotonde, tholos, etc.
TermeAssocie: grotte de Lourdes
TermeAssocie: obélisque
status: 1

columbarium
type: Concept
modified: 2015-02-24T15:57:32+01:00
in scheme: Thésaurus de la désignation des œuvres architecturales et des espaces aménagés
preferred label: columbaria @en-us
broader: édifices et édicules funéraires
created: 2011-09-01T00:00:00+02:00
definition: Ouvrage où l’on place dans des niches juxtaposées et superposées les urnes cinéraires.
status: 1
broad match: cb11938920h

commanderie
type: Concept
modified: 2014-11-27T16:59:01+01:00
in scheme: Thésaurus de la désignation des œuvres architecturales et des espaces aménagés
preferred label: commenda militare @it
preferred label: hospitaller's preceptory + templars preceptory @en-gb
preferred label: commanderies @en-us
broader: établissement conventuel
created: 2011-09-01T00:00:00+02:00
scope note: Il convient de préciser l'ordre religieux en désignation.
definition: Établissement d'un ordre religieux militaire.
status: 1

commissariat de police
type: Concept
modified: 2015-01-05T10:29:43+01:00
in scheme: Thésaurus de la désignation des œuvres architecturales et des espaces aménagés
preferred label: police stations @en-us
broader: édifice judiciaire pénitentiaire ou de police
alternative label: poste de police
created: 2011-09-01T00:00:00+02:00
definition: Édifice abritant les locaux des agents chargés de faire observer les règlements de police et de veiller au maintien de l'ordre et de la paix publique. Il comprend généralement un local aménagé à l'usage de cellule.
status: 1

écurie
type: Concept
modified: 2014-12-31T15:42:17+01:00
in scheme: Thésaurus de la désignation des œuvres architecturales et des espaces aménagés
preferred label: stables @en-us
broader: communs
created: 2011-09-01T00:00:00+02:00
scope note: Pour l'écurie de chevaux de trait, employer étable à chevaux.
related: étable à chevaux
definition: Abri pour les chevaux de selle ou d'attelage. L'écurie fait partie en général des communs d'une demeure. L'écurie de course est meublée d'installations destinées non seulement au logement, mais également aux soins, au fourrage, au harnachement, de terrains d'entraînement des chevaux, sans compter bureaux et logement du personnel qui s'en occupe.
TermeAssocie: étable à chevaux
status: 1

logement
type: Concept
modified: 2014-12-31T15:48:26+01:00
in scheme: Thésaurus de la désignation des œuvres architecturales et des espaces aménagés
preferred label: housing complexes @en-us
narrower: conciergerie
broader: communs
created: 2011-09-01T00:00:00+02:00
scope note: Pour les demeures, ne mentionner que les logements secondaires complétant le logis principal (par exemple un logement d'ouvrier agricole dans une ferme).
related: logis
definition: Partie d'édifice à usage d'habitation.
TermeAssocie: logis
status: 1

remise
type: Concept
modified: 2014-12-31T15:55:08+01:00
in scheme: Thésaurus de la désignation des œuvres architecturales et des espaces aménagés
preferred label: carriagehouses @en-us
narrower: garage
narrower: remise à bateau
broader: communs
created: 2011-09-01T00:00:00+02:00
definition: Local où l'on abrite les moyens de transport.
status: 1

resserre
type: Concept
modified: 2014-12-31T16:00:16+01:00
in scheme: Thésaurus de la désignation des œuvres architecturales et des espaces aménagés
preferred label: storehouses @en-us
broader: communs
alternative label: entrepôt domestique
created: 2011-09-01T00:00:00+02:00
definition: Lieu où l'on entrepose vêtements, outils, mobilier, nourriture, etc.
status: 1
broad match: cb15582327q
broad match: Entrepôt

sellerie
type: Concept
modified: 2014-12-31T16:02:05+01:00
in scheme: Thésaurus de la désignation des œuvres architecturales et des espaces aménagés
preferred label: tack rooms @en-us
broader: communs
created: 2011-09-01T00:00:00+02:00
definition: Local où l'on range les selles et les harnais.
status: 1

volière
type: Concept
modified: 2014-12-31T16:04:44+01:00
in scheme: Thésaurus de la désignation des œuvres architecturales et des espaces aménagés
preferred label: aviaries @en-us
broader: communs
created: 2011-09-01T00:00:00+02:00
related: faisanderie
definition: Ouvrage destiné à accueillir des oiseaux rares ou d'agrément, constitué d’un enclos grillagé ou d'une cage en treillis de bois ou de métal assez vaste pour que les oiseaux puissent y voler.
TermeAssocie: faisanderie
status: 1

complexe hôtelier
type: Concept
modified: 2014-10-17T15:16:46+02:00
in scheme: Thésaurus de la désignation des œuvres architecturales et des espaces aménagés
preferred label: hotels (public accommodations) @en-us
broader: ensemble artisanal commercial ou tertiaire
created: 2011-09-01T00:00:00+02:00
definition: Complexe réunissant des édifices hôteliers et associés (restauration, pratique sportive, location de voitures, etc.).
status: 1
broad match: Hôtel

complexe sportif
type: Concept
modified: 2014-12-19T11:21:20+01:00
in scheme: Thésaurus de la désignation des œuvres architecturales et des espaces aménagés
preferred label: sports complexes @en-us
broader: ensemble de culture recherche sport ou loisir
created: 2011-09-01T00:00:00+02:00
definition: Établissement regroupant plusieurs installations sportives.
status: 1

conciergerie
type: Concept
modified: 2014-12-31T15:50:51+01:00
in scheme: Thésaurus de la désignation des œuvres architecturales et des espaces aménagés
preferred label: gatehouses & lodges @en-us
broader: logement
alternative label: porterie
alternative label: loge du concierge
created: 2011-09-01T00:00:00+02:00
definition: Logement destiné au concierge, gardien d'une demeure ou d'un édifice public, industriel, etc. Dans un établissement conventuel, la porterie est le logement du portier, bâtiment jouxtant la porte d'entrée, où se trouve le gardien.
status: 1

conduite forcée
type: Concept
modified: 2014-12-02T12:27:04+01:00
in scheme: Thésaurus de la désignation des œuvres architecturales et des espaces aménagés
preferred label: penstocks @en-us
narrower: établissement élévateur des eaux
broader: ouvrage lié à l'alimentation en eau
created: 2011-09-01T00:00:00+02:00
definition: Conduite en béton armé ou en métal qui amène l'eau sous pression depuis un réservoir jusqu'aux machines de l'usine d'utilisation.
status: 1

établissement élévateur des eaux
type: Concept
modified: 2014-12-02T12:50:50+01:00
in scheme: Thésaurus de la désignation des œuvres architecturales et des espaces aménagés
broader: conduite forcée
alternative label: usine élévatoire
alternative label: usine élévatrice des eaux
created: 2011-09-01T00:00:00+02:00
definition: Ouvrage regroupant diverses installations et canalisations nécessaires à l’élévation mécanique de l’eau, afin de permettre l’alimentation d’un réseau hydraulique, d’un réservoir, d’un bief à point de partage, d’un bassin de port, etc.
status: 1

confiserie
type: Concept
modified: 2015-04-29T14:46:15+02:00
in scheme: Thésaurus de la désignation des œuvres architecturales et des espaces aménagés
broader: usine de produits agro-alimentaires
created: 2011-09-01T00:00:00+02:00
definition: Usine où l'on fabrique de la confiserie : sucreries, fruits confits, bonbons, confitures, etc. Elle comprend généralement un laboratoire, un atelier de conditionnement, un magasin industriel, etc.
status: 1

conservatoire
type: Concept
modified: 2014-12-01T16:06:04+01:00
in scheme: Thésaurus de la désignation des œuvres architecturales et des espaces aménagés
preferred label: music conservatories & drama schools @en-us
broader: école d'art
alternative label: conservatoire de musique
alternative label: école de théâtre
created: 2011-09-01T00:00:00+02:00
definition: École d'art assurant la formation de musiciens ou de comédiens.
status: 1

école d'art
type: Concept
modified: 2014-12-01T16:05:00+01:00
in scheme: Thésaurus de la désignation des œuvres architecturales et des espaces aménagés
preferred label: art schools @en-us
narrower: conservatoire
narrower: école de danse
broader: école professionnelle
alternative label: école artistique
created: 2011-09-01T00:00:00+02:00
definition: École professionnelle spécialisée dans l'enseignement d'un art : architecture, peinture, musique, danse, etc.
status: 1

conserverie
type: Concept
modified: 2015-01-07T16:16:50+01:00
in scheme: Thésaurus de la désignation des œuvres architecturales et des espaces aménagés
broader: usine de produits agro-alimentaires
created: 2011-09-01T00:00:00+02:00
definition: Usine où l'on fabrique des conserves alimentaires, suivant différents procédés (stérilisation, congélation, déshydratation, fermentation, etc.). Cette désignation s’applique également aux usines d’élaboration de plats cuisinés, de surgelés, d’extraits et de bouillons, etc. Elle comprend généralement un laboratoire, un entrepôt industriel, un atelier de conditionnement, etc.
status: 1

folie
type: Concept
modified: 2014-12-30T15:56:59+01:00
in scheme: Thésaurus de la désignation des œuvres architecturales et des espaces aménagés
preferred label: follies @en-us
broader: construction de jardin
created: 2011-09-01T00:00:00+02:00
scope note: Ne pas confondre avec fabrique de jardin.
definition: Petite demeure d'agrément construite dans un jardin, se distinguant par un parti architectural original, souvent luxueux voire extravagant, et destinée à de courts séjours.
status: 1

glacière
type: Concept
modified: 2014-12-30T15:58:21+01:00
in scheme: Thésaurus de la désignation des œuvres architecturales et des espaces aménagés
preferred label: icehouses @en-us
broader: construction de jardin
created: 2011-09-01T00:00:00+02:00
definition: Construction en forme de citerne où l'on conserve la neige ou la glace, généralement ménagée dans une butte de terre artificielle et parfois surmontée d'une fabrique de jardin.
status: 1

hameau de jardin
type: Concept
modified: 2014-10-14T09:51:13+02:00
in scheme: Thésaurus de la désignation des œuvres architecturales et des espaces aménagés
broader: construction de jardin
created: 2011-09-01T00:00:00+02:00
definition: Ferme autour de laquelle sont regroupés divers bâtiments, à l'imitation d'une petite agglomération rurale.
status: 1

maison rustique
type: Concept
modified: 2014-12-30T16:00:16+01:00
in scheme: Thésaurus de la désignation des œuvres architecturales et des espaces aménagés
broader: construction de jardin
created: 2011-09-01T00:00:00+02:00
definition: Demeure d'agrément construite dans un jardin, dont les formes, les matériaux du gros-œuvre et le décor sont inspirés de l'architecture vernaculaire, avec une volonté de pittoresque.
status: 1

ménagerie
type: Concept
modified: 2014-12-30T16:02:00+01:00
in scheme: Thésaurus de la désignation des œuvres architecturales et des espaces aménagés
preferred label: menageries @en-us
broader: construction de jardin
created: 2011-09-01T00:00:00+02:00
related: jardin zoologique
definition: Dépendance d'une demeure, abritant des animaux exotiques.
TermeAssocie: jardin zoologique
status: 1

muette
type: Concept
modified: 2014-12-30T16:03:56+01:00
in scheme: Thésaurus de la désignation des œuvres architecturales et des espaces aménagés
broader: construction de jardin
created: 2011-09-01T00:00:00+02:00
definition: Communs élevés dans un parc de chasse composés des logements destinés au capitaine et aux officiers de la vénerie, accompagnés d'un chenil pour la meute.
status: 1

nymphée
type: Concept
modified: 2014-12-30T16:05:57+01:00
in scheme: Thésaurus de la désignation des œuvres architecturales et des espaces aménagés
preferred label: nymphaea @en-us
broader: construction de jardin
created: 2011-09-01T00:00:00+02:00
definition: Construction élevée au-dessus d'une source naturelle ou artificielle, généralement en forme de grotte, accueillant un bassin d'ornement, une fontaine, etc.
status: 1

orangerie
type: Concept
modified: 2014-12-30T16:07:48+01:00
in scheme: Thésaurus de la désignation des œuvres architecturales et des espaces aménagés
preferred label: orangeries @en-us
broader: construction de jardin
created: 2011-09-01T00:00:00+02:00
definition: Bâtiment ou pièce chauffé où l'on remise l'hiver les orangers et autres arbres et plantes en pot pour les protéger du gel.
status: 1

pavillon de jardin
type: Concept
modified: 2014-12-30T16:09:25+01:00
in scheme: Thésaurus de la désignation des œuvres architecturales et des espaces aménagés
preferred label: pavilions (garden structures) @en-us
broader: construction de jardin
created: 2011-09-01T00:00:00+02:00
related: pavillon
definition: Construction de jardin généralement de plan carré ou polygonal, de taille relativement réduite, contenant un petit logis d'une seule pièce destiné au repos, à des collations ou des rafraîchissements.
TermeAssocie: pavillon
status: 1

pont de jardin
type: Concept
modified: 2014-12-30T16:10:25+01:00
in scheme: Thésaurus de la désignation des œuvres architecturales et des espaces aménagés
broader: construction de jardin
alternative label: pont décoré
created: 2011-09-01T00:00:00+02:00
related: pont
definition: Ouvrage de jardin franchissant un espace et portant un chemin ou un aqueduc. Le ponceau ne possède qu'une seule arche. Il est appelé pont décoré lorsqu'il présente un caractère ornemental, monumental ou pittoresque. La passerelle est un pont en charpente, une simple planche ou un tronc d'arbre.
TermeAssocie: pont
status: 1

serre
type: Concept
modified: 2014-12-30T16:12:27+01:00
in scheme: Thésaurus de la désignation des œuvres architecturales et des espaces aménagés
preferred label: greenhouses @en-us
broader: construction de jardin
created: 2011-09-01T00:00:00+02:00
scope note: Ne pas nommer serre un châssis de couche, qui est un coffrage vitré.
definition: Bâtiment, corps de bâtiment ou pièce où l'on réunit les arbrisseaux et les plantes pour les garantir contre le froid ou favoriser leur croissance. La serre est souvent vitrée.
status: 1

corbeille de jardin
type: Concept
modified: 2014-10-14T10:57:57+02:00
in scheme: Thésaurus de la désignation des œuvres architecturales et des espaces aménagés
broader: massif de fleurs
created: 2011-09-01T00:00:00+02:00
definition: Petit massif de fleurs de forme ronde ou elliptique et à la surface bombée. Elle peut également être traitée en mosaïculture.
status: 1
broad match: Plate-bande (jardinage)

massif de fleurs
type: Concept
modified: 2014-12-30T16:36:13+01:00
in scheme: Thésaurus de la désignation des œuvres architecturales et des espaces aménagés
preferred label: flower beds @en-us
narrower: corbeille de jardin
broader: découvert de jardin
created: 2011-09-01T00:00:00+02:00
definition: Pièce découverte de forme variée garnie de fleurs. Le massif peut être de niveau ou légèrement bombé. Il est parfois traité en mosaïculture.
status: 1

corderie
type: Concept
modified: 2015-03-18T10:28:20+01:00
in scheme: Thésaurus de la désignation des œuvres architecturales et des espaces aménagés
broader: usine textile
created: 2011-09-01T00:00:00+02:00
scope note: Ne pas confondre avec usine de boyauderie, ni avec câblerie.
definition: Usine où l'on fabrique des cordes, cordages, ficelles, filets, etc., en fibres naturelles ou synthétiques. Elle fonctionne généralement avec des machines à tresser, à toronner, etc.
status: 1

corps de garde
type: Concept
modified: 2015-01-05T11:45:13+01:00
in scheme: Thésaurus de la désignation des œuvres architecturales et des espaces aménagés
preferred label: guardhouses @en-us
broader: édifice logistique
alternative label: poste de garde
created: 2011-09-01T00:00:00+02:00
definition: Édifice ou bâtiment placé généralement à l'entrée d'une ville, d'une caserne, etc. où se tiennent les soldats chargés de la garde.
status: 1

corroierie
type: Concept
modified: 2015-04-28T16:31:34+02:00
in scheme: Thésaurus de la désignation des œuvres architecturales et des espaces aménagés
broader: usine de peausserie
created: 2011-09-01T00:00:00+02:00
definition: Usine où l'on effectue le corroyage des peaux, après tannage, afin de les amener à l'état de cuir fini (assouplissement, apprêt de surface, etc.). Elle comprend généralement un entrepôt industriel, une pièce de séchage, etc.
status: 1

usine de peausserie
type: Concept
modified: 2014-12-08T11:10:57+01:00
in scheme: Thésaurus de la désignation des œuvres architecturales et des espaces aménagés
narrower: tannerie
narrower: corroierie
narrower: usine de boyauderie
narrower: usine de délainage
narrower: usine de maroquinerie
narrower: usine de pelleterie
narrower: usine de traitement du poil animal
narrower: usine liée au travail de la corne
broader: usine
created: 2011-09-01T00:00:00+02:00
definition: Usine où l’on effectue les différentes préparations de peaux destinées à la maroquinerie, la ganterie, l'habillement, etc. Ce descripteur désigne également, par extension, les usines où l’on traite d’autres éléments provenant de dépouilles animales (boyaux, poils, cornes, etc.).
status: 1

couloir
type: Concept
modified: 2015-02-25T12:42:14+01:00
in scheme: Thésaurus de la désignation des œuvres architecturales et des espaces aménagés
preferred label: corridors @en-us
broader: éléments de circulation
created: 2011-09-01T00:00:00+02:00
scope note: Ne pas confondre avec la galerie, plus large, et qui peut également être un lieu d'exposition ou de représentation.
definition: Passage long assurant la communication entre plusieurs pièces.
status: 1

coupole
type: Concept
modified: 2015-02-24T17:24:39+01:00
in scheme: Thésaurus de la désignation des œuvres architecturales et des espaces aménagés
preferred label: domes (architectural elements) @en-us
broader: voûte
created: 2011-09-01T00:00:00+02:00
definition: Voûte de plan circulaire, ovale ou polygonal, dont l'intrados est théoriquement une concavité de révolution : il est tracé par la rotation d'un arc générateur sur un axe vertical.
status: 1

voûte
type: Concept
modified: 2015-02-24T17:23:08+01:00
in scheme: Thésaurus de la désignation des œuvres architecturales et des espaces aménagés
preferred label: vaults (structural elements) @en-us
narrower: coupole
narrower: trompe d'architecture
narrower: voussure
broader: couvrement
created: 2011-09-01T00:00:00+02:00
scope note: Ne pas appeler voûte un couvrement non maçonné.Voir aussi le Thesaurus des objets mobiliers.
definition: Ouvrage, nécessairement maçonné, construit entre des appuis, couvrant un espace et présentant un intrados.
status: 1

cour des comptes
type: Concept
modified: 2015-01-02T10:55:56+01:00
in scheme: Thésaurus de la désignation des œuvres architecturales et des espaces aménagés
broader: édifice financier public
created: 2011-09-01T00:00:00+02:00
definition: Sous l'Ancien Régime, édifice abritant l'institution financière chargée de surveiller les officiers comptables et de recevoir les actes de foi et d’hommage ainsi que les aveux et le dénombrement des vassaux de la couronne. Par la suite, édifice abritant le corps administratif chargé de contrôler l'observation des règles de la comptabilité publique dans l'exécution des budgets.
status: 1

courée
type: Concept
modified: 2015-01-09T11:25:02+01:00
in scheme: Thésaurus de la désignation des œuvres architecturales et des espaces aménagés
broader: lotissement concerté
created: 2011-09-01T00:00:00+02:00
definition: Lotissement d'habitations populaires formé généralement de séries de petits logements placés de part et d'autre d'une rue intérieure ou d'une cour commune.
status: 1

coursière
type: Concept
modified: 2015-02-25T12:46:46+01:00
in scheme: Thésaurus de la désignation des œuvres architecturales et des espaces aménagés
broader: éléments de circulation
created: 2011-09-01T00:00:00+02:00
scope note: Ne pas confondre avec galerie, ni avec balcon.
definition: Passage étroit pris dans l'épaisseur d'un mur. La coursière est dite béante lorsqu'elle est formée par une petite retraite du mur ou portée sur un petit encorbellement, sur une file de supports verticaux au lieu d'être prise dans l'épaisseur du mur.
status: 1
broad match: cb15081499r
broad match: Passage (architecture)

courtine
type: Concept
modified: 2015-01-05T12:36:35+01:00
in scheme: Thésaurus de la désignation des œuvres architecturales et des espaces aménagés
preferred label: curtain walls @en-us
broader: ouvrage fortifié
created: 2011-09-01T00:00:00+02:00
definition: Pan de muraille compris entre deux tours, entre deux bastions, etc.
status: 1

coutellerie
type: Concept
modified: 2014-12-15T11:35:36+01:00
in scheme: Thésaurus de la désignation des œuvres architecturales et des espaces aménagés
broader: usine de petite métallurgie
created: 2011-09-01T00:00:00+02:00
definition: Usine où l'on fabrique des couteaux, ciseaux, rasoirs, instruments de chirurgie, etc., comprenant généralement des machines à émoudre, à polir, à affûter, etc.
status: 1

usine de petite métallurgie
type: Concept
modified: 2014-12-10T16:56:27+01:00
in scheme: Thésaurus de la désignation des œuvres architecturales et des espaces aménagés
narrower: coutellerie
narrower: robinetterie
narrower: usine de chaudronnerie
narrower: usine de décolletage
narrower: usine de ferblanterie
narrower: usine de quincaillerie
narrower: usine de serrurerie
narrower: usine de taillanderie
broader: usine
created: 2011-09-01T00:00:00+02:00
definition: Usine qui fabrique des pièces de chaudronnerie, de robinetterie, de serrurerie, de quincaillerie, etc.
status: 1

couvent
type: Concept
modified: 2014-11-27T17:18:53+01:00
in scheme: Thésaurus de la désignation des œuvres architecturales et des espaces aménagés
preferred label: convento @it
preferred label: friary + nunnery + monastery @en-gb
preferred label: convents @en-us
broader: établissement conventuel
created: 2011-09-01T00:00:00+02:00
scope note: Il convient de préciser l'ordre religieux en désignation. Ne pas confondre avec établissement conventuel.
definition: Établissement d'une communauté religieuse d'hommes ou de femmes, à l'exclusion de l'abbaye, du prieuré, du béguinage, de la commanderie et de l'ermitage.
status: 1

forêt
type: Concept
modified: 2014-12-30T16:24:26+01:00
in scheme: Thésaurus de la désignation des œuvres architecturales et des espaces aménagés
preferred label: forests (cultural landscapes) @en-us
broader: couvert de jardin
created: 2011-09-01T00:00:00+02:00
definition: Vaste couvert dans lequel les végétaux ligneux, feuillus ou résineux prédominent et peuvent être exploités par l'homme pour un usage commercial ou constituer un espace de loisirs pour la promenade ou pour la chasse.
status: 1

groupe d'arbres
type: Concept
modified: 2014-12-30T16:25:42+01:00
in scheme: Thésaurus de la désignation des œuvres architecturales et des espaces aménagés
broader: couvert de jardin
created: 2011-09-01T00:00:00+02:00
definition: Groupe composé d'arbres de haute ou de moyenne futaie plantés à proximité les uns des autres et dont les houppiers s'interpénètrent. Il se distingue du massif d’arbres par un nombre d’individus moins important.
status: 1
broad match: cb11934786x
broad match: Arbre

labyrinthe
type: Concept
modified: 2014-12-30T16:28:01+01:00
in scheme: Thésaurus de la désignation des œuvres architecturales et des espaces aménagés
preferred label: maze gardens @en-us
broader: couvert de jardin
created: 2011-09-01T00:00:00+02:00
scope note: Ne pas confondre avec colimaçon, qui est en forme de spirale.
definition: Couvert formant un dédale à ciel ouvert, généralement constitué de palissades de verdure. Le cheminement au tracé tortueux où l'on s'égare facilement, constitué par des allées ou des sentiers, conduit souvent à des pièces découvertes et à des fabriques. Il procède également du jeu et ne présente qu'une seule entrée et une seule sortie.
status: 1

massif d'arbres
type: Concept
modified: 2014-09-18T10:55:32+02:00
in scheme: Thésaurus de la désignation des œuvres architecturales et des espaces aménagés
broader: couvert de jardin
created: 2011-09-01T00:00:00+02:00
definition: Couvert dépourvu de pièce découverte formant un ensemble homogène d'arbres forestiers ou d'ornement et dont la surface, relativement peu importante, est néanmoins destinée à être embrassée d'un seul coup d’œil.
status: 1

quinconce
type: Concept
modified: 2014-10-14T10:47:20+02:00
in scheme: Thésaurus de la désignation des œuvres architecturales et des espaces aménagés
broader: couvert de jardin
created: 2011-09-01T00:00:00+02:00
definition: Couvert destiné à la promenade et constitué par plusieurs rangées d'arbres d'ornement de haute-tige plantés en alignement de façon à répéter régulièrement une figure géométrique : carré, rectangle, losange, ou « quinconce », c'est-à-dire, au sens premier, la figure formée par le chiffre cinq d'un dé ou d'une carte à jouer.
status: 1

topiaire
type: Concept
modified: 2014-12-30T16:31:06+01:00
in scheme: Thésaurus de la désignation des œuvres architecturales et des espaces aménagés
preferred label: topiary @en-us
broader: couvert de jardin
created: 2011-09-01T00:00:00+02:00
definition: Végétal sculpté adoptant l'aspect d'un élément d'architecture, d'un motif abstrait ou figuratif.
status: 1

flèche en couverture
type: Concept
modified: 2015-02-25T12:00:44+01:00
in scheme: Thésaurus de la désignation des œuvres architecturales et des espaces aménagés
preferred label: spires @en-us
broader: couverture et accessoire du toit
created: 2011-09-01T00:00:00+02:00
definition: Couverture de plan centré ayant un grand développement en hauteur : sa hauteur est supérieure à la largeur de sa base. Elle peut être polygonale, conique, rhomboïdale, etc. La flèche en charpente est un toit. La flèche en pierre, qui ne présente pas de matériaux de couverture, n'est pas un toit mais une voûte à extrados en couverture.
status: 1

lanternon
type: Concept
modified: 2015-02-25T12:03:13+01:00
in scheme: Thésaurus de la désignation des œuvres architecturales et des espaces aménagés
preferred label: lanterns (roof appendages) @en-us
broader: couverture et accessoire du toit
created: 2011-09-01T00:00:00+02:00
scope note: Ne pas confondre avec campanile, ni avec belvédère.
definition: Petite construction de plan centré et de forme élancée, percée de fenêtres et placée au faîte d'un toit. Le lanternon se distingue du lanterneau par son volume élancé. Le lanternon sert souvent à donner de la lumière aux parties sous le toit.
status: 1

lucarne
type: Concept
modified: 2015-02-25T12:04:48+01:00
in scheme: Thésaurus de la désignation des œuvres architecturales et des espaces aménagés
preferred label: dormers @en-us
broader: couverture et accessoire du toit
created: 2011-09-01T00:00:00+02:00
definition: Ouvrage construit sous un toit permettant d'éclairer le comble par une ou plusieurs fenêtres.
status: 1

souche de cheminée
type: Concept
modified: 2015-02-24T17:09:58+01:00
in scheme: Thésaurus de la désignation des œuvres architecturales et des espaces aménagés
preferred label: chimney stacks @en-us
broader: couverture et accessoire du toit
created: 2011-09-01T00:00:00+02:00
scope note: Voir aussi le Thesaurus des objets mobiliers.
definition: Ouvrage de maçonnerie renfermant un ou plusieurs conduits de cheminée et s'élevant au-dessus du toit.
status: 1

toit en shed
type: Concept
modified: 2015-02-25T12:06:55+01:00
in scheme: Thésaurus de la désignation des œuvres architecturales et des espaces aménagés
preferred label: sawtooth roofs @en-us
broader: couverture et accessoire du toit
created: 2011-09-01T00:00:00+02:00
definition: Couverture à plusieurs pans en dents de scie couvrant généralement un atelier, une salle d'exposition, etc. Les versants verticaux sont vitrés.
status: 1

verrière en couverture
type: Concept
modified: 2015-02-25T12:09:40+01:00
in scheme: Thésaurus de la désignation des œuvres architecturales et des espaces aménagés
preferred label: glass roof @en-us
broader: couverture et accessoire du toit
created: 2011-09-01T00:00:00+02:00
definition: Toit ou partie de toit formé d'une charpente vitrée ou de dalles de verre.
status: 1

lambris de couvrement
type: Concept
modified: 2015-02-24T17:14:53+01:00
in scheme: Thésaurus de la désignation des œuvres architecturales et des espaces aménagés
broader: couvrement
created: 2011-09-01T00:00:00+02:00
scope note: Voir aussi le Thesaurus des objets mobiliers.
definition: Revêtement intérieur, généralement en bois, d'une charpente de toit. Le lambris de couvrement n'est pas une voûte, laquelle est maçonnée.
status: 1
broad match: cb12505322n

linteau
type: Concept
modified: 2015-02-24T17:16:06+01:00
in scheme: Thésaurus de la désignation des œuvres architecturales et des espaces aménagés
preferred label: lintels @en-us
broader: couvrement
created: 2011-09-01T00:00:00+02:00
scope note: Voir aussi le Thesaurus des objets mobiliers.
definition: Bloc de pierre (à la différence de la plate-bande qui est appareillée), pièce de bois ou de métal, nécessairement rectiligne, couvrant une baie. Il reçoit la charge des parties situées au-dessus de la baie et la reporte sur les deux points d'appui.
status: 1

plafond
type: Concept
modified: 2015-02-25T12:24:39+01:00
in scheme: Thésaurus de la désignation des œuvres architecturales et des espaces aménagés
preferred label: ceilings @en-us
broader: couvrement
created: 2011-09-01T00:00:00+02:00
scope note: Voir aussi le Thesaurus des objets mobiliers.
definition: Face intérieure plane et dégagée d'un plancher, d'une voûte plate ou d'une voûte déprimée, formant couvrement. La surface horizontale du plafond peut être raccordée aux murs par un adoucissement qui fait partie du plafond.
status: 1

plate-bande
type: Concept
modified: 2015-02-25T12:31:33+01:00
in scheme: Thésaurus de la désignation des œuvres architecturales et des espaces aménagés
preferred label: platbands @en-us
broader: couvrement
created: 2011-09-01T00:00:00+02:00
scope note: La plate-bande se distingue du linteau en ce qu'elle est appareillée et de l'arc en ce qu'elle est rectiligne. Voir aussi le Thesaurus des objets mobiliers.
definition: Organe rectiligne et appareillé, porté par deux points d'appui et présentant un soffite.
status: 1

crématorium
type: Concept
modified: 2014-10-15T13:01:10+02:00
in scheme: Thésaurus de la désignation des œuvres architecturales et des espaces aménagés
preferred label: crematorio @it
preferred label: crematorium @en-gb
preferred label: crematories @en-us
broader: édifices et édicules funéraires
alternative label: four crématoire
created: 2011-09-01T00:00:00+02:00
definition: Bâtiment où l'on incinère les morts.
status: 1

cristallerie
type: Concept
modified: 2015-04-30T15:53:08+02:00
in scheme: Thésaurus de la désignation des œuvres architecturales et des espaces aménagés
broader: verrerie
created: 2011-09-01T00:00:00+02:00
definition: Usine où l'on fabrique divers objets utilitaires ou décoratifs en cristal (verre blanc à l'oxyde de plomb). Elle comprend généralement des ateliers de taille, de gravure, un four industriel, un magasin industriel, etc.
status: 1

verrerie
type: Concept
modified: 2015-03-23T15:31:31+01:00
in scheme: Thésaurus de la désignation des œuvres architecturales et des espaces aménagés
narrower: cristallerie
narrower: usine de verre plat
narrower: usine de fibre de verre
narrower: usine de verre creux
narrower: usine de verres optiques
broader: usine
created: 2011-09-01T00:00:00+02:00
definition: Usine où l'on fabrique du verre et divers objets et pièces de verre.
status: 1

croix de chemin
type: Concept
modified: 2015-02-24T12:01:53+01:00
in scheme: Thésaurus de la désignation des œuvres architecturales et des espaces aménagés
preferred label: wayside crosses @en-us
preferred label: wayside cross @en-gb
broader: croix monumentale
created: 2011-09-01T00:00:00+02:00
scope note: Une croix de chemin in situ fait l'objet d'un dossier architecture. Elle ne fait l’objet d’un dossier objets mobiliers que si elle est déposée. Voir aussi le Thesaurus des objets mobiliers.
definition: Croix monumentale érigée en bordure d'une voie ou à un carrefour.
status: 1

croix monumentale
type: Concept
modified: 2015-02-24T11:49:27+01:00
in scheme: Thésaurus de la désignation des œuvres architecturales et des espaces aménagés
preferred label: croce monumentale @it
preferred label: cross monuments @en-us
preferred label: cross @en-gb
narrower: croix de chemin
narrower: croix de cimetière
broader: édicule religieux chrétien
alternative label: croix de mission
alternative label: croix votive
created: 2011-09-01T00:00:00+02:00
scope note: Une croix monumentale in situ fait l'objet d'un dossier architecture. Elle ne fait l’objet d’un dossier objets mobiliers que si elle est déposée. Voir aussi le Thesaurus des objets mobiliers.
definition: Croix isolée formant monument.
status: 1
narrow match: http://data.bnf.fr/ark:/12148/cb119485031

croix de cimetière
type: Concept
modified: 2015-02-24T12:04:04+01:00
in scheme: Thésaurus de la désignation des œuvres architecturales et des espaces aménagés
preferred label: croce cimiteriale @it
preferred label: churchyard cross @en-gb
preferred label: cemetery + crosses @en-us
broader: croix monumentale
created: 2011-09-01T00:00:00+02:00
scope note: Une croix de cimetière in situ fait l'objet d'un dossier architecture. Elle ne fait l’objet d’un dossier objets mobiliers que si elle est déposée. Voir aussi le Thesaurus des objets mobiliers.
definition: Croix monumentale érigée dans un cimetière.
status: 1

crypte
type: Concept
modified: 2014-11-28T15:59:47+01:00
in scheme: Thésaurus de la désignation des œuvres architecturales et des espaces aménagés
preferred label: cripta @it
preferred label: crypts @en-us
preferred label: crypt @en-gb
broader: partie d'église
created: 2011-09-01T00:00:00+02:00
scope note: Ne pas confondre avec chapelle basse qui n'est pas enterrée.
definition: Espace aménagé sous le sol d'une église, servant généralement de chapelle. La crypte est formée de galeries et non de vaisseaux.
status: 1

cuisine
type: Concept
modified: 2014-12-31T16:17:42+01:00
in scheme: Thésaurus de la désignation des œuvres architecturales et des espaces aménagés
preferred label: kitchens @en-us
broader: logis
created: 2011-09-01T00:00:00+02:00
definition: Pièce ou bâtiment où l'on prépare les aliments.
status: 1

cuvage
type: Concept
modified: 2014-12-30T14:14:41+01:00
in scheme: Thésaurus de la désignation des œuvres architecturales et des espaces aménagés
broader: partie d'édifice agricole
created: 2011-09-01T00:00:00+02:00
related: établissement vinicole
definition: Local ou aire aménagée où sont installées les machines à pressurer le raisin et les cuves de vinification.
TermeAssocie: établissement vinicole
status: 1
broad match: http://vocab.getty.edu/aat/300387281
broad match: http://data.bnf.fr/ark:/12148/cb121050197

dalle
type: Concept
modified: 2014-10-17T14:35:20+02:00
in scheme: Thésaurus de la désignation des œuvres architecturales et des espaces aménagés
preferred label: slabs @en-us
broader: place
created: 2011-09-01T00:00:00+02:00
definition: Sol artificiel destiné aux piétons ou aux véhicules, pouvant être aménagé en espace vert ou servant à la distribution d’édifices.
status: 1

place
type: Concept
modified: 2015-01-07T12:21:54+01:00
in scheme: Thésaurus de la désignation des œuvres architecturales et des espaces aménagés
preferred label: piazza @it
preferred label: square @en-gb
preferred label: squares (open spaces) @en-us
narrower: dalle
narrower: esplanade
narrower: place d'armes
narrower: lice
narrower: parvis
broader: espace libre
created: 2011-09-01T00:00:00+02:00
definition: Espace public desservi par des voies, affecté aux piétons et/ou aux véhicules, entouré principalement par des bâtiments et généralement pourvu de mobilier urbain et d'édicules divers.
status: 1

déambulatoire
type: Concept
modified: 2014-10-15T17:29:47+02:00
in scheme: Thésaurus de la désignation des œuvres architecturales et des espaces aménagés
preferred label: deambulatorio @it
preferred label: ambulatory (internal) @en-gb
preferred label: ambulatories @en-us
broader: partie d'église
created: 2011-09-01T00:00:00+02:00
definition: Espace de circulation disposé autour du chœur.
status: 1

salon de thé
type: Concept
modified: 2014-12-04T16:00:48+01:00
in scheme: Thésaurus de la désignation des œuvres architecturales et des espaces aménagés
preferred label: tea rooms @en-us
broader: débit de boissons
created: 2011-09-01T00:00:00+02:00
scope note: Le décor d'un salon de thé ou de sa devanture fait l’objet d’un dossier objet mobilier.
definition: Édifice commercial où l'on consomme des boissons non alcoolisées et des pâtisseries.
status: 1

parterre
type: Concept
modified: 2014-12-30T16:40:57+01:00
in scheme: Thésaurus de la désignation des œuvres architecturales et des espaces aménagés
narrower: parterre de carrés
narrower: parterre de gazon
narrower: parterre de pièces coupées
narrower: parterre de broderie
narrower: parterre en mosaïculture
broader: découvert de jardin
created: 2011-09-01T00:00:00+02:00
definition: Surface ou ensemble de pièces découvertes à motifs ornementaux constitués par des végétaux et, souvent, des éléments minéraux. Un parterre peut comprendre d'autres éléments de décor : bassin, statues, vases, vasques, etc. Le parterre peut être régulier (parterre à la française, parterre ordonné) ou non.
status: 1

pelouse
type: Concept
modified: 2014-12-30T16:45:50+01:00
in scheme: Thésaurus de la désignation des œuvres architecturales et des espaces aménagés
preferred label: lawns (landscaped grass) @en-us
broader: découvert de jardin
created: 2011-09-01T00:00:00+02:00
definition: Surface ou pièce découverte obtenue par ensemencement et constituée de diverses plantes herbacées gazonnantes régulièrement fauchées afin d'obtenir une étendue homogène et rase.
status: 1

pièce de gazon
type: Concept
modified: 2014-10-22T10:17:11+02:00
in scheme: Thésaurus de la désignation des œuvres architecturales et des espaces aménagés
narrower: vertugadin
broader: découvert de jardin
created: 2011-09-01T00:00:00+02:00
definition: Pièce découverte plantée de gazon.
status: 1

planche de jardin
type: Concept
modified: 2014-11-18T13:58:58+01:00
in scheme: Thésaurus de la désignation des œuvres architecturales et des espaces aménagés
broader: découvert de jardin
created: 2011-09-01T00:00:00+02:00
definition: Pièce découverte rectangulaire, large d'environ 1,25 m, parfois légèrement bombée.
status: 1
broad match: http://data.bnf.fr/ark:/12148/cb11965436d
broad match: http://vocab.getty.edu/aat/300008889

plate-bande de jardin
type: Concept
modified: 2014-10-14T10:54:19+02:00
in scheme: Thésaurus de la désignation des œuvres architecturales et des espaces aménagés
broader: découvert de jardin
created: 2011-09-01T00:00:00+02:00
definition: Pièce découverte longue et étroite, constituée de gazon, de fleurs ou d'arbustes d'ornement en pleine-terre ou hors-sol.
status: 1

prairie ornementale
type: Concept
modified: 2014-12-30T16:51:17+01:00
in scheme: Thésaurus de la désignation des œuvres architecturales et des espaces aménagés
broader: découvert de jardin
created: 2011-09-01T00:00:00+02:00
definition: Surface découverte obtenue par ensemencement et constituée de végétaux herbacés que l'on fauche après la période de floraison.
status: 1

rocaille de jardin
type: Concept
modified: 2014-12-30T16:52:59+01:00
in scheme: Thésaurus de la désignation des œuvres architecturales et des espaces aménagés
preferred label: rock gardens @en-us
broader: découvert de jardin
created: 2011-09-01T00:00:00+02:00
definition: Composition constituée par des végétaux d'ornement plantés entre des blocs de rochers artificiels ou naturels. La rocaille est une composition propre au jardin irrégulier.
status: 1

salle de verdure
type: Concept
modified: 2014-12-30T16:55:32+01:00
in scheme: Thésaurus de la désignation des œuvres architecturales et des espaces aménagés
broader: découvert de jardin
created: 2011-09-01T00:00:00+02:00
definition: Découvert aménagé dans un bosquet, parfois doté de niches de verdure de formes diverses. Selon sa destination originelle, elle peut être dénommée salon de verdure (salon vert), salle de bal, salle à manger ou manège de verdure.
status: 1
broad match: http://vocab.getty.edu/aat/300008857
broad match: http://data.bnf.fr/ark:/12148/cb150964724

logis abbatial
type: Concept
modified: 2014-11-28T14:57:56+01:00
in scheme: Thésaurus de la désignation des œuvres architecturales et des espaces aménagés
preferred label: abbots' + houses @en-us
preferred label: alloggio dell' abate @it
preferred label: abbot's house @en-gb
broader: partie d'édifice religieux
created: 2011-09-01T00:00:00+02:00
related: demeure
definition: Dans un établissement conventuel, bâtiment ou corps de bâtiment abritant le logis de l'abbé.
TermeAssocie: demeure
status: 1

logis prieural
type: Concept
modified: 2014-11-28T15:00:09+01:00
in scheme: Thésaurus de la désignation des œuvres architecturales et des espaces aménagés
preferred label: alloggio del priore @it
preferred label: prior's house @en-gb
broader: partie d'édifice religieux
created: 2011-09-01T00:00:00+02:00
related: demeure
definition: Dans un établissement conventuel, bâtiment ou corps de bâtiment abritant le logis du prieur.
TermeAssocie: demeure
status: 1

ferme
type: Concept
modified: 2014-12-30T13:52:01+01:00
in scheme: Thésaurus de la désignation des œuvres architecturales et des espaces aménagés
preferred label: farms @en-us
narrower: grange monastique
broader: édifice agricole
created: 2011-09-01T00:00:00+02:00
scope note: La ferme se distingue des autres maisons rurales par l'importance des espaces et des bâtiments consacrés à l'outillage agricole, au bétail et aux récoltes.
related: demeure
related: exploitation agricole
definition: Édifice comprenant un logis et les dépendances nécessaires à l'exploitation agricole.
TermeAssocie: demeure
TermeAssocie: exploitation agricole
status: 1
narrow match: cb11952822w

logement de contremaître
type: Concept
modified: 2015-03-31T14:22:20+02:00
in scheme: Thésaurus de la désignation des œuvres architecturales et des espaces aménagés
broader: parties industrielles
created: 2011-09-01T00:00:00+02:00
related: demeure
definition: Habitation à l'usage du contremaître ou du chef d'une équipe d'ouvriers.
TermeAssocie: demeure
status: 1

logement d'ouvriers
type: Concept
modified: 2015-03-31T15:46:38+02:00
in scheme: Thésaurus de la désignation des œuvres architecturales et des espaces aménagés
broader: parties industrielles
created: 2011-09-01T00:00:00+02:00
related: demeure
definition: Habitation affectée aux ouvriers d'une usine.
TermeAssocie: demeure
status: 1

logement patronal
type: Concept
modified: 2015-03-31T15:47:29+02:00
in scheme: Thésaurus de la désignation des œuvres architecturales et des espaces aménagés
broader: parties industrielles
alternative label: logis patronal
created: 2011-09-01T00:00:00+02:00
scope note: Ne pas employer pour la demeure du propriétaire de l'usine.
related: demeure
definition: Habitation du directeur de l'usine.
TermeAssocie: demeure
status: 1

hôtel
type: Concept
modified: 2014-12-31T12:22:24+01:00
in scheme: Thésaurus de la désignation des œuvres architecturales et des espaces aménagés
preferred label: town houses @en-us
broader: demeure
created: 2011-09-01T00:00:00+02:00
scope note: Ne pas confondre avec hôtel de voyageurs.
definition: Dans l'architecture classique, demeure citadine d'un grand seigneur ou d'un riche particulier, accompagnée généralement de communs, d'une cour et d'un jardin.
status: 1

immeuble
type: Concept
modified: 2014-12-31T12:26:01+01:00
in scheme: Thésaurus de la désignation des œuvres architecturales et des espaces aménagés
preferred label: apartment houses @en-us
broader: demeure
alternative label: immeuble à appartements
created: 2011-09-01T00:00:00+02:00
scope note: L'immeuble se distingue de l'hôtel par l'absence de communs et la relative homogénéité de traitement des différents appartements.
definition: Demeure divisée, à la construction, en appartements pour plusieurs particuliers.
status: 1

immeuble à logements
type: Concept
modified: 2014-12-31T12:31:19+01:00
in scheme: Thésaurus de la désignation des œuvres architecturales et des espaces aménagés
broader: demeure
created: 2011-09-01T00:00:00+02:00
scope note: Ne pas confondre avec un immeuble desservi par des coursives en façade et disposant d’accès communs.
definition: Edifice divisé à la construction en habitations juxtaposées à un ou plusieurs étages. Chaque logement dispose d’un accès particulier.
status: 1

maison
type: Concept
modified: 2014-12-31T12:36:44+01:00
in scheme: Thésaurus de la désignation des œuvres architecturales et des espaces aménagés
preferred label: houses @en-us
broader: demeure
alternative label: maison d'habitations
created: 2011-09-01T00:00:00+02:00
scope note: Compléter éventuellement la désignation : de garde-barrière, de notable, de vigneron, etc. Lorsque l'habitation est située à l'intérieur d'un édifice comportant une autre fonction principale, le logis ou le logement sont des parties constituantes.
definition: Édifice à usage d'habitation monofamiliale, ne présentant pas les caractères des autres formes spécifiques de la demeure (château, hôtel, etc.).
status: 1

manoir
type: Concept
modified: 2014-12-31T12:40:04+01:00
in scheme: Thésaurus de la désignation des œuvres architecturales et des espaces aménagés
preferred label: manor houses ou manors @en-us
broader: demeure
alternative label: maison noble
alternative label: maison seigneuriale
created: 2011-09-01T00:00:00+02:00
definition: Au Moyen Âge et sous l'Ancien Régime, dans l'ouest de la France, demeure à la tête d'un domaine agricole appartenant à un propriétaire de fief, noble ou non, ne possédant pas les droits seigneuriaux permettant d'élever un château muni de défenses importantes : tours, donjons, etc. Le manoir comporte des parties agricoles plus ou moins étendues, liées au logis.
status: 1

palais
type: Concept
modified: 2014-12-31T12:54:59+01:00
in scheme: Thésaurus de la désignation des œuvres architecturales et des espaces aménagés
preferred label: palaces @en-us
narrower: palais épiscopal
broader: demeure
created: 2011-09-01T00:00:00+02:00
definition: Résidence officielle urbaine d'un seigneur suzerain laïque ou religieux, à l'origine souvent fortifiée et dans laquelle se tenaient les cours, plaids, parlements et tribunaux d'officialité. Par extension, résidence officielle royale ou princière.
status: 1

presbytère
type: Concept
modified: 2014-12-31T12:57:40+01:00
in scheme: Thésaurus de la désignation des œuvres architecturales et des espaces aménagés
preferred label: rectories @en-us
broader: demeure
alternative label: cure
alternative label: maison curiale
created: 2011-09-01T00:00:00+02:00
related: église paroissiale
definition: Demeure du desservant, généralement située à proximité de l'édifice cultuel. Elle possède parfois des dépendances.
TermeAssocie: église paroissiale
status: 1

rendez-vous de chasse
type: Concept
modified: 2014-12-31T12:59:34+01:00
in scheme: Thésaurus de la désignation des œuvres architecturales et des espaces aménagés
preferred label: hunting lodges @en-us
broader: demeure
alternative label: pavillon de chasse
created: 2011-09-01T00:00:00+02:00
definition: Édifice construit dans un parc de chasse ou une forêt, permettant aux chasseurs de se retrouver, se rafraîchir et se reposer après une partie de chasse.
status: 1

villa antique
type: Concept
modified: 2014-12-31T13:01:11+01:00
in scheme: Thésaurus de la désignation des œuvres architecturales et des espaces aménagés
broader: demeure
created: 2011-09-01T00:00:00+02:00
definition: Au sens premier, maison de maître dans l'Antiquité romaine. La villa urbana est une résidence urbaine. La villa rustica comporte des dépendances agricoles.
definition: Réserver le sens actuel de villa (maison à caractère bourgeois entourée d'un jardin et munie de dépendances) pour préciser la désignation d’une demeure.
status: 1

demi-lune
type: Concept
modified: 2015-01-05T13:07:03+01:00
in scheme: Thésaurus de la désignation des œuvres architecturales et des espaces aménagés
preferred label: ravelins @en-us
broader: ouvrage extérieur
created: 2011-09-01T00:00:00+02:00
definition: Dehors retranché, placé devant la courtine d'un front bastionné. Elle est généralement formée de deux faces en angle aigu.
status: 1

ouvrage extérieur
type: Concept
modified: 2014-09-19T17:29:58+02:00
in scheme: Thésaurus de la désignation des œuvres architecturales et des espaces aménagés
preferred label: outworks @en-us
narrower: demi-lune
narrower: ouvrage avancé
broader: ouvrage fortifié
created: 2011-09-01T00:00:00+02:00
definition: Ouvrage construit devant le corps de place. Parmi les ouvrages extérieurs, on distingue : les dehors, c'est-à-dire tous les ouvrages qui, sans être attachés au corps de place, sont construits dans son fossé et donc à l'intérieur du périmètre délimité par le chemin couvert, et les ouvrages avancés, construits au-delà du chemin couvert.
status: 1

dépôt d'autobus
type: Concept
modified: 2014-11-28T16:10:53+01:00
in scheme: Thésaurus de la désignation des œuvres architecturales et des espaces aménagés
preferred label: bus depots @en-us
broader: édifice du génie civil
created: 2011-09-01T00:00:00+02:00
definition: Espace généralement clos regroupant l'ensemble des bâtiments et des installations nécessaires pour remiser, entretenir et réparer les autobus.
status: 1

dépôt de mendicité
type: Concept
modified: 2015-01-02T11:20:25+01:00
in scheme: Thésaurus de la désignation des œuvres architecturales et des espaces aménagés
broader: édifice d'assistance ou de protection sociale
created: 2011-09-01T00:00:00+02:00
definition: Établissement où l'on place les individus arrêtés pour mendicité ou vagabondage.
status: 1

dépôt de tramways
type: Concept
modified: 2014-11-28T16:10:02+01:00
in scheme: Thésaurus de la désignation des œuvres architecturales et des espaces aménagés
preferred label: streetcars depots @en-us
broader: édifice du génie civil
created: 2011-09-01T00:00:00+02:00
definition: Espace généralement clos regroupant l'ensemble des bâtiments et des installations nécessaires pour remiser, entretenir et réparer les tramways.
status: 1

derrick
type: Concept
modified: 2015-03-27T11:46:36+01:00
in scheme: Thésaurus de la désignation des œuvres architecturales et des espaces aménagés
broader: parties industrielles
alternative label: tour de forage
created: 2011-09-01T00:00:00+02:00
related: puits de pétrole
definition: Bâti métallique supportant le trépan qui sert à forer un puits de pétrole.
TermeAssocie: puits de pétrole
status: 1

puits de pétrole
type: Concept
modified: 2015-01-21T15:48:16+01:00
in scheme: Thésaurus de la désignation des œuvres architecturales et des espaces aménagés
broader: usine d'extraction
created: 2011-09-01T00:00:00+02:00
related: derrick
definition: Trou cylindrique vertical foré dans le sol pour l'extraction du pétrole, équipé d'un tube de production qui assure la communication directe avec le réservoir et comprenant généralement en surface une installation de pompage (pompe à bras, conduit, etc.).
TermeAssocie: derrick
status: 1

devanture
type: Concept
modified: 2015-02-25T10:09:16+01:00
in scheme: Thésaurus de la désignation des œuvres architecturales et des espaces aménagés
preferred label: storefronts @en-us
broader: parties commerciales
alternative label: devanture de boutique
created: 2011-09-01T00:00:00+02:00
scope note: Voir aussi le Thesaurus des objets mobiliers.
definition: Revêtement de la façade d'une boutique.
status: 1

déversoir de fond
type: Concept
modified: 2014-09-23T16:51:29+02:00
in scheme: Thésaurus de la désignation des œuvres architecturales et des espaces aménagés
broader: ouvrage d'art
alternative label: déchargeoir
created: 2011-09-01T00:00:00+02:00
scope note: Ne pas confondre avec vanne.
definition: Dans un bief de canal de navigation, ouvrage composé d’une ouverture de fond permettant en cas de crue de suppléer aux insuffisances des déversoirs de superficie pour l’évacuation des eaux excédentaires. Cet ouvrage permet également de vider complètement le bief afin d’en assurer le curage et l’entretien.
status: 1
broad match: cb11979887k

déversoir de superficie
type: Concept
modified: 2014-12-01T14:24:18+01:00
in scheme: Thésaurus de la désignation des œuvres architecturales et des espaces aménagés
preferred label: spillways @en-us
broader: ouvrage d'art
alternative label: reversoir
alternative label: déversoir de crue
alternative label: épanchoir
created: 2011-09-01T00:00:00+02:00
scope note: Ne pas confondre avec barrage.
definition: Partie d’un barrage, d’un réservoir ou ouvrage placé sur la berge du bief d’un canal pour évacuer les eaux excédentaires. Dans le cas d’un canal de navigation, un pont peut être construit au-dessus de l’ouvrage pour assurer la continuité du chemin de halage.
status: 1
broad match: cb11979887k

digue
type: Concept
modified: 2014-12-01T14:27:37+01:00
in scheme: Thésaurus de la désignation des œuvres architecturales et des espaces aménagés
preferred label: dikes @en-us
broader: ouvrage d'art
alternative label: levée
created: 2011-09-01T00:00:00+02:00
related: jetée
definition: Levée en terre, en maçonnerie ou en bois, servant à contenir les eaux ou à détourner leur cours. Les digues sont continues devant les terres basses d'une côte, le long des rives d'un cours d'eau pour lutter contre les inondations, ou discontinues devant une rade pour protéger un port du mouvement des vagues et de l'ensablement.
TermeAssocie: jetée
status: 1

jetée
type: Concept
modified: 2014-12-02T12:21:53+01:00
in scheme: Thésaurus de la désignation des œuvres architecturales et des espaces aménagés
preferred label: jetties @en-us
narrower: estacade
broader: ouvrage d'art
alternative label: brise-lames
alternative label: môle
created: 2011-09-01T00:00:00+02:00
scope note: Ne pas confondre avec appontement.
related: digue
definition: Ouvrage, en maçonnerie ou en charpente, qui s’avance dans la mer, un lac ou un cours d’eau pour protéger un port ou une plage contre la violence des lames ou pour diriger un courant. La jetée est généralement orientée en travers du vent régnant. La signalisation optique se trouve le plus souvent à la tête de la jetée.
TermeAssocie: digue
status: 1

dispensaire
type: Concept
modified: 2015-01-02T11:51:29+01:00
in scheme: Thésaurus de la désignation des œuvres architecturales et des espaces aménagés
preferred label: dispensaries @en-us
broader: établissement médical
created: 2011-09-01T00:00:00+02:00
definition: Établissement médical destiné à donner des consultations gratuites, des médicaments et à vacciner les enfants.
status: 1

établissement médical
type: Concept
modified: 2015-01-02T11:57:19+01:00
in scheme: Thésaurus de la désignation des œuvres architecturales et des espaces aménagés
preferred label: health facilities @en-us
narrower: dispensaire
narrower: infirmerie
broader: édifice hospitalier
alternative label: centre médical
alternative label: institut médical
created: 2011-09-01T00:00:00+02:00
definition: Centre de consultation et de soins médicaux.
status: 1

dock
type: Concept
modified: 2014-10-17T15:13:52+02:00
in scheme: Thésaurus de la désignation des œuvres architecturales et des espaces aménagés
preferred label: warehouses @en-us
broader: entrepôt commercial
created: 2011-09-01T00:00:00+02:00
definition: Bâtiment construit en bordure d'un bassin de port, destiné à entreposer des marchandises.
status: 1
broad match: Entrepôt

entrepôt commercial
type: Concept
modified: 2014-12-04T16:02:29+01:00
in scheme: Thésaurus de la désignation des œuvres architecturales et des espaces aménagés
narrower: dock
broader: édifice artisanal commercial ou tertiaire
created: 2011-09-01T00:00:00+02:00
related: magasin industriel
definition: Édifice servant de lieu de dépôt pour les marchandises.
TermeAssocie: magasin industriel
status: 1
broad match: http://data.bnf.fr/ark:/12148/cb11950173c

dolmen
type: Concept
modified: 2015-02-24T16:18:20+01:00
in scheme: Thésaurus de la désignation des œuvres architecturales et des espaces aménagés
preferred label: chambered tomb @en-gb
preferred label: megalithic chamber tomb @en-us
broader: mégalithe
alternative label: arca
alternative label: caxa
alternative label: cibournié
created: 2011-09-01T00:00:00+02:00
scope note: Ne pas confondre dolmen à couloir, dans lequel l'accès, moins large ou moins élevé que la chambre, est nettement distinct de celle-ci, avec allée couverte.
definition: Chambre sépulcrale de plan massé, formée par une ou plusieurs tables portées par des orthostates. Le dolmen peut être sous tumulus.
status: 1

donjon
type: Concept
modified: 2015-01-05T12:40:16+01:00
in scheme: Thésaurus de la désignation des œuvres architecturales et des espaces aménagés
preferred label: keeps @en-us
broader: ouvrage fortifié
created: 2011-09-01T00:00:00+02:00
definition: Tour maîtresse d'un château fort, pouvant servir de logis ou de réduit. Elle se distingue des autres tours par son volume.
status: 1

double caponnière
type: Concept
modified: 2015-01-05T12:41:35+01:00
in scheme: Thésaurus de la désignation des œuvres architecturales et des espaces aménagés
broader: ouvrage fortifié
created: 2011-09-01T00:00:00+02:00
scope note: Ne pas confondre avec caponnière, qui est un ouvrage bas de flanquement établi dans le fossé sec d'une place forte.
definition: Chemin dissimulé entre deux parapets en glacis qui peuvent être rendus défensifs par des banquettes d'infanterie ; il est construit au fond et au travers d'un fossé sec et permet de communiquer entre le corps de place et un dehors, notamment une demi-lune.
status: 1

douves
type: Concept
modified: 2015-01-05T12:52:45+01:00
in scheme: Thésaurus de la désignation des œuvres architecturales et des espaces aménagés
preferred label: moats @en-us
broader: fossé
created: 2011-09-01T00:00:00+02:00
definition: Fossé habituellement en eau entourant un édifice (demeure, ferme, château fort, etc.).
status: 1

fossé
type: Concept
modified: 2015-01-05T12:51:43+01:00
in scheme: Thésaurus de la désignation des œuvres architecturales et des espaces aménagés
preferred label: fosses @en-us
narrower: douves
broader: ouvrage fortifié
created: 2011-09-01T00:00:00+02:00
definition: Obstacle constitué par une tranchée : son profil est donc sous le niveau du terrain.
status: 1

étang
type: Concept
modified: 2014-12-30T17:04:59+01:00
in scheme: Thésaurus de la désignation des œuvres architecturales et des espaces aménagés
preferred label: ponds @en-us
broader: eaux de jardin
created: 2011-09-01T00:00:00+02:00
definition: Étendue d'eau, le plus souvent artificielle, reposant dans une cuvette à fond imperméable et équipée d’une bonde, ouverture de fond permettant de la vider.
status: 1

fausse rivière
type: Concept
modified: 2014-10-14T11:11:19+02:00
in scheme: Thésaurus de la désignation des œuvres architecturales et des espaces aménagés
broader: eaux de jardin
created: 2011-09-01T00:00:00+02:00
scope note: Ne pas appeler fausse rivière un bras mort ou secondaire d'un cours d'eau.
definition: Réservoir affectant la forme d'une rivière dont les extrémités sont dissimulées au moyen d'artifices divers : végétaux, rochers naturels ou artificiels.
status: 1

île artificielle
type: Concept
modified: 2014-12-30T17:06:45+01:00
in scheme: Thésaurus de la désignation des œuvres architecturales et des espaces aménagés
preferred label: artificial islands @en-us
broader: eaux de jardin
created: 2011-09-01T00:00:00+02:00
definition: Île aménagée pour l'ornement d'un jardin. L'île champêtre veut s'apparenter à une île naturelle. L'île architecturée est régulière et à rives maçonnées.
status: 1

jeu d'eau
type: Concept
modified: 2014-12-30T17:08:50+01:00
in scheme: Thésaurus de la désignation des œuvres architecturales et des espaces aménagés
broader: eaux de jardin
alternative label: jet d'eau
created: 2011-09-01T00:00:00+02:00
definition: Arrivée d'eau sous pression jaillissant d'un tuyau, qui décrit une figure et retombe dans une étendue d'eau (bassin, lac, etc.). Le jeu d'eau peut être accompagné d'effets sonores ou lumineux.
status: 1

lac de jardin
type: Concept
modified: 2014-12-30T17:09:43+01:00
in scheme: Thésaurus de la désignation des œuvres architecturales et des espaces aménagés
broader: eaux de jardin
created: 2011-09-01T00:00:00+02:00
definition: Lac, souvent artificiel, destiné à l'ornementation d'un jardin d'agrément.
status: 1

naumachie
type: Concept
modified: 2014-12-30T17:11:10+01:00
in scheme: Thésaurus de la désignation des œuvres architecturales et des espaces aménagés
broader: eaux de jardin
created: 2011-09-01T00:00:00+02:00
definition: Bassin aux vastes dimensions, entouré ou non d'une colonnade, où l'on pratique des jeux nautiques à l'imitation des naumachies de la Rome antique.
status: 1

rivière artificielle
type: Concept
modified: 2014-12-31T10:24:53+01:00
in scheme: Thésaurus de la désignation des œuvres architecturales et des espaces aménagés
broader: eaux de jardin
created: 2011-09-01T00:00:00+02:00
definition: Cours d'eau artificiel, de faible dénivellation et de moyenne largeur, dont le flux se poursuit ou semble se poursuivre hors des limites du jardin.
status: 1

échauguette
type: Concept
modified: 2015-02-26T11:03:37+01:00
in scheme: Thésaurus de la désignation des œuvres architecturales et des espaces aménagés
broader: pièce
created: 2011-09-01T00:00:00+02:00
scope note: Ne pas confondre avec tourelle, ni avec oriel, ni avec logette, ni avec bretèche, dont le sol est percé pour le tir plongeant.
definition: Petit ouvrage en surplomb, de plan massé, contenant une petite pièce.
status: 1

pièce
type: Concept
modified: 2015-02-25T16:40:10+01:00
in scheme: Thésaurus de la désignation des œuvres architecturales et des espaces aménagés
preferred label: rooms @en-us
narrower: échauguette
narrower: galerie
narrower: logette
narrower: loggia
narrower: parloir
narrower: tribune
narrower: véranda
narrower: vestibule
broader: partie ou élément commun à tous les types d'architecture et aux espaces aménagés
created: 2011-09-01T00:00:00+02:00
definition: Espace habitable délimité, dans un étage, par les divisions des murs et des cloisons. Cependant, la pièce à l'italienne se développe sur la hauteur de plusieurs étages.
status: 1

échelle d'écluses
type: Concept
modified: 2014-10-23T12:55:36+02:00
in scheme: Thésaurus de la désignation des œuvres architecturales et des espaces aménagés
broader: écluse
created: 2011-09-01T00:00:00+02:00
scope note: Ne pas confondre avec site d’écluse, ni avec chaîne d’écluses.
definition: Succession d'écluses échelonnées qui se touchent, de sorte que les portes aval de la première servent de portes amont à la seconde, etc.
status: 1
broad match: Écluse

écluse
type: Concept
modified: 2014-12-02T12:00:08+01:00
in scheme: Thésaurus de la désignation des œuvres architecturales et des espaces aménagés
preferred label: locks (hydraulic structures) @en-us
narrower: échelle d'écluses
broader: ouvrage d'art
alternative label: écluse à sas
created: 2011-09-01T00:00:00+02:00
scope note: Ne pas confondre avec vanne, ni avec porte de garde. Aux entrées d’un canal de dérivation une écluse à sas peut également avoir la même fonction qu’une porte de garde, elle est dite alors écluse de garde.
related: site d'écluse
definition: Sur une voie navigable, ouvrage d'art formé de deux portes, entre lesquelles se trouve un sas ou petit bief de la longueur d'un bateau et servant à rattraper la différence de niveau entre cours supérieur et cours inférieur.
TermeAssocie: site d'écluse
status: 1

échevinage
type: Concept
modified: 2014-12-12T10:33:08+01:00
in scheme: Thésaurus de la désignation des œuvres architecturales et des espaces aménagés
broader: mairie
created: 2011-09-01T00:00:00+02:00
definition: Sous l'Ancien Régime et dans le nord de la France, édifice public où se réunissent les échevins formant le corps administratif d'une ville.
status: 1
broad match: http://vocab.getty.edu/aat/300006063
broad match: cb12049407z

mairie
type: Concept
modified: 2014-12-12T10:17:40+01:00
in scheme: Thésaurus de la désignation des œuvres architecturales et des espaces aménagés
preferred label: town halls @en-us
narrower: échevinage
narrower: hôtel de ville
narrower: maison commune
narrower: maison consulaire
broader: édifice de l'administration ou de la vie publique
created: 2011-09-01T00:00:00+02:00
definition: Édifice ou partie d'édifice où se réunissent les magistrats municipaux et où sont groupés les services administratifs d'une commune.
status: 1

échoppe
type: Concept
modified: 2014-12-05T10:04:33+01:00
in scheme: Thésaurus de la désignation des œuvres architecturales et des espaces aménagés
preferred label: stands (mercantile structures) @en-us
broader: magasin de commerce
created: 2011-09-01T00:00:00+02:00
definition: Boutique isolée ou adossée à une autre construction.
status: 1

site d'écluse
type: Concept
modified: 2014-12-01T13:33:27+01:00
in scheme: Thésaurus de la désignation des œuvres architecturales et des espaces aménagés
broader: ensemble du génie civil
created: 2011-09-01T00:00:00+02:00
scope note: Ne pas confondre avec chaîne d’écluses, ni avec échelle d’écluses.
related: écluse
definition: Ensemble constitué de l'écluse et des constructions qui lui sont liées (maison d'éclusier, remise, ouvrage de franchissement, etc.).
TermeAssocie: écluse
status: 1

école
type: Concept
modified: 2014-12-01T15:31:21+01:00
in scheme: Thésaurus de la désignation des œuvres architecturales et des espaces aménagés
narrower: école secondaire
narrower: école maternelle
narrower: école primaire
narrower: école professionnelle
narrower: groupe scolaire
narrower: noviciat
narrower: pensionnat
narrower: salle d'asile
narrower: séminaire
broader: édifice scolaire
created: 2011-09-01T00:00:00+02:00
definition: Établissement dans lequel est dispensé un enseignement collectif, général ou spécialisé.
status: 1

école maternelle
type: Concept
modified: 2014-12-01T15:38:29+01:00
in scheme: Thésaurus de la désignation des œuvres architecturales et des espaces aménagés
preferred label: kindrgartens & nursery schools @en-us
broader: école
alternative label: jardin d'enfants
created: 2011-09-01T00:00:00+02:00
related: salle d'asile
definition: École destinée aux enfants de trois à cinq ans. Elle peut réunir des salles de classe, d'activités, de repos, etc., adaptées à cette tranche d'âge.
TermeAssocie: salle d'asile
status: 1

école primaire
type: Concept
modified: 2014-12-01T15:50:17+01:00
in scheme: Thésaurus de la désignation des œuvres architecturales et des espaces aménagés
preferred label: elementary schools @en-us
broader: école
created: 2011-09-01T00:00:00+02:00
definition: Établissement d'enseignement du premier degré, destiné aux enfants du cours préparatoire au cours moyen. Il réunit généralement des salles de classe, d'activités sportives et artistiques, etc. Autrefois, il pouvait être divisé en deux sections, réparties selon un plan symétrique : celle des filles et celle des garçons.
status: 1

école professionnelle
type: Concept
modified: 2014-12-01T15:56:24+01:00
in scheme: Thésaurus de la désignation des œuvres architecturales et des espaces aménagés
preferred label: vocational schools @en-us
narrower: école militaire
narrower: école d'art
narrower: école d'agriculture
broader: école
alternative label: lycée technique
alternative label: école technique
created: 2011-09-01T00:00:00+02:00
definition: École dont l'enseignement vise à préparer à un métier particulier. Elle abrite généralement des salles de cours, des ateliers, etc. adaptés aux matières enseignées.
status: 1

groupe scolaire
type: Concept
modified: 2014-12-01T16:33:46+01:00
in scheme: Thésaurus de la désignation des œuvres architecturales et des espaces aménagés
broader: école
created: 2011-09-01T00:00:00+02:00
definition: Établissement public d'enseignement formé d'une école primaire et d'une école maternelle.
status: 1
broad match: cb13318840p

noviciat
type: Concept
modified: 2014-12-08T11:07:31+01:00
in scheme: Thésaurus de la désignation des œuvres architecturales et des espaces aménagés
broader: école
created: 2011-09-01T00:00:00+02:00
related: établissement conventuel
definition: Établissement pour l'éducation des novices d'un ordre religieux chrétien.
TermeAssocie: établissement conventuel
status: 1

pensionnat
type: Concept
modified: 2014-12-08T11:12:23+01:00
in scheme: Thésaurus de la désignation des œuvres architecturales et des espaces aménagés
preferred label: boarding schools @en-us
broader: école
created: 2011-09-01T00:00:00+02:00
scope note: Ne pas confondre avec internat.
definition: École ou maison d'éducation privée, destinée à des élèves pensionnaires.
status: 1

salle d'asile
type: Concept
modified: 2014-12-01T16:50:14+01:00
in scheme: Thésaurus de la désignation des œuvres architecturales et des espaces aménagés
broader: école
created: 2011-09-01T00:00:00+02:00
scope note: Ne pas confondre avec asile d'aliénés. Pour les établissements postérieurs à la Première Guerre mondiale, on emploie le descripteur école maternelle.
related: école maternelle
definition: Au XIXe et au début du XXe siècle, établissement où sont accueillis, soignés et instruits les enfants de deux à six ans que leurs parents ne peuvent surveiller.
TermeAssocie: école maternelle
status: 1

séminaire
type: Concept
modified: 2014-12-01T17:06:42+01:00
in scheme: Thésaurus de la désignation des œuvres architecturales et des espaces aménagés
preferred label: theological seminaries @en-us
broader: école
created: 2011-09-01T00:00:00+02:00
definition: Établissement religieux où étudient et se préparent les jeunes clercs qui doivent recevoir les ordres.
status: 1

école d'agriculture
type: Concept
modified: 2014-12-01T16:00:38+01:00
in scheme: Thésaurus de la désignation des œuvres architecturales et des espaces aménagés
preferred label: agriculture schools @en-us
broader: école professionnelle
created: 2011-09-01T00:00:00+02:00
definition: École professionnelle préparant aux métiers de l'agriculture. Elle comprend généralement des terrains agricoles, horticoles, etc.
status: 1

école de danse
type: Concept
modified: 2014-10-16T10:22:29+02:00
in scheme: Thésaurus de la désignation des œuvres architecturales et des espaces aménagés
broader: école d'art
created: 2011-09-01T00:00:00+02:00
definition: École d'enseignement de la danse.
status: 1

école normale
type: Concept
modified: 2014-12-01T17:17:53+01:00
in scheme: Thésaurus de la désignation des œuvres architecturales et des espaces aménagés
preferred label: teachers colleges @en-us
broader: édifice d'enseignement supérieur
alternative label: école normale d'instituteurs
created: 2011-09-01T00:00:00+02:00
scope note: Ne pas utiliser ce descripteur, mais école supérieure, pour une école normale supérieure.
definition: Établissement d'enseignement supérieur, habituellement situé au chef-lieu du département, destiné à la formation des instituteurs.
status: 1

lycée
type: Concept
modified: 2014-12-01T16:27:30+01:00
in scheme: Thésaurus de la désignation des œuvres architecturales et des espaces aménagés
preferred label: high schools @en-us
broader: école secondaire
created: 2011-09-01T00:00:00+02:00
definition: Établissement d'enseignement général ou technique, dispensant l'enseignement du second cycle.
status: 1

petit séminaire
type: Concept
modified: 2014-12-01T16:31:04+01:00
in scheme: Thésaurus de la désignation des œuvres architecturales et des espaces aménagés
preferred label: parochial schools @en-us
broader: école secondaire
created: 2011-09-01T00:00:00+02:00
definition: École secondaire catholique fréquentée par des élèves qui ne se destinent pas nécessairement au sacerdoce.
status: 1

école supérieure
type: Concept
modified: 2014-12-01T17:19:48+01:00
in scheme: Thésaurus de la désignation des œuvres architecturales et des espaces aménagés
broader: édifice d'enseignement supérieur
created: 2011-09-01T00:00:00+02:00
scope note: Préciser dans la désignation complète de l’école la matière enseignée : sciences, lettres, commerce, administration, etc
definition: Établissement d'enseignement supérieur acceptant généralement sur concours un nombre restreint d'élèves. Il comprend la plupart du temps des salles de cours, des amphithéâtres d'enseignement, etc.
status: 1

étable à chevaux
type: Concept
modified: 2014-12-30T14:18:55+01:00
in scheme: Thésaurus de la désignation des œuvres architecturales et des espaces aménagés
preferred label: horse barns @en-us
broader: étable
created: 2011-09-01T00:00:00+02:00
scope note: Pour des chevaux de selle ou d'attelage, employer écurie.
related: écurie
definition: Abri pour chevaux de trait.
TermeAssocie: écurie
status: 1

édicule à fonction non identifiée
type: Concept
modified: 2015-02-25T12:35:40+01:00
in scheme: Thésaurus de la désignation des œuvres architecturales et des espaces aménagés
broader: partie ou élément commun à tous les types d'architecture et aux espaces aménagés
alternative label: édicule non identifié
alternative label: ouvrage non identifié
created: 2011-09-01T00:00:00+02:00
definition: Construction autonome, mais non habitable, dont la fonction d'origine est inconnue.
status: 1

polissoir
type: Concept
modified: 2014-12-04T14:49:51+01:00
in scheme: Thésaurus de la désignation des œuvres architecturales et des espaces aménagés
broader: édicule artisanal
created: 2011-09-01T00:00:00+02:00
scope note: Voir aussi le Thesaurus des objets mobiliers.
definition: Ouvrage généralement de pierre dure ou tendre, propre à abraser ou polir la surface rugueuse d'un outil préhistorique.
status: 1
broad match: http://vocab.getty.edu/aat/300236674

travail à ferrer
type: Concept
modified: 2014-12-04T14:51:46+01:00
in scheme: Thésaurus de la désignation des œuvres architecturales et des espaces aménagés
broader: édicule artisanal
alternative label: maréchalerie
created: 2011-09-01T00:00:00+02:00
definition: Ouvrage en charpente permettant au maréchal-ferrant de ferrer les chevaux ou les bœufs.
status: 1
broad match: http://vocab.getty.edu/aat/300007734

édicule commémoratif
type: Concept
modified: 2013-04-23T00:00:00+02:00
in scheme: Thésaurus de la désignation des œuvres architecturales et des espaces aménagés
preferred label: commemorative monument 2 @en-gb
narrower: monument aux morts
narrower: trophée monumental
broader: monument
alternative label: mausolée urbain
created: 2011-09-01T00:00:00+02:00
definition: Édicule élevé en l’honneur d’un personnage célèbre mort, d'événements historiques majeurs, etc., placé dans un espace public.
status: 1

monument aux morts
type: Concept
modified: 2015-02-24T13:02:25+01:00
in scheme: Thésaurus de la désignation des œuvres architecturales et des espaces aménagés
preferred label: war memorials @en-us
preferred label: monumento ai caduti @it
preferred label: war memorial @en-gb
broader: édicule commémoratif
created: 2011-09-01T00:00:00+02:00
definition: Voir aussi le Thesaurus des objets mobiliers.
definition: Monument élevé en l'honneur des victimes d'un conflit ou d'une catastrophe.
status: 1

mire
type: Concept
modified: 2014-12-12T11:22:41+01:00
in scheme: Thésaurus de la désignation des œuvres architecturales et des espaces aménagés
broader: édicule de culture recherche sport ou loisir
alternative label: mire géodésique
alternative label: mire astronomique
created: 2011-09-01T00:00:00+02:00
definition: Édicule de forme géométrique (colonne, pyramide, obélisque, etc.), constituant un repère et supportant parfois un signal fixe, que l’on vise pour prendre une direction, positionner ou contrôler un instrument optique.
status: 1

poste d'affût
type: Concept
modified: 2014-10-17T15:44:30+02:00
in scheme: Thésaurus de la désignation des œuvres architecturales et des espaces aménagés
broader: édicule de culture recherche sport ou loisir
created: 2011-09-01T00:00:00+02:00
scope note: Ne pas confondre avec mirador, ni avec poste d’observation.
definition: Abri dissimulé dans la végétation permettant d'observer la faune et, pour les chasseurs, de tirer le gibier.
status: 1
broad match: http://vocab.getty.edu/aat/300387322

table d'orientation
type: Concept
modified: 2014-10-09T13:07:00+02:00
in scheme: Thésaurus de la désignation des œuvres architecturales et des espaces aménagés
preferred label: viewpoint indicator @en-us
broader: édicule de culture recherche sport ou loisir
created: 2011-09-01T00:00:00+02:00
definition: Ouvrage, généralement en maçonnerie, en forme de table habituellement semi-circulaire, placé à un point de vue et portant l'indication des sites qu'on aperçoit depuis cet ouvrage.
status: 1

pont-bascule
type: Concept
modified: 2015-02-26T11:38:48+01:00
in scheme: Thésaurus de la désignation des œuvres architecturales et des espaces aménagés
broader: partie ou élément commun à tous les types d'architecture et aux espaces aménagés
created: 2011-09-01T00:00:00+02:00
related: édicule de l'administration ou de la vie publique
definition: Ouvrage permettant de vérifier le poids des matières et produits par pesage des véhicules à plein et à vide. Il comporte une balance ou bascule automatique, avec ou sans plate-forme.
TermeAssocie: édicule de l'administration ou de la vie publique
status: 1

horloge publique
type: Concept
modified: 2015-02-24T11:22:03+01:00
in scheme: Thésaurus de la désignation des œuvres architecturales et des espaces aménagés
preferred label: clock towers @en-us
broader: édicule de l'administration ou de la vie publique
alternative label: horloge édicule
alternative label: horloge architecturale
created: 2011-09-01T00:00:00+02:00
scope note: Voir aussi le Thesaurus des objets mobiliers.
definition: Édicule, panneau ou cadran, de plus ou moins grandes dimensions, muni d’un dispositif indiquant l'heure et placé dans un lieu public.
status: 1
narrow match: http://data.bnf.fr/ark:/12148/cb166457109
broad match: Horloge

toilettes publiques
type: Concept
modified: 2014-12-05T12:05:53+01:00
in scheme: Thésaurus de la désignation des œuvres architecturales et des espaces aménagés
preferred label: comfort stations @en-us
broader: édicule de l'administration ou de la vie publique
alternative label: vespasienne
alternative label: latrines
created: 2011-09-01T00:00:00+02:00
definition: Lieux d’aisances à usage d’un ou plusieurs individus placés dans un espace public.
status: 1

gibet
type: Concept
modified: 2014-10-14T14:08:59+02:00
in scheme: Thésaurus de la désignation des œuvres architecturales et des espaces aménagés
preferred label: gallows @en-us
broader: édicule judiciaire pénitentiaire ou de police
alternative label: arbre de justice
created: 2011-09-01T00:00:00+02:00
definition: Potence ou ensemble de potences où l'on pendait les condamnés à mort.
status: 1

mirador
type: Concept
modified: 2015-01-05T10:25:07+01:00
in scheme: Thésaurus de la désignation des œuvres architecturales et des espaces aménagés
broader: édicule judiciaire pénitentiaire ou de police
created: 2011-09-01T00:00:00+02:00
scope note: Ne pas confondre avec poste d'affût et poste d'observation.
definition: Tour de surveillance utilisée pour la garde des camps, des prisons, des dépôts, des frontières, etc.
status: 1
broad match: http://vocab.getty.edu/aat/300134522

pilori
type: Concept
modified: 2014-10-14T14:10:05+02:00
in scheme: Thésaurus de la désignation des œuvres architecturales et des espaces aménagés
broader: édicule judiciaire pénitentiaire ou de police
created: 2011-09-01T00:00:00+02:00
definition: Pilier ou poteau où l'on expose publiquement les criminels en signe d'infamie.
status: 1

grotte de Lourdes
type: Concept
modified: 2015-02-24T12:06:56+01:00
in scheme: Thésaurus de la désignation des œuvres architecturales et des espaces aménagés
preferred label: Lourdes grottoes @en-us
broader: édicule religieux chrétien
created: 2011-09-01T00:00:00+02:00
scope note: Voir aussi le Thesaurus des objets mobiliers.
related: fabrique de jardin
definition: Edicule évoquant la grotte miraculeuse de Lourdes, comprenant un rocher artificiel ou aménagé abritant une statue de l'Immaculée Conception dans une niche et au pied duquel on trouve généralement une seconde statue représentant sainte Bernadette en prière.
TermeAssocie: fabrique de jardin
status: 1

oratoire
type: Concept
modified: 2015-02-24T12:18:23+01:00
in scheme: Thésaurus de la désignation des œuvres architecturales et des espaces aménagés
preferred label: oratorio @it
preferred label: private chapel @en-gb
preferred label: oratories @en-us
broader: édicule religieux chrétien
alternative label: ouradour
created: 2011-09-01T00:00:00+02:00
scope note: Voir aussi le Thesaurus des objets mobiliers (oratoire de chemin).
definition: Petit édifice ou édicule où l'on se retire pour faire oraison : contrairement à la chapelle, l’oratoire n'a pas d'autel consacré. Il peut aussi consister en une peinture ou une sculpture placée dans une niche, sous un dais ou sur un support spécifique.
status: 1

reposoir
type: Concept
modified: 2014-11-27T15:23:35+01:00
in scheme: Thésaurus de la désignation des œuvres architecturales et des espaces aménagés
broader: édicule religieux chrétien
created: 2011-09-01T00:00:00+02:00
scope note: Voir aussi le Thesaurus des objets mobiliers.
definition: Edicule ou meuble en forme d'autel sur lequel on dépose le saint sacrement, une statue ou tout autre objet sacré lors d'une station de procession. Le reposoir peut être situé dans une église ou à l'extérieur.
status: 1

sanctuaire de plein air
type: Concept
modified: 2014-10-15T13:34:48+02:00
in scheme: Thésaurus de la désignation des œuvres architecturales et des espaces aménagés
preferred label: outdoor sanctuaries @en-us
broader: édicule religieux chrétien
alternative label: lieu d'assemblée au désert
created: 2011-09-01T00:00:00+02:00
definition: Lieu de culte chrétien à ciel ouvert.
status: 1
broad match: Sanctuaire

édifice à fonction non identifiée
type: Concept
modified: 2015-02-25T12:37:25+01:00
in scheme: Thésaurus de la désignation des œuvres architecturales et des espaces aménagés
broader: partie ou élément commun à tous les types d'architecture et aux espaces aménagés
alternative label: édifice non identifié
created: 2011-09-01T00:00:00+02:00
definition: Édifice dont la fonction d'origine est inconnue.
status: 1

entrepôt agricole
type: Concept
modified: 2014-12-30T13:47:53+01:00
in scheme: Thésaurus de la désignation des œuvres architecturales et des espaces aménagés
broader: édifice agricole
alternative label: coopérative agricole
created: 2011-09-01T00:00:00+02:00
definition: Édifice ou partie d'édifice servant de lieu de dépôt pour la production agricole.
status: 1
broad match: Entrepôt
broad match: http://vocab.getty.edu/aat/300007722

haras
type: Concept
modified: 2014-12-30T13:54:21+01:00
in scheme: Thésaurus de la désignation des œuvres architecturales et des espaces aménagés
preferred label: horse farms @en-us
broader: édifice agricole
created: 2011-09-01T00:00:00+02:00
definition: Établissement destiné à la reproduction de l'espèce chevaline et à l'amélioration des races de chevaux par la sélection des étalons.
status: 1

magnanerie
type: Concept
modified: 2014-12-30T13:56:25+01:00
in scheme: Thésaurus de la désignation des œuvres architecturales et des espaces aménagés
broader: édifice agricole
created: 2011-09-01T00:00:00+02:00
focus: cb11966736g
focus: http://vocab.getty.edu/aat/300266600
definition: Édifice ou partie d'édifice où se pratique l'élevage du ver à soie.
status: 1

forge artisanale
type: Concept
modified: 2014-10-06T13:14:50+02:00
in scheme: Thésaurus de la désignation des œuvres architecturales et des espaces aménagés
broader: édifice artisanal commercial ou tertiaire
created: 2011-09-01T00:00:00+02:00
related: grosse forge
definition: Édifice artisanal où l'on travaille les métaux au feu avec un marteau.
TermeAssocie: grosse forge
status: 1

fournil
type: Concept
modified: 2014-12-04T16:05:42+01:00
in scheme: Thésaurus de la désignation des œuvres architecturales et des espaces aménagés
broader: édifice artisanal commercial ou tertiaire
created: 2011-09-01T00:00:00+02:00
scope note: Ne pas confondre avec four à pain.
related: four à pain
definition: Local (généralement de dimensions habitables) où l’on fabrique la pâte à pain et dans lequel se trouve le four.
TermeAssocie: four à pain
status: 1

fromagerie
type: Concept
modified: 2014-12-04T16:17:32+01:00
in scheme: Thésaurus de la désignation des œuvres architecturales et des espaces aménagés
broader: édifice artisanal commercial ou tertiaire
created: 2011-09-01T00:00:00+02:00
related: séchoir à fromages
related: fromagerie industrielle
definition: Édifice artisanal destiné à la fabrication des fromages.
TermeAssocie: séchoir à fromages
TermeAssocie: fromagerie industrielle
status: 1

garage de réparation automobile
type: Concept
modified: 2014-10-06T13:22:22+02:00
in scheme: Thésaurus de la désignation des œuvres architecturales et des espaces aménagés
broader: édifice artisanal commercial ou tertiaire
created: 2011-09-01T00:00:00+02:00
related: station service
definition: Édifice où sont effectués l'entretien, la réparation et éventuellement la vente des véhicules automobiles.
TermeAssocie: station service
status: 1

hôtel de voyageurs
type: Concept
modified: 2014-12-04T16:33:01+01:00
in scheme: Thésaurus de la désignation des œuvres architecturales et des espaces aménagés
preferred label: hotels @en-us
broader: édifice artisanal commercial ou tertiaire
alternative label: hôtel de tourisme
created: 2011-09-01T00:00:00+02:00
scope note: Ne pas confondre avec hôtellerie, ni avec hôtel.
definition: Édifice commercial destiné à loger des voyageurs. Il peut comprendre un restaurant.
status: 1

laiterie
type: Concept
modified: 2014-12-04T16:44:21+01:00
in scheme: Thésaurus de la désignation des œuvres architecturales et des espaces aménagés
preferred label: dairies @en-us
broader: édifice artisanal commercial ou tertiaire
created: 2011-09-01T00:00:00+02:00
related: laiterie industrielle
definition: Édifice ou local affecté à la collecte et à la fabrication du lait et du beurre.
TermeAssocie: laiterie industrielle
status: 1

maison close
type: Concept
modified: 2014-10-06T15:25:15+02:00
in scheme: Thésaurus de la désignation des œuvres architecturales et des espaces aménagés
preferred label: brothels @en-us
broader: édifice artisanal commercial ou tertiaire
alternative label: bordel
created: 2011-09-01T00:00:00+02:00
definition: Édifice où se pratique la prostitution.
status: 1

poterie
type: Concept
modified: 2014-10-06T15:28:44+02:00
in scheme: Thésaurus de la désignation des œuvres architecturales et des espaces aménagés
preferred label: potteries @en-us
broader: édifice artisanal commercial ou tertiaire
created: 2011-09-01T00:00:00+02:00
definition: Édifice artisanal affecté à la fabrication d'objets et de récipients en céramique.
status: 1

refuge de montagne
type: Concept
modified: 2014-12-05T10:38:16+01:00
in scheme: Thésaurus de la désignation des œuvres architecturales et des espaces aménagés
preferred label: shelters @en-us
broader: édifice artisanal commercial ou tertiaire
alternative label: refuge
created: 2011-09-01T00:00:00+02:00
definition: Édifice construit en haute ou moyenne montagne pour permettre aux alpinistes ou aux promeneurs de s'abriter en cas de mauvais temps, de prendre un repas ou de passer la nuit.
status: 1
broad match: http://vocab.getty.edu/aat/300007688

relais de poste
type: Concept
modified: 2014-12-05T10:48:39+01:00
in scheme: Thésaurus de la désignation des œuvres architecturales et des espaces aménagés
preferred label: posthouses @en-us
broader: édifice artisanal commercial ou tertiaire
alternative label: poste aux chevaux
created: 2011-09-01T00:00:00+02:00
definition: Relais de chevaux placés de distance en distance, afin d'assurer le transport des voyageurs et du courrier, où l’on peut être restauré et hébergé.
status: 1

salle des ventes
type: Concept
modified: 2014-10-06T15:39:58+02:00
in scheme: Thésaurus de la désignation des œuvres architecturales et des espaces aménagés
preferred label: auction houses @en-us
broader: édifice artisanal commercial ou tertiaire
created: 2011-09-01T00:00:00+02:00
definition: Édifice commercial affecté aux ventes publiques, généralement aux enchères, de biens privés.
status: 1

station service
type: Concept
modified: 2014-12-05T11:19:56+01:00
in scheme: Thésaurus de la désignation des œuvres architecturales et des espaces aménagés
preferred label: service stations @en-us
broader: édifice artisanal commercial ou tertiaire
created: 2011-09-01T00:00:00+02:00
related: garage de réparation automobile
definition: Établissement qui propose aux automobilistes des services divers : distribution de carburant, vente de produits destinés au bon fonctionnement, à l’entretien et à la réparation des véhicules, etc.
TermeAssocie: garage de réparation automobile
status: 1

mont-de-piété
type: Concept
modified: 2015-01-02T11:00:51+01:00
in scheme: Thésaurus de la désignation des œuvres architecturales et des espaces aménagés
preferred label: pawnshops @en-us
broader: édifice financier public
alternative label: crédit municipal
created: 2011-09-01T00:00:00+02:00
related: édifice d'assistance ou de protection sociale
definition: Établissement de bienfaisance public, généralement communal, où les personnes nécessiteuses peuvent recevoir un prêt en contrepartie de la mise en gage d'objets mobiliers, de valeurs mobilières ou de la cession, pendant quelques mois, d'une fraction de leur salaire ou de leur pension.
TermeAssocie: édifice d'assistance ou de protection sociale
status: 1

foyer
type: Concept
modified: 2015-01-02T11:37:23+01:00
in scheme: Thésaurus de la désignation des œuvres architecturales et des espaces aménagés
broader: édifice d'assistance ou de protection sociale
alternative label: foyer de travailleurs
alternative label: foyer de jeunes filles
created: 2011-09-01T00:00:00+02:00
definition: Édifice d'assistance servant de lieu de réunion ou de logement pour certaines catégories de personnes : foyer de jeunes filles, foyer d'ouvriers, etc.
status: 1

garderie d'enfants
type: Concept
modified: 2015-01-02T11:39:51+01:00
in scheme: Thésaurus de la désignation des œuvres architecturales et des espaces aménagés
broader: édifice d'assistance ou de protection sociale
alternative label: crèche collective
alternative label: crèche familiale
created: 2011-09-01T00:00:00+02:00
definition: Établissement destiné à recevoir les enfants en bas âge dont les parents travaillent.
status: 1

établissement pour les handicapés physiques
type: Concept
modified: 2014-10-20T09:52:08+02:00
in scheme: Thésaurus de la désignation des œuvres architecturales et des espaces aménagés
broader: édifice d'assistance ou de protection sociale
created: 2011-09-01T00:00:00+02:00
definition: Établissement affecté à la protection, l'hébergement et l'instruction des personnes présentant une déficience physique qui les empêche de travailler normalement.
status: 1

maison de retraite
type: Concept
modified: 2015-01-02T11:49:27+01:00
in scheme: Thésaurus de la désignation des œuvres architecturales et des espaces aménagés
preferred label: retirement homes @en-us
broader: édifice d'assistance ou de protection sociale
created: 2011-09-01T00:00:00+02:00
scope note: Pour les établissements du XIXe siècle et de la première moitié du XXe siècle, employer hospice.
definition: Établissement public ou privé, médicalisé ou non, accueillant les personnes âgées en résidence.
status: 1

hospice
type: Concept
modified: 2015-01-02T11:46:32+01:00
in scheme: Thésaurus de la désignation des œuvres architecturales et des espaces aménagés
preferred label: orphanages & terminal care facilities @en-us
broader: édifice d'assistance ou de protection sociale
alternative label: hospice de vieillards
created: 2011-09-01T00:00:00+02:00
scope note: Pour les établissements de la 2e moitié du XXe siècle, employer maison de retraite.
definition: Au XIXe et au début du XXe siècle, établissement destiné à héberger et soigner les personnes indigentes (orphelins, vieillards, etc.).
status: 1

entrepôt public
type: Concept
modified: 2014-12-05T12:19:27+01:00
in scheme: Thésaurus de la désignation des œuvres architecturales et des espaces aménagés
narrower: grenier public
broader: édifice de l'administration ou de la vie publique
created: 2011-09-01T00:00:00+02:00
related: marché
definition: Édifice appartenant à la collectivité où sont entreposées des denrées périssables comme le sucre, le blé, le foin, etc. Dans un port, il sert d'entrepôt aux marchandises confisquées lors d'un contrôle douanier.
TermeAssocie: marché
status: 1
broad match: Entrepôt

établissement administratif
type: Concept
modified: 2014-09-05T11:12:26+02:00
in scheme: Thésaurus de la désignation des œuvres architecturales et des espaces aménagés
preferred label: administration buildings @en-us
narrower: intendance
narrower: ministère
narrower: préfecture
broader: édifice de l'administration ou de la vie publique
alternative label: service administratif
created: 2011-09-01T00:00:00+02:00
scope note: Ne pas utiliser pour les édifices abritant uniquement les réunions d'élus.
definition: Édifice affecté à un service administratif de l'État ou d'une collectivité.
status: 1

hôtel de département
type: Concept
modified: 2014-12-05T12:29:40+01:00
in scheme: Thésaurus de la désignation des œuvres architecturales et des espaces aménagés
broader: édifice de l'administration ou de la vie publique
alternative label: conseil général
created: 2011-09-01T00:00:00+02:00
definition: Édifice abritant, au chef-lieu du département, les services et les salles de réunion du conseil général.
status: 1
broad match: http://vocab.getty.edu/aat/300005993

hôtel de région
type: Concept
modified: 2014-10-09T12:17:37+02:00
in scheme: Thésaurus de la désignation des œuvres architecturales et des espaces aménagés
broader: édifice de l'administration ou de la vie publique
alternative label: conseil régional
created: 2011-09-01T00:00:00+02:00
definition: Édifice abritant, au chef-lieu de la région, les services et les salles de réunion du conseil régional.
status: 1
broad match: http://vocab.getty.edu/aat/300005993

porte monumentale
type: Concept
modified: 2014-10-17T15:29:08+02:00
in scheme: Thésaurus de la désignation des œuvres architecturales et des espaces aménagés
narrower: porte de ville
broader: édifice de l'administration ou de la vie publique
created: 2011-09-01T00:00:00+02:00
definition: Édifices, édicules ou arbres formant porte placés sur une voie, généralement de part et d’autre d’une artère et en symétrie, marquant l’entrée d’une ville, d’un quartier. Elle présentait à l'origine une fonction militaire puis fiscale.
status: 1
narrow match: http://data.bnf.fr/ark:/12148/cb121320043
narrow match: http://vocab.getty.edu/aat/300005080
narrow match: Porte de ville

bureau de poste
type: Concept
modified: 2014-12-05T12:07:02+01:00
in scheme: Thésaurus de la désignation des œuvres architecturales et des espaces aménagés
preferred label: post offices @en-us
broader: édifice de l'administration ou de la vie publique
created: 2011-09-01T00:00:00+02:00
definition: Édifice public abritant les services de distribution de la correspondance et des paquets, mais aussi des services de télécommunication.
status: 1

établissement des eaux
type: Concept
modified: 2014-10-23T11:59:47+02:00
in scheme: Thésaurus de la désignation des œuvres architecturales et des espaces aménagés
preferred label: waterworks @en-us
narrower: station d'épuration
broader: édifice du génie civil
created: 2011-09-01T00:00:00+02:00
scope note: Ne pas confondre avec établissement de bains.
related: réseau hydraulique
definition: Édifice lié au traitement de l'eau.
TermeAssocie: réseau hydraulique
status: 1

gare
type: Concept
modified: 2014-11-28T16:55:48+01:00
in scheme: Thésaurus de la désignation des œuvres architecturales et des espaces aménagés
preferred label: railroad stations @en-us
narrower: gare de transbordement
narrower: halte ferroviaire
narrower: station de métro
narrower: station de tramway
broader: édifice du génie civil
alternative label: gare de chemin de fer
created: 2011-09-01T00:00:00+02:00
related: quai
related: voie ferrée
related: réseau ferré
definition: Édifice ou édicule où s'arrêtent les trains pour l'embarquement, le débarquement et la répartition des voyageurs et des marchandises. Outre un bâtiment de voyageurs, il peut abriter quelques commerces, des bâtiments de stockage et de réparation.
TermeAssocie: quai
TermeAssocie: voie ferrée
TermeAssocie: réseau ferré
status: 1

gare routière
type: Concept
modified: 2014-11-28T17:02:22+01:00
in scheme: Thésaurus de la désignation des œuvres architecturales et des espaces aménagés
preferred label: bus stations @en-us
broader: édifice du génie civil
created: 2011-09-01T00:00:00+02:00
scope note: Ne pas confondre avec station d'autobus.
definition: Édifice où s'arrêtent les cars pour l'embarquement et le débarquement des voyageurs. Il comprend une aire de stationnement et peut abriter quelques commerces : débit de boissons, kiosque à journaux, etc.
status: 1

pas de tir
type: Concept
modified: 2014-10-16T14:09:05+02:00
in scheme: Thésaurus de la désignation des œuvres architecturales et des espaces aménagés
preferred label: launch complexes @en-us
broader: édifice du génie civil
alternative label: aire de lancement
created: 2011-09-01T00:00:00+02:00
related: rampe de lancement
definition: Ouvrage formé d’une plate-forme aménagée et de bâtiments où sont suivies les opérations de préparation et de lancement de fusées ; ces bâtiments sont situés à distance de sécurité de l’aire de lancement.
TermeAssocie: rampe de lancement
status: 1

phare
type: Concept
modified: 2014-11-28T17:06:09+01:00
in scheme: Thésaurus de la désignation des œuvres architecturales et des espaces aménagés
preferred label: lighthouses @en-us
broader: édifice du génie civil
created: 2011-09-01T00:00:00+02:00
definition: Ouvrage, généralement en forme de tour, construit sur un point de la côte, à l'extrémité d'une jetée ou sur une île, et portant un signal lumineux de forte intensité servant à guider les navires.
status: 1

poste de secours
type: Concept
modified: 2014-11-28T17:06:52+01:00
in scheme: Thésaurus de la désignation des œuvres architecturales et des espaces aménagés
broader: édifice du génie civil
created: 2011-09-01T00:00:00+02:00
related: poste de commande
definition: Poste de premiers soins et éventuellement de surveillance.
TermeAssocie: poste de commande
status: 1

remise ferroviaire
type: Concept
modified: 2014-11-28T17:08:16+01:00
in scheme: Thésaurus de la désignation des œuvres architecturales et des espaces aménagés
preferred label: roundhouses @en-us
broader: édifice du génie civil
alternative label: rotonde ferroviaire
alternative label: rotonde à locomotive
created: 2011-09-01T00:00:00+02:00
scope note: Voir le Thesaurus des objets mobiliers.
definition: Bâtiment où l'on gare et éventuellement entretient des locomotives. Il est parfois circulaire (rotonde), ou semi-circulaire (demi-rotonde), avec des voies en éventail au centre desquelles se trouve une plaque tournante.
status: 1

station d'autobus
type: Concept
modified: 2014-10-16T14:13:12+02:00
in scheme: Thésaurus de la désignation des œuvres architecturales et des espaces aménagés
preferred label: bus shelters @en-us
broader: édifice du génie civil
alternative label: abribus
alternative label: station d'autocar
created: 2011-09-01T00:00:00+02:00
scope note: Ne pas confondre avec gare routière.
definition: Édicule destiné à servir d'abri aux voyageurs attendant un autobus.
status: 1

station de traitement des déchets
type: Concept
modified: 2014-10-23T12:03:25+02:00
in scheme: Thésaurus de la désignation des œuvres architecturales et des espaces aménagés
narrower: station d'incinération des déchets
broader: édifice du génie civil
created: 2011-09-01T00:00:00+02:00
definition: Établissement regroupant des installations permettant de trier et de soumettre les déchets à l'action d'agents physiques ou chimiques.
status: 1

établissement de danse
type: Concept
modified: 2014-12-19T10:14:34+01:00
in scheme: Thésaurus de la désignation des œuvres architecturales et des espaces aménagés
broader: édifice et aménagement de culture recherche sport ou loisir
alternative label: dancing
alternative label: salle de danse
created: 2011-09-01T00:00:00+02:00
definition: Établissement public ou privé où l'on peut pratiquer la danse à titre de loisir.
status: 1

institut de recherche
type: Concept
modified: 2014-12-19T10:17:46+01:00
in scheme: Thésaurus de la désignation des œuvres architecturales et des espaces aménagés
preferred label: research institutes (buildings) @en-us
narrower: observatoire
narrower: laboratoire
broader: édifice et aménagement de culture recherche sport ou loisir
created: 2011-09-01T00:00:00+02:00
definition: Établissement abritant les services (bureaux, laboratoires, bibliothèque, salles de cours ou de conférence, etc.) de recherche scientifique d’une institution publique ou privée (université, administration, entreprise, etc.).
status: 1

lieu d'exposition
type: Concept
modified: 2014-09-05T17:21:23+02:00
in scheme: Thésaurus de la désignation des œuvres architecturales et des espaces aménagés
preferred label: exhibition building spaces @en-us
narrower: galerie d'art
narrower: pavillon d'exposition
narrower: salle d'exposition
broader: édifice et aménagement de culture recherche sport ou loisir
created: 2011-09-01T00:00:00+02:00
definition: Édifice ou partie d'édifice abritant des présentations publiques d’œuvres d'art, d’objets mobiliers, de véhicules, de machines, etc.
status: 1

lieu de production médiatique
type: Concept
modified: 2013-04-23T00:00:00+02:00
in scheme: Thésaurus de la désignation des œuvres architecturales et des espaces aménagés
narrower: établissement de production audiovisuelle
narrower: siège de presse
narrower: studio de cinéma
broader: édifice et aménagement de culture recherche sport ou loisir
created: 2011-09-01T00:00:00+02:00
definition: Édifice ou partie d'édifice abritant des activités relevant de la production médiatique.
status: 1

maison de quartier
type: Concept
modified: 2014-12-19T10:36:25+01:00
in scheme: Thésaurus de la désignation des œuvres architecturales et des espaces aménagés
broader: édifice et aménagement de culture recherche sport ou loisir
created: 2011-09-01T00:00:00+02:00
definition: Édifice ou partie d'édifice destiné à abriter des services municipaux liés aux loisirs et des locaux pour les associations.
status: 1

musée
type: Concept
modified: 2014-12-19T10:42:37+01:00
in scheme: Thésaurus de la désignation des œuvres architecturales et des espaces aménagés
preferred label: museums (buildings) @en-us
broader: édifice et aménagement de culture recherche sport ou loisir
alternative label: museum
created: 2011-09-01T00:00:00+02:00
definition: Établissement dans lequel sont rassemblées, étudiées, classées et exposées des collections d'objets présentant un intérêt historique, technique, scientifique ou artistique, en vue de leur conservation et de leur présentation au public.
status: 1

palais des congrès
type: Concept
modified: 2014-12-19T10:47:20+01:00
in scheme: Thésaurus de la désignation des œuvres architecturales et des espaces aménagés
preferred label: convention centers @en-us
broader: édifice et aménagement de culture recherche sport ou loisir
created: 2011-09-01T00:00:00+02:00
definition: Édifice où sont programmés des événements culturels, artistiques, professionnels, politiques, sportifs, etc.
status: 1

plan d'eau aménagé
type: Concept
modified: 2014-12-19T10:54:59+01:00
in scheme: Thésaurus de la désignation des œuvres architecturales et des espaces aménagés
broader: édifice et aménagement de culture recherche sport ou loisir
created: 2011-09-01T00:00:00+02:00
definition: Plan d’eau naturel ou artificiel aménagé pour la pratique de loisirs nautiques, accompagné généralement d’une base de loisirs.
status: 1

salle de billard
type: Concept
modified: 2014-12-19T10:54:51+01:00
in scheme: Thésaurus de la désignation des œuvres architecturales et des espaces aménagés
preferred label: billiard rooms @en-us
broader: édifice et aménagement de culture recherche sport ou loisir
created: 2011-09-01T00:00:00+02:00
definition: Partie d'édifice abritant une ou plusieurs tables et leurs accessoires destinés au jeu de billard.
status: 1

salle des fêtes
type: Concept
modified: 2014-10-10T11:57:33+02:00
in scheme: Thésaurus de la désignation des œuvres architecturales et des espaces aménagés
preferred label: community centers @en-us
narrower: salle paroissiale
broader: édifice et aménagement de culture recherche sport ou loisir
alternative label: foyer socio-culturel
alternative label: salle polyvalente
created: 2011-09-01T00:00:00+02:00
definition: Édifice ou partie d'édifice où sont organisées des réjouissances ou activités diverses pour la population d'une localité, d'un quartier ou d'une communauté.
status: 1

office de tourisme
type: Concept
modified: 2014-12-19T10:46:21+01:00
in scheme: Thésaurus de la désignation des œuvres architecturales et des espaces aménagés
preferred label: information centers @en-us
broader: édifice et aménagement de culture recherche sport ou loisir
alternative label: syndicat d'initiative
created: 2011-09-01T00:00:00+02:00
definition: Édifice regroupant les organismes affectés au développement du tourisme dans un secteur géographique donné, ainsi que les services qui en dépendent, dans le but de renseigner les voyageurs.
status: 1

théâtre de plein air
type: Concept
modified: 2014-10-10T12:07:19+02:00
in scheme: Thésaurus de la désignation des œuvres architecturales et des espaces aménagés
preferred label: open-air theaters @en-us
broader: édifice et aménagement de culture recherche sport ou loisir
created: 2011-09-01T00:00:00+02:00
scope note: Ne pas confondre avec théâtre de jardin, ni avec théâtre de verdure.
related: théâtre
definition: Aménagement architecturé, en plein air, pouvant comporter une scène, un mur de scène, des gradins, etc.
TermeAssocie: théâtre
status: 1

hôtel des monnaies
type: Concept
modified: 2015-01-02T10:57:35+01:00
in scheme: Thésaurus de la désignation des œuvres architecturales et des espaces aménagés
preferred label: mints (buildings) @en-us
broader: édifice financier public
created: 2011-09-01T00:00:00+02:00
definition: Établissement où l'on frappe les monnaies et les médailles.
status: 1

grange aux dîmes
type: Concept
modified: 2015-01-02T11:06:00+01:00
in scheme: Thésaurus de la désignation des œuvres architecturales et des espaces aménagés
preferred label: tithe barns @en-us
broader: édifice fiscal
created: 2011-09-01T00:00:00+02:00
related: grange
definition: Grange dans laquelle est entreposé le produit des dîmes, reçu en nature (grains, foins, etc.).
TermeAssocie: grange
status: 1

grenier à sel
type: Concept
modified: 2015-01-02T11:07:41+01:00
in scheme: Thésaurus de la désignation des œuvres architecturales et des espaces aménagés
broader: édifice fiscal
created: 2011-09-01T00:00:00+02:00
definition: Édifice fiscal servant à l'entrepôt du sel, à sa vente et à la perception de la gabelle.
status: 1

maison aux dîmes
type: Concept
modified: 2015-01-02T11:10:14+01:00
in scheme: Thésaurus de la désignation des œuvres architecturales et des espaces aménagés
broader: édifice fiscal
created: 2011-09-01T00:00:00+02:00
definition: En ville, édifice dans lequel est entreposé le produit des dîmes, en argent ou en nature.
status: 1

fort
type: Concept
modified: 2015-01-05T11:17:17+01:00
in scheme: Thésaurus de la désignation des œuvres architecturales et des espaces aménagés
preferred label: forts @en-us
broader: édifice fortifié
created: 2011-09-01T00:00:00+02:00
scope note: Le fortin est un petit fort. Ne pas confondre avec château fort.
definition: Édifice fortifié contenant une garnison, servant d'appui dans le système de défense d'une frontière ou d'une ville.
status: 1
broad match: cb11931504g

édifice hospitalier
type: Concept
modified: 2015-01-02T12:25:34+01:00
in scheme: Thésaurus de la désignation des œuvres architecturales et des espaces aménagés
narrower: hôpital
narrower: établissement médical
broader: édifice hospitalier d'assistance ou de protection sociale
alternative label: établissement hospitalier
created: 2011-09-01T00:00:00+02:00
related: établissement thermal
definition: Établissement destiné à soigner les malades.
TermeAssocie: établissement thermal
status: 1

établissement thermal
type: Concept
modified: 2014-12-19T10:11:20+01:00
in scheme: Thésaurus de la désignation des œuvres architecturales et des espaces aménagés
preferred label: spas (health resorts) @en-us
broader: établissement de bains
created: 2011-09-01T00:00:00+02:00
related: station thermale
related: édifice hospitalier
definition: Établissement où l'on vient prendre des eaux aux propriétés thérapeutiques.
TermeAssocie: station thermale
TermeAssocie: édifice hospitalier
status: 1

prison
type: Concept
modified: 2015-01-05T10:33:06+01:00
in scheme: Thésaurus de la désignation des œuvres architecturales et des espaces aménagés
preferred label: prisons @en-us
broader: édifice judiciaire pénitentiaire ou de police
alternative label: maison d'arrêt
alternative label: prison centrale
created: 2011-09-01T00:00:00+02:00
related: hôpital général
definition: Édifice ou partie d'édifice abritant des condamnés ou des prévenus mis en détention.
TermeAssocie: hôpital général
status: 1

tribunal
type: Concept
modified: 2015-01-05T10:48:53+01:00
in scheme: Thésaurus de la désignation des œuvres architecturales et des espaces aménagés
preferred label: courthouse @en-us
narrower: palais de justice
narrower: parlement
broader: édifice judiciaire pénitentiaire ou de police
alternative label: bailliage
alternative label: sergenterie
alternative label: présidial
alternative label: sénéchaussée
alternative label: officialité
alternative label: justice de paix
alternative label: prévôté
created: 2011-09-01T00:00:00+02:00
scope note: Ce terme s'applique aux tribunaux de toutes les époques, civils ou ecclésiastiques. Préciser la fonction dans la désignation complète de l’édifice.
definition: Édifice où l'on rend la justice.
status: 1
narrow match: cb13319328p

magasin de fourrage
type: Concept
modified: 2015-01-05T11:46:18+01:00
in scheme: Thésaurus de la désignation des œuvres architecturales et des espaces aménagés
broader: édifice logistique
alternative label: entrepôt militaire de fourrage
created: 2011-09-01T00:00:00+02:00
definition: Édifice ou partie d'édifice où est entreposé le fourrage destiné à l'alimentation des chevaux de l'armée.
status: 1

magasin de munitions
type: Concept
modified: 2015-01-05T11:47:17+01:00
in scheme: Thésaurus de la désignation des œuvres architecturales et des espaces aménagés
preferred label: magazines @en-us
broader: édifice logistique
alternative label: dépôt de munitions
alternative label: entrepôt de munitions
created: 2011-09-01T00:00:00+02:00
definition: Édifice ou partie d'édifice où sont entreposés les projectiles des armes à feu.
status: 1

poudrière
type: Concept
modified: 2015-01-05T11:49:21+01:00
in scheme: Thésaurus de la désignation des œuvres architecturales et des espaces aménagés
preferred label: powder magazines @en-us
broader: édifice logistique
created: 2011-09-01T00:00:00+02:00
definition: Édifice ou partie d'édifice où sont entreposés la poudre et les explosifs.
status: 1

station radar
type: Concept
modified: 2015-01-05T11:50:15+01:00
in scheme: Thésaurus de la désignation des œuvres architecturales et des espaces aménagés
broader: édifice logistique
created: 2011-09-01T00:00:00+02:00
scope note: Pour étudier les équipements (antenne radar, générateur, etc.) voir le Thesaurus des objets mobiliers.
related: relais de télécommunication
definition: Poste équipé d'un appareil radar pour le guidage des appareils en mer ou des avions en vol, ou bien pour leur détection.
TermeAssocie: relais de télécommunication
status: 1
broad match: http://vocab.getty.edu/aat/300235030

lieu de prière
type: Concept
modified: 2014-10-15T13:51:16+02:00
in scheme: Thésaurus de la désignation des œuvres architecturales et des espaces aménagés
broader: édifice religieux
created: 2011-09-01T00:00:00+02:00
definition: Dans certains lieux publics (aéroport, gare, hôpital, etc.), édifice ou partie d'édifice permettant aux pratiquants d'une religion de prier.
status: 1

mosquée
type: Concept
modified: 2014-11-28T12:54:02+01:00
in scheme: Thésaurus de la désignation des œuvres architecturales et des espaces aménagés
preferred label: moschea @it
preferred label: mosque @en-gb
preferred label: mosques @en-us
broader: édifice religieux
created: 2011-09-01T00:00:00+02:00
definition: Édifice consacré au culte musulman. Il est habituellement formé d’une cour et d’une salle, au fond de laquelle se trouve le mihrab, absidiole indiquant la direction de La Mecque. La plupart des mosquées sont dotées d’un minaret, tour pour appeler à la prière.
status: 1

synagogue
type: Concept
modified: 2014-11-28T12:56:59+01:00
in scheme: Thésaurus de la désignation des œuvres architecturales et des espaces aménagés
preferred label: sinagoga @it
preferred label: synagogues @en-us
broader: édifice religieux
created: 2011-09-01T00:00:00+02:00
definition: Édifice consacré au culte juif.
status: 1

temple antique
type: Concept
modified: 2014-11-28T13:00:02+01:00
in scheme: Thésaurus de la désignation des œuvres architecturales et des espaces aménagés
preferred label: tempio pagano @it
preferred label: temple @en-gb
preferred label: ancient + temples @en-us
broader: édifice religieux
alternative label: fanum
alternative label: temple païen
created: 2011-09-01T00:00:00+02:00
definition: Édifice abritant l'image d'une divinité.
status: 1
narrow match: cb16736539p

temple bouddhiste
type: Concept
modified: 2014-10-15T13:55:08+02:00
in scheme: Thésaurus de la désignation des œuvres architecturales et des espaces aménagés
preferred label: Buddhist temple @en-gb
broader: édifice religieux
created: 2011-09-01T00:00:00+02:00
definition: Édifice consacré au culte bouddhique.
status: 1

temple hindouiste
type: Concept
modified: 2014-11-28T12:59:53+01:00
in scheme: Thésaurus de la désignation des œuvres architecturales et des espaces aménagés
preferred label: Hindu temple @en-gb
broader: édifice religieux
created: 2011-09-01T00:00:00+02:00
definition: Édifice consacré au culte hindouiste.
status: 1

établissement nautique
type: Concept
modified: 2014-12-12T14:56:51+01:00
in scheme: Thésaurus de la désignation des œuvres architecturales et des espaces aménagés
broader: édifice sportif
created: 2011-09-01T00:00:00+02:00
definition: Édifice et aménagements destinés à la pratique d'un sport nautique ou à la navigation de plaisance.
status: 1

gymnase
type: Concept
modified: 2014-12-12T15:05:49+01:00
in scheme: Thésaurus de la désignation des œuvres architecturales et des espaces aménagés
preferred label: gymnasiums @en-us
broader: édifice sportif
alternative label: salle de sport
created: 2011-09-01T00:00:00+02:00
definition: Édifice où l'on pratique certains sports comme la gymnastique, le basket-ball, le handball, etc. Il comporte généralement des vestiaires, etc.
status: 1

hippodrome
type: Concept
modified: 2014-12-12T15:08:13+01:00
in scheme: Thésaurus de la désignation des œuvres architecturales et des espaces aménagés
preferred label: horse racetracks @en-us
broader: édifice sportif
alternative label: champ de courses
created: 2011-09-01T00:00:00+02:00
definition: Lieu aménagé pour les courses de chevaux : pistes, écuries, tribune du public, etc.
status: 1

jeu de paume
type: Concept
modified: 2014-10-10T10:09:44+02:00
in scheme: Thésaurus de la désignation des œuvres architecturales et des espaces aménagés
preferred label: jeu de paume fields @en-us
broader: édifice sportif
created: 2011-09-01T00:00:00+02:00
definition: Salle où l'on pratique le jeu de paume.
status: 1

manège
type: Concept
modified: 2014-12-12T15:26:33+01:00
in scheme: Thésaurus de la désignation des œuvres architecturales et des espaces aménagés
preferred label: riding halls @en-us
broader: édifice sportif
created: 2011-09-01T00:00:00+02:00
scope note: Ne pas appeler manège l'emplacement d'un moteur à énergie animale.
definition: Lieu couvert où l'on dresse les chevaux et où l'on enseigne l'équitation.
status: 1

patinoire
type: Concept
modified: 2014-12-12T15:28:49+01:00
in scheme: Thésaurus de la désignation des œuvres architecturales et des espaces aménagés
preferred label: skating rinks @en-us
broader: édifice sportif
created: 2011-09-01T00:00:00+02:00
related: piste de glisse
definition: Établissement destiné au patinage sur glace ou à roulettes.
TermeAssocie: piste de glisse
status: 1

fronton de pelote basque
type: Concept
modified: 2014-10-10T10:05:12+02:00
in scheme: Thésaurus de la désignation des œuvres architecturales et des espaces aménagés
preferred label: canchas @en-us
broader: édifice sportif
alternative label: trinquet
created: 2011-09-01T00:00:00+02:00
definition: Espace libre comportant au moins un mur appelé fronton, peuvent y être associés d’autres équipements nécessaires à la pratique des différents jeux de pelote basque. Lorsque le terrain de jeu est fermé et couvert, il est dénommé trinquet.
status: 1

salle d'armes
type: Concept
modified: 2014-10-10T10:15:35+02:00
in scheme: Thésaurus de la désignation des œuvres architecturales et des espaces aménagés
preferred label: fencing rooms @en-us
broader: édifice sportif
created: 2011-09-01T00:00:00+02:00
definition: Local où l'on enseigne et où l'on pratique l'escrime.
status: 1

stade
type: Concept
modified: 2014-12-18T15:08:32+01:00
in scheme: Thésaurus de la désignation des œuvres architecturales et des espaces aménagés
preferred label: stadiums @en-us
broader: édifice sportif
alternative label: terrain de rugby
alternative label: stade de football
alternative label: terrain de sport
alternative label: stade d'athlétisme
created: 2011-09-01T00:00:00+02:00
definition: Terrain de sport rectangulaire ou ovale, qui peut être ceint d'une piste de course et bordé de tribunes pour le public, de vestiaires pour les sportifs. Il est destiné soit à des exercices d'athlétisme, soit à des épreuves sportives par équipes comme le football ou le rugby.
status: 1

vélodrome
type: Concept
modified: 2014-12-18T15:09:37+01:00
in scheme: Thésaurus de la désignation des œuvres architecturales et des espaces aménagés
preferred label: velodromes @en-us
broader: édifice sportif
created: 2011-09-01T00:00:00+02:00
definition: Édifice regroupant les installations nécessaires aux courses cyclistes sur piste. Il peut être découvert ou couvert.
status: 1

enfeu
type: Concept
modified: 2015-02-24T14:41:37+01:00
in scheme: Thésaurus de la désignation des œuvres architecturales et des espaces aménagés
preferred label: loculo @it
preferred label: tomb + niche @en-gb
broader: édifices et édicules funéraires
created: 2011-09-01T00:00:00+02:00
scope note: Voir aussi le Thesaurus des objets mobiliers.
related: niche
related: niche-crédence
definition: Niche à fond plat destinée à abriter un sarcophage, un tombeau ou la représentation d'une scène funéraire.
TermeAssocie: niche
TermeAssocie: niche-crédence
status: 1

funérarium
type: Concept
modified: 2014-10-15T13:01:54+02:00
in scheme: Thésaurus de la désignation des œuvres architecturales et des espaces aménagés
preferred label: funeral homes @en-us
broader: édifices et édicules funéraires
created: 2011-09-01T00:00:00+02:00
definition: Édifice, généralement situé près d'un cimetière, où se réunissent les familles autour des défunts lors des obsèques.
status: 1

grotte sépulcrale
type: Concept
modified: 2015-02-24T16:01:07+01:00
in scheme: Thésaurus de la désignation des œuvres architecturales et des espaces aménagés
preferred label: burial caves @en-us
broader: édifices et édicules funéraires
created: 2011-09-01T00:00:00+02:00
scope note: Ne pas confondre avec grotte ornée.
definition: Cavité naturelle contenant des dépôts funéraires. Elle peut être ornée.
status: 1

lanterne des morts
type: Concept
modified: 2015-02-24T12:10:38+01:00
in scheme: Thésaurus de la désignation des œuvres architecturales et des espaces aménagés
preferred label: lanterna mortuaria @it
preferred label: lanterns of the dead @en-us
preferred label: poor souls light @en-gb
broader: édifices et édicules funéraires
created: 2011-09-01T00:00:00+02:00
scope note: Voir aussi le Thesaurus des objets mobiliers.
definition: Édicule servant de fanal dans les cimetières.
status: 1

morgue
type: Concept
modified: 2015-02-24T16:27:09+01:00
in scheme: Thésaurus de la désignation des œuvres architecturales et des espaces aménagés
preferred label: obitorio + camera mortuaria @it
preferred label: mortuary @en-gb
preferred label: morgues @en-us
broader: édifices et édicules funéraires
alternative label: institut médicolégal
created: 2011-09-01T00:00:00+02:00
definition: Édifice ou partie d’édifice où reposent les morts dans l’attente d’opérations médicolégales ou d’obsèques.
status: 1

ossuaire
type: Concept
modified: 2015-02-24T16:28:53+01:00
in scheme: Thésaurus de la désignation des œuvres architecturales et des espaces aménagés
preferred label: ossario @it
preferred label: ossuaries (buildings) @en-us
preferred label: ossuary @en-gb
broader: édifices et édicules funéraires
created: 2011-09-01T00:00:00+02:00
definition: Construction où sont réunis les ossements d'un cimetière, exhumés pour créer de nouvelles tombes.
status: 1

pierre des morts
type: Concept
modified: 2015-02-24T12:20:38+01:00
in scheme: Thésaurus de la désignation des œuvres architecturales et des espaces aménagés
preferred label: coffin rest @en-gb
broader: édifices et édicules funéraires
alternative label: banc des morts
created: 2011-09-01T00:00:00+02:00
scope note: Voir aussi le Thesaurus des objets mobiliers.
definition: Grande pierre rectangulaire placée devant l'entrée d'une église, sur laquelle on posait le cercueil avant la mise en terre. Elle peut comporter également un soubassement avec des degrés et être accompagnée d’une croix monumentale.
status: 1

église paroissiale
type: Concept
modified: 2014-11-27T16:31:25+01:00
in scheme: Thésaurus de la désignation des œuvres architecturales et des espaces aménagés
preferred label: chiesa parrocchiale @it
preferred label: parish churches @en-us
preferred label: parish church @en-gb
broader: église
created: 2011-09-01T00:00:00+02:00
related: presbytère
definition: Église principale d'une paroisse, desservie par un curé.
TermeAssocie: presbytère
status: 1

temple
type: Concept
modified: 2014-11-27T16:46:17+01:00
in scheme: Thésaurus de la désignation des œuvres architecturales et des espaces aménagés
preferred label: chiesa protestante @it
preferred label: protestant + churches @en-us
preferred label: protestant church @en-gb
broader: église
alternative label: temple protestant
created: 2011-09-01T00:00:00+02:00
scope note: Pour le culte luthérien, employer église en dénomination et préciser de luthériens en destinataires.
definition: Église du culte réformé.
status: 1

égout
type: Concept
modified: 2014-12-02T12:04:39+01:00
in scheme: Thésaurus de la désignation des œuvres architecturales et des espaces aménagés
preferred label: égouts @en-us
broader: ouvrage d'art
alternative label: émissaire
created: 2011-09-01T00:00:00+02:00
definition: Conduite généralement souterraine destinée à recueillir les eaux usées et les eaux de pluie.
status: 1

escalier
type: Concept
modified: 2015-02-25T12:48:41+01:00
in scheme: Thésaurus de la désignation des œuvres architecturales et des espaces aménagés
preferred label: stairs @en-us
narrower: escalier d'honneur
narrower: escalier de service
narrower: escalier indépendant
narrower: escalier mécanique
narrower: perron
broader: éléments de circulation
alternative label: noyau d'escalier
alternative label: cage d'escalier
alternative label: degré
created: 2011-09-01T00:00:00+02:00
scope note: Voir aussi le Thesaurus des objets mobiliers.
definition: Ouvrage formé de marches et permettant de passer d'un plan à un autre, d'un étage à un autre, dans ou à l'extérieur d'un bâtiment. Il est généralement contenu dans une cage.
status: 1

galerie technique
type: Concept
modified: 2014-10-16T11:15:20+02:00
in scheme: Thésaurus de la désignation des œuvres architecturales et des espaces aménagés
broader: éléments de circulation
created: 2011-09-01T00:00:00+02:00
scope note: Ne pas confondre avec galerie maçonnée.
definition: Long passage généralement souterrain et maçonné où sont rassemblées les différentes canalisations d'alimentation ou d'évacuation d'une construction ou d’un ensemble de constructions. Elle est parfois d’une section suffisante pour permettre à une personne d’en assurer la surveillance et l’entretien.
status: 1

passage d'entrée
type: Concept
modified: 2015-02-25T13:42:15+01:00
in scheme: Thésaurus de la désignation des œuvres architecturales et des espaces aménagés
preferred label: carriage passages @en-us
narrower: tour porte
broader: éléments de circulation
created: 2011-09-01T00:00:00+02:00
definition: Espace ouvert aux véhicules, placé à l'entrée d'un édifice et traversant l'épaisseur d'un corps de bâtiment, généralement entre deux portes cochères ou portes charretières.
status: 1

porche
type: Concept
modified: 2015-02-25T10:16:33+01:00
in scheme: Thésaurus de la désignation des œuvres architecturales et des espaces aménagés
preferred label: porches @en-us
narrower: tour porche
broader: éléments de circulation
created: 2011-09-01T00:00:00+02:00
scope note: Ne pas confondre avec vestibule. Voir aussi le Thesaurus des objets mobiliers.
definition: Pièce ou galerie commandant l'entrée d'un bâtiment. Formant un avant-corps bas, le porche est généralement hors-œuvre.
status: 1

rampe d'accès
type: Concept
modified: 2015-02-25T13:51:34+01:00
in scheme: Thésaurus de la désignation des œuvres architecturales et des espaces aménagés
preferred label: ramps @en-us
broader: éléments de circulation
alternative label: rampe d'accès indépendante
created: 2011-09-01T00:00:00+02:00
definition: Ouvrage en pente permettant aux personnes, aux animaux et aux voitures de passer d'un plan à un autre. Les rampes sont souvent coupées par des pas d'âne, sortes de marches rampantes, très basses et très espacées.
status: 1

salle des pas perdus
type: Concept
modified: 2015-02-25T13:53:33+01:00
in scheme: Thésaurus de la désignation des œuvres architecturales et des espaces aménagés
broader: éléments de circulation
created: 2011-09-01T00:00:00+02:00
definition: Large vestibule communiquant avec les différentes pièces d'un bâtiment administratif, judiciaire, etc.
status: 1

tapis roulant
type: Concept
modified: 2015-02-25T13:55:48+01:00
in scheme: Thésaurus de la désignation des œuvres architecturales et des espaces aménagés
preferred label: moving walkways @en-us
broader: éléments de circulation
created: 2011-09-01T00:00:00+02:00
scope note: Ne pas confondre avec tapis roulant d'exercice (running machine), qui est une machine d'exercice physique permettant à l'utilisateur de reproduire la marche ou la course.
definition: Ouvrage mécanique de circulation généralement horizontale, permettant de transporter d'un point à un autre dans un ensemble, dans un édifice ou entre des édifices, des personnes, des objets, des matériaux ou des produits en vrac.
status: 1

toboggan de manutention
type: Concept
modified: 2014-10-22T12:58:46+02:00
in scheme: Thésaurus de la désignation des œuvres architecturales et des espaces aménagés
preferred label: chutes @en-us
broader: éléments de circulation
created: 2011-09-01T00:00:00+02:00
definition: Dispositif de descente constitué par un couloir de section appropriée, à trajet rectiligne, courbe ou hélicoïdal, utilisé pour acheminer par gravité des produits ou des objets d'un niveau à un autre.
status: 1

élévateur à bateau
type: Concept
modified: 2014-10-16T14:47:20+02:00
in scheme: Thésaurus de la désignation des œuvres architecturales et des espaces aménagés
broader: ouvrage d'art
alternative label: écluse à sas mobile
alternative label: ascenseur à bateau
created: 2011-09-01T00:00:00+02:00
definition: Ouvrage d'art permettant à un sas mobile capable de recevoir un bateau à flot de venir alternativement se mettre en communication avec le bief d'aval et le bief d'amont. La mise en mouvement du sas peut être assurée par un système hydraulique ou un funiculaire.
status: 1

élévation intérieure
type: Concept
modified: 2015-02-25T14:01:29+01:00
in scheme: Thésaurus de la désignation des œuvres architecturales et des espaces aménagés
broader: élévation
created: 2011-09-01T00:00:00+02:00
definition: Face verticale intérieure d'un bâtiment ou d'un corps de bâtiment.
status: 1

oriel
type: Concept
modified: 2015-02-25T14:02:49+01:00
in scheme: Thésaurus de la désignation des œuvres architecturales et des espaces aménagés
preferred label: oriel windows @en-us
broader: élévation
alternative label: bow window
created: 2011-09-01T00:00:00+02:00
scope note: Ne pas confondre avec échauguette, ni avec logette.
definition: Élément d’élévation formé d’un ouvrage à claire-voie, généralement en surplomb, formant avant-corps sur la hauteur de plusieurs étages et renfermant de petites pièces.
status: 1

enceinte
type: Concept
modified: 2015-01-05T12:44:17+01:00
in scheme: Thésaurus de la désignation des œuvres architecturales et des espaces aménagés
preferred label: defensive walls @en-us
broader: ouvrage fortifié
alternative label: rempart
created: 2011-09-01T00:00:00+02:00
related: fortification d'agglomération
definition: Clôture continue enveloppant une place forte ou une partie de place forte pour sa défense. Une place forte peut avoir plusieurs enceintes qui se commandent les unes les autres. Elles se numérotent de l'extérieur vers l'intérieur.
TermeAssocie: fortification d'agglomération
status: 1
broad match: cb11931504g

enclos funéraire
type: Concept
modified: 2014-10-20T11:33:18+02:00
in scheme: Thésaurus de la désignation des œuvres architecturales et des espaces aménagés
preferred label: recinto cimiteriale @it
preferred label: churchyard + walls @en-us
preferred label: funerary enclosure @en-gb
broader: ensemble funéraire
created: 2011-09-01T00:00:00+02:00
definition: Enclos, généralement privé, utilisé à des fins funéraires. Il peut être situé à l'intérieur d'un cimetière.
status: 1

niche-crédence
type: Concept
modified: 2014-10-15T17:32:23+02:00
in scheme: Thésaurus de la désignation des œuvres architecturales et des espaces aménagés
preferred label: tabernacolo @it
preferred label: credence @en-gb
broader: partie d'église
created: 2011-09-01T00:00:00+02:00
scope note: Voir aussi le Thesaurus des objets mobiliers.
related: niche
related: enfeu
definition: Petite niche placée près de l'autel du côté de l'Épître et destinée à contenir les burettes.
TermeAssocie: niche
TermeAssocie: enfeu
status: 1

ensemble à fonction non identifiée
type: Concept
modified: 2015-02-25T14:33:34+01:00
in scheme: Thésaurus de la désignation des œuvres architecturales et des espaces aménagés
broader: partie ou élément commun à tous les types d'architecture et aux espaces aménagés
alternative label: ensemble non identifié
created: 2011-09-01T00:00:00+02:00
definition: Ensemble constitué d'édifices ou édicules dont la fonction d'origine est inconnue.
status: 1

exploitation agricole
type: Concept
modified: 2014-12-30T14:01:43+01:00
in scheme: Thésaurus de la désignation des œuvres architecturales et des espaces aménagés
broader: ensemble agricole
created: 2011-09-01T00:00:00+02:00
related: ferme
definition: Complexe dédié à la mise en valeur agricole d’un domaine, pouvant inclure le logement des employés, une maison de maître ou de cultivateur, des installations destinées aux animaux domestiques, des entrepôts et des silos, une ou plusieurs usines, etc.
TermeAssocie: ferme
status: 1

ensemble pastoral
type: Concept
modified: 2014-12-30T13:59:02+01:00
in scheme: Thésaurus de la désignation des œuvres architecturales et des espaces aménagés
preferred label: sheep farms @en-us
broader: ensemble agricole
created: 2011-09-01T00:00:00+02:00
definition: Ensemble constitué d'édifices, édicules et espaces à fonction pastorale.
status: 1
narrow match: cb11947127p

exploitation aquicole
type: Concept
modified: 2014-10-06T11:55:59+02:00
in scheme: Thésaurus de la désignation des œuvres architecturales et des espaces aménagés
broader: ensemble agricole
alternative label: exploitation ostréicole
alternative label: exploitation conchylicole
alternative label: exploitation piscicole
created: 2011-09-01T00:00:00+02:00
definition: Installation d'élevage d'espèces animales en milieu aquatique (poissons, crustacés, coquillages) à des fins commerciales. Pour ce type d'exploitation, il est nécessaire de procéder à des aménagements en créant des parcs, des bassins, des enclos, des cages, des bacs, des remises, etc.
status: 1

polder
type: Concept
modified: 2014-10-06T11:56:42+02:00
in scheme: Thésaurus de la désignation des œuvres architecturales et des espaces aménagés
preferred label: polders @en-us
broader: ensemble agricole
created: 2011-09-01T00:00:00+02:00
definition: Territoire agricole entouré de digues, conquis sur le domaine maritime ou fluvial, souvent accompagné de canaux de draînage.
status: 1

terrasse agricole
type: Concept
modified: 2014-12-30T14:07:10+01:00
in scheme: Thésaurus de la désignation des œuvres architecturales et des espaces aménagés
broader: ensemble agricole
alternative label: terrasse de culture
created: 2011-09-01T00:00:00+02:00
scope note: Ne pas employer en l'absence de mur de soutènement.
definition: Terrain aménagé par des levées de terre soutenues par des murets maçonnés ou en pierre sèche, afin de permettre des cultures en terrasses dans les sites à forte pente.
status: 1
broad match: http://vocab.getty.edu/aat/300004182

ensemble castral
type: Concept
modified: 2015-01-05T12:06:33+01:00
in scheme: Thésaurus de la désignation des œuvres architecturales et des espaces aménagés
broader: ensemble militaire
created: 2011-09-01T00:00:00+02:00
definition: Ensemble constitué par plusieurs châteaux à fonction défensive ou résidentielle.
status: 1
broad match: Château

ensemble cultuel
type: Concept
modified: 2014-09-30T17:25:00+02:00
in scheme: Thésaurus de la désignation des œuvres architecturales et des espaces aménagés
narrower: mont calvaire
broader: ensemble religieux
created: 2011-09-01T00:00:00+02:00
definition: Ensemble constitué d'édifices ou édicules à vocation cultuelle.
status: 1
broad match: http://data.bnf.fr/ark:/12148/cb119347518
broad match: http://vocab.getty.edu/aat/300007391

mont calvaire
type: Concept
modified: 2015-02-24T12:12:46+01:00
in scheme: Thésaurus de la désignation des œuvres architecturales et des espaces aménagés
preferred label: via crucis @it
broader: ensemble cultuel
alternative label: chemin de croix extérieur
created: 2011-09-01T00:00:00+02:00
scope note: Ne pas confondre avec calvaire monumental. Voir aussi le Thesaurus des objets mobiliers (chemin de croix extérieur).
definition: Chemin de croix extérieur dont les stations sont marquées par de petits oratoires échelonnés sur un parcours qui conduit à une croix monumentale ou à une église.
status: 1

ensemble d'édifices à cour commune
type: Concept
modified: 2015-01-08T10:25:32+01:00
in scheme: Thésaurus de la désignation des œuvres architecturales et des espaces aménagés
broader: secteur urbain
created: 2011-09-01T00:00:00+02:00
definition: Ensemble spontané ou concerté constitué d’édifices groupés autour d’une cour commune.
status: 1

ensemble d'édifices à desserte commune
type: Concept
modified: 2013-04-23T00:00:00+02:00
in scheme: Thésaurus de la désignation des œuvres architecturales et des espaces aménagés
broader: secteur urbain
created: 2011-09-01T00:00:00+02:00
definition: Ensemble constitué d’édifices desservis par un ou des dispositifs d’accès communs (entrée, cour, escalier, etc.).
status: 1

ensemble d'édifices derrière façade
type: Concept
modified: 2015-01-08T10:28:54+01:00
in scheme: Thésaurus de la désignation des œuvres architecturales et des espaces aménagés
broader: secteur urbain
created: 2011-09-01T00:00:00+02:00
scope note: Ne pas confondre avec immeuble à logements.
definition: Ensemble concerté constitué d’édifices, de formes diverses, unifiés par une façade commune.
status: 1

ensemble d'industrie agro-alimentaire
type: Concept
modified: 2015-05-04T14:38:26+02:00
in scheme: Thésaurus de la désignation des œuvres architecturales et des espaces aménagés
broader: ensemble industriel
alternative label: ensemble d'industrie alimentaire
created: 2011-09-01T00:00:00+02:00
definition: Ensemble constitué d'usines liées à l'industrie alimentaire.
status: 1
broad match: cb11949682p
broad match: Industrie agroalimentaire

ensemble d'industrie céramique
type: Concept
modified: 2015-05-04T14:40:06+02:00
in scheme: Thésaurus de la désignation des œuvres architecturales et des espaces aménagés
broader: ensemble industriel
created: 2011-09-01T00:00:00+02:00
definition: Ensemble constitué d'usines liées à l'industrie céramique : terre cuite, faïence, porcelaine.
status: 1
broad match: http://data.bnf.fr/ark:/12148/cb119444629

ensemble d'industrie chimique
type: Concept
modified: 2015-05-04T14:44:35+02:00
in scheme: Thésaurus de la désignation des œuvres architecturales et des espaces aménagés
broader: ensemble industriel
created: 2011-09-01T00:00:00+02:00
definition: Ensemble constitué d'usines liées à l'industrie chimique (pétrochimie, chimie agricole, chimie pharmaceutique, etc.).
status: 1
broad match: http://data.bnf.fr/ark:/12148/cb119344476
broad match: Industrie chimique

ensemble d'industrie du bois
type: Concept
modified: 2015-05-04T14:47:21+02:00
in scheme: Thésaurus de la désignation des œuvres architecturales et des espaces aménagés
broader: ensemble industriel
created: 2011-09-01T00:00:00+02:00
definition: Ensemble constitué d'usines liées à l'industrie du bois.
status: 1
broad match: http://data.bnf.fr/ark:/12148/cb119618654
broad match: Industrie du bois

ensemble d'industrie du papier
type: Concept
modified: 2015-05-04T14:50:42+02:00
in scheme: Thésaurus de la désignation des œuvres architecturales et des espaces aménagés
broader: ensemble industriel
created: 2011-09-01T00:00:00+02:00
definition: Ensemble constitué d'usines liées à l'industrie du papier.
status: 1
broad match: http://data.bnf.fr/ark:/12148/cb119358795
broad match: Industrie papetière

ensemble d'industrie extractive
type: Concept
modified: 2015-05-04T14:54:58+02:00
in scheme: Thésaurus de la désignation des œuvres architecturales et des espaces aménagés
broader: ensemble industriel
created: 2011-09-01T00:00:00+02:00
definition: Ensemble constitué d'usines liées à l'industrie extractive.
status: 1
broad match: cb11944497z
broad match: Catégorie:Industrie extractive

ensemble d'industrie verrière
type: Concept
modified: 2015-05-04T14:56:28+02:00
in scheme: Thésaurus de la désignation des œuvres architecturales et des espaces aménagés
broader: ensemble industriel
created: 2011-09-01T00:00:00+02:00
definition: Ensemble constitué d'usines liées à l'industrie du verre.
status: 1
broad match: cb11941231r

ensemble de construction aéronautique
type: Concept
modified: 2015-05-04T15:06:21+02:00
in scheme: Thésaurus de la désignation des œuvres architecturales et des espaces aménagés
broader: ensemble de construction mécanique
created: 2011-09-01T00:00:00+02:00
definition: Ensemble constitué d'usines liées à la construction aéronautique.
status: 1
broad match: Construction aéronautique
broad match: http://data.bnf.fr/ark:/12148/cb119396171

ensemble de construction mécanique
type: Concept
modified: 2015-05-04T15:03:47+02:00
in scheme: Thésaurus de la désignation des œuvres architecturales et des espaces aménagés
narrower: ensemble de construction aéronautique
narrower: ensemble de construction automobile
narrower: ensemble de construction navale
broader: ensemble industriel
created: 2011-09-01T00:00:00+02:00
definition: Ensemble constitué d'usines liées à la construction mécanique.
status: 1
broad match: http://data.bnf.fr/ark:/12148/cb11953162f
broad match: Construction mécanique

ensemble de construction automobile
type: Concept
modified: 2015-05-04T15:09:48+02:00
in scheme: Thésaurus de la désignation des œuvres architecturales et des espaces aménagés
broader: ensemble de construction mécanique
created: 2011-09-01T00:00:00+02:00
definition: Ensemble constitué d'usines liées à la construction de véhicules automobiles.
status: 1
broad match: http://data.bnf.fr/ark:/12148/cb119470320
broad match: Construction automobile

ensemble de construction électrique
type: Concept
modified: 2015-05-04T14:58:51+02:00
in scheme: Thésaurus de la désignation des œuvres architecturales et des espaces aménagés
broader: ensemble industriel
created: 2011-09-01T00:00:00+02:00
definition: Ensemble constitué d'usines liées à la construction électrique.
status: 1

ensemble de construction électronique
type: Concept
modified: 2015-05-04T15:00:33+02:00
in scheme: Thésaurus de la désignation des œuvres architecturales et des espaces aménagés
broader: ensemble industriel
created: 2011-09-01T00:00:00+02:00
definition: Ensemble constitué d'usines liées à la construction électronique.
status: 1

ensemble de construction navale
type: Concept
modified: 2015-05-04T15:13:49+02:00
in scheme: Thésaurus de la désignation des œuvres architecturales et des espaces aménagés
broader: ensemble de construction mécanique
created: 2011-09-01T00:00:00+02:00
definition: Ensemble constitué d'usines liées à la construction de bateaux et de sous-marins.
status: 1

parc d'attractions
type: Concept
modified: 2014-10-10T12:10:42+02:00
in scheme: Thésaurus de la désignation des œuvres architecturales et des espaces aménagés
preferred label: amusement parks @en-us
broader: ensemble de culture recherche sport ou loisir
alternative label: parc à thèmes
alternative label: parc de loisirs
created: 2011-09-01T00:00:00+02:00
related: jardin d'attractions
definition: Complexe aménagé en plein air, proposant diverses activités de loisirs et de divertissement.
TermeAssocie: jardin d'attractions
status: 1

parc résidentiel de loisirs
type: Concept
modified: 2014-12-12T14:43:53+01:00
in scheme: Thésaurus de la désignation des œuvres architecturales et des espaces aménagés
preferred label: camps (recreation areas) @en-us
broader: ensemble de culture recherche sport ou loisir
created: 2011-09-01T00:00:00+02:00
definition: Complexe d'habitations légères de loisirs, comprenant espaces communs, réseaux et équipements nécessaires.
status: 1

village de vacances
type: Concept
modified: 2014-12-12T14:45:49+01:00
in scheme: Thésaurus de la désignation des œuvres architecturales et des espaces aménagés
broader: ensemble de culture recherche sport ou loisir
created: 2011-09-01T00:00:00+02:00
definition: Complexe autonome peu dense destiné spécifiquement aux séjours de vacances et comprenant voirie, logements, équipements sportifs et services collectifs, etc.
status: 1
broad match: http://data.bnf.fr/ark:/12148/cb120689243

ensemble de fabrication de matériaux de construction
type: Concept
modified: 2015-04-14T15:45:26+02:00
in scheme: Thésaurus de la désignation des œuvres architecturales et des espaces aménagés
broader: ensemble industriel
created: 2011-09-01T00:00:00+02:00
definition: Ensemble constitué d'usines liées à la fabrication de matériaux de construction : plâtre, ciment, etc.
status: 1

ensemble de fabrication des métaux
type: Concept
modified: 2015-04-21T11:45:03+02:00
in scheme: Thésaurus de la désignation des œuvres architecturales et des espaces aménagés
broader: ensemble métallurgique
created: 2011-09-01T00:00:00+02:00
definition: Ensemble constitué d'usines liées à la fabrication des métaux.
status: 1

ensemble métallurgique
type: Concept
modified: 2015-05-04T15:30:40+02:00
in scheme: Thésaurus de la désignation des œuvres architecturales et des espaces aménagés
narrower: ensemble de fabrication des métaux
narrower: ensemble de transformation des métaux
broader: ensemble industriel
created: 2011-09-01T00:00:00+02:00
definition: Ensemble constitué d'usines liées à la métallurgie.
status: 1
broad match: http://data.bnf.fr/ark:/12148/cb119766968
broad match: Métallurgie

ensemble de mécanique de précision
type: Concept
modified: 2015-05-04T15:16:30+02:00
in scheme: Thésaurus de la désignation des œuvres architecturales et des espaces aménagés
broader: ensemble industriel
created: 2011-09-01T00:00:00+02:00
definition: Ensemble constitué d'usines liées à la mécanique de précision.
status: 1
broad match: Mécanique de précision

ensemble de petite métallurgie
type: Concept
modified: 2015-04-14T15:57:40+02:00
in scheme: Thésaurus de la désignation des œuvres architecturales et des espaces aménagés
broader: ensemble industriel
created: 2011-09-01T00:00:00+02:00
definition: Ensemble constitué d'usines liées à la petite métallurgie.
status: 1

ensemble de transformation des métaux
type: Concept
modified: 2015-04-21T11:54:29+02:00
in scheme: Thésaurus de la désignation des œuvres architecturales et des espaces aménagés
broader: ensemble métallurgique
created: 2011-09-01T00:00:00+02:00
definition: Ensemble constitué d'usines liées à la transformation des métaux.
status: 1

gare de triage
type: Concept
modified: 2014-12-01T13:12:36+01:00
in scheme: Thésaurus de la désignation des œuvres architecturales et des espaces aménagés
preferred label: marshalling yards @en-us
broader: ensemble du génie civil
alternative label: triage
created: 2011-09-01T00:00:00+02:00
definition: Ensemble des installations de chemin de fer, de plusieurs kilomètres de long, spécialisées dans le traitement du trafic du fret, où les wagons de marchandises détachés de leur rame initiale sont triés pour être incorporés dans de nouveaux trains. L'ensemble se compose généralement d'un faisceau de voies de réception, d'une butte de triage, d'un faisceau de voies de débranchement ou de triage et d'un faisceau de départ.
status: 1

plate-forme multimodale
type: Concept
modified: 2014-10-16T14:19:26+02:00
in scheme: Thésaurus de la désignation des œuvres architecturales et des espaces aménagés
narrower: gare maritime
broader: ensemble du génie civil
created: 2011-09-01T00:00:00+02:00
definition: Ensemble aménagé pour faciliter le transfert de passagers ou de marchandises d'un mode de transport à un autre (automobile, train, avion, bateau, etc.).
status: 1

rivière aménagée
type: Concept
modified: 2014-12-01T13:29:26+01:00
in scheme: Thésaurus de la désignation des œuvres architecturales et des espaces aménagés
broader: ensemble du génie civil
created: 2011-09-01T00:00:00+02:00
scope note: Ne confondre avec voie navigable ni avec canal.
definition: Portion d'un cours d'eau naturel non navigable aménagée par l'homme à l'aide de canalisations, de vannes, d'endiguements ou de dérivations, afin de lui imposer un parcours précis (traversée ou alimentation d'une agglomération) et/ou d'en utiliser la force motrice.
status: 1

voie ferrée
type: Concept
modified: 2014-12-01T13:47:49+01:00
in scheme: Thésaurus de la désignation des œuvres architecturales et des espaces aménagés
preferred label: railroads @en-us
broader: ensemble du génie civil
alternative label: chemin de fer
created: 2011-09-01T00:00:00+02:00
scope note: La voie ferrée peut être dite normale (écartement des rails de 1,435 m), étroite (écartement inférieur à 1,435 m), métrique (écartement de 1 m), à double écartement (trois rails parallèles permettant la circulation de matériels à plusieurs écartements sur une même plate-forme), à crémaillière (deux rails parallèles, complétés par un troisième rail denté pour assurer la montée de dénivelés importants), à troisième rail (un rail supplémentaire pour l’alimentation électrique).
related: gare
related: réseau ferré
definition: Ensemble constitué par les rails d'une ligne de chemin de fer, avec ses ouvrages d'art, ses stations, etc.
TermeAssocie: gare
TermeAssocie: réseau ferré
status: 1

nécropole
type: Concept
modified: 2014-10-15T13:17:44+02:00
in scheme: Thésaurus de la désignation des œuvres architecturales et des espaces aménagés
preferred label: cemetery 2 @en-gb
preferred label: necropolises @en-us
broader: ensemble funéraire
created: 2011-09-01T00:00:00+02:00
definition: Dans l'Antiquité et durant le haut Moyen Âge, espace extra-muros destiné aux sépultures.
status: 1
broad match: cb11938920h

ensemble générateur d'énergie
type: Concept
modified: 2015-04-15T11:00:07+02:00
in scheme: Thésaurus de la désignation des œuvres architecturales et des espaces aménagés
broader: ensemble industriel
created: 2011-09-01T00:00:00+02:00
definition: Ensemble constitué d'usines productrices d'énergie.
status: 1

ensemble textile
type: Concept
modified: 2015-05-04T15:35:57+02:00
in scheme: Thésaurus de la désignation des œuvres architecturales et des espaces aménagés
broader: ensemble industriel
created: 2011-09-01T00:00:00+02:00
definition: Ensemble constitué d'usines liées au textile.
status: 1
broad match: http://data.bnf.fr/ark:/12148/cb119336078
broad match: Industrie textile

fortification
type: Concept
modified: 2014-10-14T15:56:16+02:00
in scheme: Thésaurus de la désignation des œuvres architecturales et des espaces aménagés
narrower: fortification d'agglomération
narrower: ligne fortifiée
narrower: oppidum
narrower: place forte
broader: ensemble militaire
alternative label: ensemble fortifié
created: 2011-09-01T00:00:00+02:00
definition: Ensemble formé d'édifices ou d'ouvrages défensifs.
status: 1

polygone de tir
type: Concept
modified: 2015-01-05T12:24:15+01:00
in scheme: Thésaurus de la désignation des œuvres architecturales et des espaces aménagés
preferred label: firing ranges @en-us
broader: ensemble militaire
alternative label: champ de tir
created: 2011-09-01T00:00:00+02:00
definition: Terrain militaire destiné aux manœuvres de l'artillerie ou des engins autopropulsés.
status: 1

groupe épiscopal
type: Concept
modified: 2014-10-23T10:35:27+02:00
in scheme: Thésaurus de la désignation des œuvres architecturales et des espaces aménagés
preferred label: closes @en-us
preferred label: cathedral close @en-gb
broader: ensemble religieux
alternative label: ensemble cathédral
alternative label: groupe cathédral
created: 2011-09-01T00:00:00+02:00
related: palais épiscopal
definition: Complexe constitué d'édifices regroupés autour d'une église cathédrale : cloître, baptistère, palais épiscopal, quartier canonial, etc.
TermeAssocie: palais épiscopal
status: 1

quartier canonial
type: Concept
modified: 2014-10-23T10:40:34+02:00
in scheme: Thésaurus de la désignation des œuvres architecturales et des espaces aménagés
preferred label: canonica @it
broader: ensemble religieux
alternative label: cloître canonial
alternative label: cloître (ensemble)
alternative label: ensemble canonial
created: 2011-09-01T00:00:00+02:00
scope note: Au Moyen Âge, il est souvent clos de portes et de murs, ou de bâtiments.
related: quartier
definition: Complexe formé par les habitations et les édifices nécessaires aux chanoines du chapitre d’une cathédrale ou d'une collégiale.
TermeAssocie: quartier
status: 1

entrée de port
type: Concept
modified: 2013-04-23T00:00:00+02:00
in scheme: Thésaurus de la désignation des œuvres architecturales et des espaces aménagés
broader: ouvrage d'art
created: 2011-09-01T00:00:00+02:00
related: port
definition: Ouvrage destiné à marquer l’accès d’un port par une signalisation ou à en assurer la sécurité et la défense.
TermeAssocie: port
status: 1

magasin industriel
type: Concept
modified: 2015-03-31T16:12:20+02:00
in scheme: Thésaurus de la désignation des œuvres architecturales et des espaces aménagés
broader: parties industrielles
created: 2011-09-01T00:00:00+02:00
related: entrepôt commercial
definition: Bâtiment ou local où sont stockés les produits manufacturés destinés à la vente.
TermeAssocie: entrepôt commercial
status: 1

entrepôt industriel
type: Concept
modified: 2015-04-30T16:55:09+02:00
in scheme: Thésaurus de la désignation des œuvres architecturales et des espaces aménagés
broader: parties industrielles
created: 2011-09-01T00:00:00+02:00
definition: Bâtiment de stockage pour les matières premières avant transformation.
status: 1

grenier public
type: Concept
modified: 2014-12-05T12:20:26+01:00
in scheme: Thésaurus de la désignation des œuvres architecturales et des espaces aménagés
preferred label: granaries @en-us
broader: entrepôt public
created: 2011-09-01T00:00:00+02:00
definition: Édifice servant d'entrepôt pour les provisions de grains, constituées par une collectivité et destinées à approvisionner les marchés en cas de famine.
status: 1
broad match: http://data.bnf.fr/ark:/12148/cb11957096f
broad match: Grenier

éolienne
type: Concept
modified: 2014-12-02T12:09:19+01:00
in scheme: Thésaurus de la désignation des œuvres architecturales et des espaces aménagés
preferred label: windmills @en-us
broader: ouvrage d'art
created: 2011-09-01T00:00:00+02:00
definition: Édicule abritant un mécanisme utilisant la force motrice du vent pour élever l'eau ou produire de l'électricité.
status: 1

éperon barré
type: Concept
modified: 2015-01-05T13:31:09+01:00
in scheme: Thésaurus de la désignation des œuvres architecturales et des espaces aménagés
broader: ouvrage fortifié
created: 2011-09-01T00:00:00+02:00
definition: L'éperon barré est un promontoire rocheux dont l'isthme a été coupé par un retranchement.
status: 1

épi
type: Concept
modified: 2014-10-16T14:49:52+02:00
in scheme: Thésaurus de la désignation des œuvres architecturales et des espaces aménagés
preferred label: groins @en-us
broader: ouvrage d'art
created: 2011-09-01T00:00:00+02:00
definition: Ouvrage hydraulique fixe en maçonnerie ou en charpente, le plus souvent perpendiculaire aux berges d’un cours d’eau ou au rivage, construit pour diriger les courants, fixer les sédiments ou en mer retenir le sable rapporté afin de créer une plage.
status: 1

ermitage
type: Concept
modified: 2014-11-28T09:40:40+01:00
in scheme: Thésaurus de la désignation des œuvres architecturales et des espaces aménagés
preferred label: eremo @it
preferred label: hermitage (religious) @en-gb
preferred label: hermitages @en-us
broader: établissement conventuel
created: 2011-09-01T00:00:00+02:00
definition: Établissement d'un ermite, situé dans un lieu isolé.
status: 1

escalier d'honneur
type: Concept
modified: 2015-02-25T12:51:37+01:00
in scheme: Thésaurus de la désignation des œuvres architecturales et des espaces aménagés
broader: escalier
created: 2011-09-01T00:00:00+02:00
definition: Escalier principal d'un édifice, présentant parfois un certain caractère monumental.
status: 1
broad match: Escalier

escalier de service
type: Concept
modified: 2015-02-25T12:53:38+01:00
in scheme: Thésaurus de la désignation des œuvres architecturales et des espaces aménagés
broader: escalier
created: 2011-09-01T00:00:00+02:00
definition: Escalier réservé à l'usage des domestiques.
status: 1

escalier indépendant
type: Concept
modified: 2015-02-25T12:55:34+01:00
in scheme: Thésaurus de la désignation des œuvres architecturales et des espaces aménagés
broader: escalier
alternative label: escalier isolé
created: 2011-09-01T00:00:00+02:00
definition: Escalier autonome, non inclus dans un édifice.
status: 1
broad match: Escalier

escalier mécanique
type: Concept
modified: 2015-02-25T12:57:14+01:00
in scheme: Thésaurus de la désignation des œuvres architecturales et des espaces aménagés
preferred label: escalators @en-us
broader: escalier
alternative label: escalier roulant
alternative label: escalator
created: 2011-09-01T00:00:00+02:00
definition: Escalier dont les marches mobiles sont entraînées mécaniquement, tout en restant en permanence dans un plan horizontal, permettant de passer sans effort d'un niveau à un autre, dans ou à l'extérieur d'un bâtiment.
status: 1

perron
type: Concept
modified: 2015-02-25T12:59:00+01:00
in scheme: Thésaurus de la désignation des œuvres architecturales et des espaces aménagés
preferred label: perrons @en-us
broader: escalier
created: 2011-09-01T00:00:00+02:00
definition: Degré extérieur donnant accès à une entrée.
status: 1

espace vert
type: Concept
modified: 2014-12-31T10:34:29+01:00
in scheme: Thésaurus de la désignation des œuvres architecturales et des espaces aménagés
broader: jardin d'agrément
created: 2011-09-01T00:00:00+02:00
related: espace libre
definition: Espace urbain ouvert, de forme indéterminée, planté de végétaux et destiné aux loisirs.
TermeAssocie: espace libre
status: 1

espace public à usage privé
type: Concept
modified: 2015-01-07T12:03:26+01:00
in scheme: Thésaurus de la désignation des œuvres architecturales et des espaces aménagés
broader: espace libre
alternative label: usoir
created: 2011-09-01T00:00:00+02:00
definition: Espace libre ménagé devant un bâtiment rural dans un village, d'usage privé mais ouvert sur la voie et de propriété publique.
status: 1

ruelle d'écoulement
type: Concept
modified: 2014-09-24T12:53:48+02:00
in scheme: Thésaurus de la désignation des œuvres architecturales et des espaces aménagés
broader: espace libre
created: 2011-09-01T00:00:00+02:00
definition: Espace libre situé entre deux bâtiments, généralement en pente, permettant l’écoulement des eaux usées et des eaux de pluie.
status: 1

jardin d'agrément
type: Concept
modified: 2014-12-31T10:33:15+01:00
in scheme: Thésaurus de la désignation des œuvres architecturales et des espaces aménagés
preferred label: pleasure gardens @en-us
narrower: espace vert
narrower: jardin d'attractions
narrower: jardin public
broader: jardin
created: 2011-09-01T00:00:00+02:00
related: promenade
definition: Jardin, public ou privé, conçu dans un but essentiellement esthétique pour le délassement des promeneurs.
TermeAssocie: promenade
status: 1

esplanade
type: Concept
modified: 2015-01-07T12:07:34+01:00
in scheme: Thésaurus de la désignation des œuvres architecturales et des espaces aménagés
broader: place
alternative label: champ de Mars
created: 2011-09-01T00:00:00+02:00
related: place d'armes
definition: Grande place dégagée et plane, souvent liée à un édifice militaire.
TermeAssocie: place d'armes
status: 1

place d'armes
type: Concept
modified: 2015-01-07T12:19:59+01:00
in scheme: Thésaurus de la désignation des œuvres architecturales et des espaces aménagés
preferred label: piazza d'armi @it
preferred label: parade grounds @en-us
preferred label: parade ground @en-gb
broader: place
created: 2011-09-01T00:00:00+02:00
related: esplanade
definition: Place, généralement de forme allongée, destinée à l'origine aux manœuvres et parades militaires.
TermeAssocie: esplanade
status: 1

estacade
type: Concept
modified: 2014-12-02T12:22:36+01:00
in scheme: Thésaurus de la désignation des œuvres architecturales et des espaces aménagés
broader: jetée
created: 2011-09-01T00:00:00+02:00
definition: Jetée à claire-voie, destinée à protéger une passe ou un avant-port de l’action des vagues. Elle est construite de pièces de charpente en bois, en métal ou en béton armé laissant entre elles de nombreux intervalles de telle sorte que la houle se brise en les traversant.
status: 1

étable à vaches
type: Concept
modified: 2014-12-30T14:19:57+01:00
in scheme: Thésaurus de la désignation des œuvres architecturales et des espaces aménagés
preferred label: cowsheds @en-us
broader: étable
alternative label: toril
alternative label: cattle barns @en-us
created: 2011-09-01T00:00:00+02:00
scope note: On distingue parfois le toril pour les taureaux de combat, la bouverie pour les bœufs, la vacherie pour les vaches.
definition: Abri pour les bovidés.
status: 1
broad match: http://data.bnf.fr/ark:/12148/cb119811001

porcherie
type: Concept
modified: 2014-12-30T14:22:04+01:00
in scheme: Thésaurus de la désignation des œuvres architecturales et des espaces aménagés
preferred label: pigsties @en-us
narrower: toit à porcs
broader: étable
created: 2011-09-01T00:00:00+02:00
definition: Étable à porcs.
status: 1

intendance
type: Concept
modified: 2014-12-05T12:22:39+01:00
in scheme: Thésaurus de la désignation des œuvres architecturales et des espaces aménagés
broader: établissement administratif
created: 2011-09-01T00:00:00+02:00
definition: Résidence de l'intendant et de ses services, chargés de la police et des finances, au sein d'une généralité, sous l'Ancien Régime.
status: 1

ministère
type: Concept
modified: 2014-10-09T12:10:31+02:00
in scheme: Thésaurus de la désignation des œuvres architecturales et des espaces aménagés
preferred label: ministries @en-us
broader: établissement administratif
created: 2011-09-01T00:00:00+02:00
definition: Édifice où sont installés les bureaux d'un ministre et de ses services. Il comprend aussi des salles de réunion, des salons de réception et l'appartement du ministre.
status: 1

préfecture
type: Concept
modified: 2014-12-05T12:25:05+01:00
in scheme: Thésaurus de la désignation des œuvres architecturales et des espaces aménagés
narrower: sous-préfecture
broader: établissement administratif
created: 2011-09-01T00:00:00+02:00
definition: Édifice où sont installés les bureaux du préfet et de ses services. Il comprend aussi des salles de réunion, des salons de réception et l'appartement du préfet.
status: 1

établissement administratif d'entreprise
type: Concept
modified: 2015-03-27T15:53:51+01:00
in scheme: Thésaurus de la désignation des œuvres architecturales et des espaces aménagés
broader: parties industrielles
alternative label: siège social
created: 2011-09-01T00:00:00+02:00
definition: Édifice, situé en dehors du périmètre du lieu de production, consacré aux fonctions administratives, juridiques et commerciales de l’entreprise.
status: 1

hangar aéronautique
type: Concept
modified: 2014-11-28T16:15:22+01:00
in scheme: Thésaurus de la désignation des œuvres architecturales et des espaces aménagés
preferred label: hangars @en-us
broader: établissement aéronautique
alternative label: remise aéronautique
created: 2011-09-01T00:00:00+02:00
definition: Local où l'on abrite et où l’on répare des aéronefs : avions, dirigeables, hélicoptères, etc.
status: 1
broad match: http://data.bnf.fr/ark:/12148/cb133194597

prieuré
type: Concept
modified: 2014-11-28T09:40:02+01:00
in scheme: Thésaurus de la désignation des œuvres architecturales et des espaces aménagés
preferred label: priorato @it
preferred label: priory @en-gb
preferred label: priories @en-us
broader: établissement conventuel
created: 2011-09-01T00:00:00+02:00
definition: Établissement monastique sous le gouvernement d'un prieur, dépendant ou non d'une abbaye.
status: 1

hôpital général
type: Concept
modified: 2015-01-02T11:25:43+01:00
in scheme: Thésaurus de la désignation des œuvres architecturales et des espaces aménagés
broader: établissement de bienfaisance
created: 2011-09-01T00:00:00+02:00
related: prison
definition: Sous l'Ancien Régime, établissement charitable destiné à l'enfermement des vieillards, femmes et enfants indigents, vagabonds, infirmes et fous.
TermeAssocie: prison
status: 1
broad match: http://vocab.getty.edu/aat/300006742

orphelinat
type: Concept
modified: 2015-01-02T11:28:54+01:00
in scheme: Thésaurus de la désignation des œuvres architecturales et des espaces aménagés
preferred label: orphanages @en-us
broader: établissement de bienfaisance
created: 2011-09-01T00:00:00+02:00
definition: Établissement de bienfaisance destiné à recevoir les orphelins, à les nourrir, les loger et leur donner une instruction primaire et professionnelle, voire à assurer leur placement dans des familles d'accueil.
status: 1

ouvroir
type: Concept
modified: 2015-01-02T11:30:11+01:00
in scheme: Thésaurus de la désignation des œuvres architecturales et des espaces aménagés
broader: établissement de bienfaisance
created: 2011-09-01T00:00:00+02:00
definition: Établissement de bienfaisance public ou privé, destiné à l'origine à donner une instruction professionnelle à des jeunes couturières sans travail. Par la suite, le terme désigne un atelier où des personnes bénévoles réalisent des ouvrages de couture, broderie, etc. pour les indigents ou des institutions religieuses (ornements).
status: 1

établissement de production audiovisuelle
type: Concept
modified: 2014-12-19T10:31:59+01:00
in scheme: Thésaurus de la désignation des œuvres architecturales et des espaces aménagés
narrower: studio d'enregistrement
broader: lieu de production médiatique
created: 2011-09-01T00:00:00+02:00
definition: Bâtiment ou ensemble de bâtiments ayant pour fonction de produire et diffuser des émissions et des spectacles de radio ou de télévision.
status: 1

studio d'enregistrement
type: Concept
modified: 2014-10-10T11:47:42+02:00
in scheme: Thésaurus de la désignation des œuvres architecturales et des espaces aménagés
preferred label: recording studios @en-us
broader: établissement de production audiovisuelle
created: 2011-09-01T00:00:00+02:00
definition: Bâtiment ou partie d'édifice comprenant l'équipement nécessaire à l'enregistrement des productions sonores.
status: 1

jeu d'arc
type: Concept
modified: 2014-10-17T15:52:20+02:00
in scheme: Thésaurus de la désignation des œuvres architecturales et des espaces aménagés
preferred label: archery ranges @en-us
broader: établissement de tir
created: 2011-09-01T00:00:00+02:00
definition: Espace aménagé pour la pratique du tir à l'arc, et comportant habituellement un bâtiment servant de lieu de réunion aux archers et un « jardin » organisé autour des « buttes », sur lesquelles sont fixées les cibles.
status: 1

établissement de vins spéciaux
type: Concept
modified: 2015-04-29T14:54:31+02:00
in scheme: Thésaurus de la désignation des œuvres architecturales et des espaces aménagés
broader: établissement vinicole
created: 2011-09-01T00:00:00+02:00
definition: Établissement où l'on produit des vins de champagne, des mousseux, etc. Il comprend généralement un cuvage, une cave de vieillissement (chai), un atelier de conditionnement, etc.
status: 1
broad match: http://vocab.getty.edu/aat/300006359
broad match: etablissements vinicoles

réseau hydraulique
type: Concept
modified: 2014-10-17T10:12:12+02:00
in scheme: Thésaurus de la désignation des œuvres architecturales et des espaces aménagés
narrower: réseau d'adduction des eaux
narrower: réseau d'égout
broader: réseau de transport
alternative label: réseau des eaux
created: 2011-09-01T00:00:00+02:00
related: établissement des eaux
definition: Réseau d'installations nécessaires à l’adduction ou à l’évacuation des eaux.
TermeAssocie: établissement des eaux
status: 1

station d'épuration
type: Concept
modified: 2014-11-28T16:32:13+01:00
in scheme: Thésaurus de la désignation des œuvres architecturales et des espaces aménagés
preferred label: water treatment plants @en-us
broader: établissement des eaux
created: 2011-09-01T00:00:00+02:00
definition: Ouvrage affecté au traitement des eaux naturelles ou des eaux usées en vue de leur réutilisation ou de leur rejet dans la nature.
status: 1

infirmerie
type: Concept
modified: 2015-01-02T11:54:53+01:00
in scheme: Thésaurus de la désignation des œuvres architecturales et des espaces aménagés
preferred label: infirmaries @en-us
broader: établissement médical
created: 2011-09-01T00:00:00+02:00
definition: Bâtiment ou local destiné à recevoir sur place les malades ou blessés d'un établissement quelconque, afin de leur donner les premiers soins et de leur assurer des visites médicales.
status: 1

étage
type: Concept
modified: 2014-10-16T11:25:17+02:00
in scheme: Thésaurus de la désignation des œuvres architecturales et des espaces aménagés
preferred label: stories @en-us
narrower: sous-sol
broader: partie ou élément commun à tous les types d'architecture et aux espaces aménagés
created: 2011-09-01T00:00:00+02:00
definition: Espace habitable délimité à l'intérieur d'un bâtiment par des divisions horizontales, planchers ou voûtes.
status: 1

sous-sol
type: Concept
modified: 2015-02-25T14:39:43+01:00
in scheme: Thésaurus de la désignation des œuvres architecturales et des espaces aménagés
preferred label: basements @en-us
broader: étage
alternative label: cave
created: 2011-09-01T00:00:00+02:00
scope note: Les sous-sols se comptent de haut en bas.
definition: Étage souterrain ou partiellement souterrain.
status: 1

obélisque
type: Concept
modified: 2015-02-24T16:37:11+01:00
in scheme: Thésaurus de la désignation des œuvres architecturales et des espaces aménagés
preferred label: obelisco @it
preferred label: obelisk @en-gb
preferred label: obelisks @en-us
broader: monument
alternative label: obélisque de jardin
created: 2011-09-01T00:00:00+02:00
scope note: L'obélisque se distingue de la pyramide par sa hauteur qui est supérieure à trois fois la moitié de sa base.
related: fabrique de jardin
definition: Monument en forme de pyramide élancée, habituellement terminé par un amortissement qui remplace la pointe trop fragile que formerait la rencontre des faces.
TermeAssocie: fabrique de jardin
status: 1

fabrique de treillage
type: Concept
modified: 2014-12-30T15:25:41+01:00
in scheme: Thésaurus de la désignation des œuvres architecturales et des espaces aménagés
narrower: tonnelle
broader: fabrique de jardin
created: 2011-09-01T00:00:00+02:00
definition: Fabrique formée d'une armature légère en bois, métal ou plastique pouvant servir de support à des plantes grimpantes.
status: 1

grotte artificielle
type: Concept
modified: 2014-12-30T15:32:01+01:00
in scheme: Thésaurus de la désignation des œuvres architecturales et des espaces aménagés
preferred label: grottoes @en-us
broader: fabrique de jardin
alternative label: grotte de jardin
created: 2011-09-01T00:00:00+02:00
definition: Fabrique dont l'espace intérieur est orné de céramique, de rocaille, de pétrifications, de congélations ou de stalactites, auxquelles sont généralement associés des jeux d'eau. Elle peut abriter un monument ou une statue.
status: 1

kiosque
type: Concept
modified: 2014-12-30T15:33:50+01:00
in scheme: Thésaurus de la désignation des œuvres architecturales et des espaces aménagés
broader: fabrique de jardin
alternative label: kiosque à musique
alternative label: kiosque de jardin
created: 2011-09-01T00:00:00+02:00
scope note: Le kiosque à musique comprend généralement une estrade surélevée.
definition: Pavillon, généralement porté par un soubassement de plan centré et ouvert de tous les côtés. On le trouve le plus souvent placé dans un jardin ou sur une place publique.
status: 1

pergola
type: Concept
modified: 2014-12-30T15:35:14+01:00
in scheme: Thésaurus de la désignation des œuvres architecturales et des espaces aménagés
preferred label: pergolas @en-us
broader: fabrique de jardin
created: 2011-09-01T00:00:00+02:00
definition: Construction formée de colonnes, piliers ou poteaux portant directement des linteaux et des solives qui constituent un couvrement ajouré, généralement revêtu de plantes grimpantes.
status: 1

portique de jardin
type: Concept
modified: 2014-12-30T15:36:33+01:00
in scheme: Thésaurus de la désignation des œuvres architecturales et des espaces aménagés
broader: fabrique de jardin
created: 2011-09-01T00:00:00+02:00
definition: Fabrique en forme de galerie formant un passage entre deux rangs d'arcades ou entre deux colonnades. Elle peut être réalisée en treillage.
status: 1
narrow match: cb12234944g

rocher artificiel
type: Concept
modified: 2014-12-30T15:37:54+01:00
in scheme: Thésaurus de la désignation des œuvres architecturales et des espaces aménagés
broader: fabrique de jardin
created: 2011-09-01T00:00:00+02:00
definition: Fabrique ou élément d'une fabrique constitué d'un ou plusieurs rochers ou de grandes pierres taillées.
status: 1

rotonde de jardin
type: Concept
modified: 2014-12-30T15:39:08+01:00
in scheme: Thésaurus de la désignation des œuvres architecturales et des espaces aménagés
preferred label: rotundas @en-us
broader: fabrique de jardin
created: 2011-09-01T00:00:00+02:00
definition: Fabrique de plan centré, circulaire, ovale ou polygonal, montant de fond et souvent couverte d'un dôme. Elle est parfois construite en treillage.
status: 1

ruine artificielle
type: Concept
modified: 2014-12-30T15:40:56+01:00
in scheme: Thésaurus de la désignation des œuvres architecturales et des espaces aménagés
preferred label: artificial ruins @en-us
broader: fabrique de jardin
alternative label: ruine
created: 2011-09-01T00:00:00+02:00
scope note: Ne pas confondre avec un édifice à l'état de ruine ; si cet édifice n'est pas identifiable, sa désignation sera édifice à fonction non identifiée et l’état de l’œuvre sera présenté dans sa description.
definition: Fabrique construite à l'imitation d'une ruine ou ancienne construction délibérément laissée à l'abandon pour constituer une fabrique.
status: 1

temple de jardin
type: Concept
modified: 2014-12-30T15:42:53+01:00
in scheme: Thésaurus de la désignation des œuvres architecturales et des espaces aménagés
broader: fabrique de jardin
created: 2011-09-01T00:00:00+02:00
definition: Fabrique de jardin adoptant une forme de temple antique.
status: 1

tente de jardin
type: Concept
modified: 2014-10-14T10:32:17+02:00
in scheme: Thésaurus de la désignation des œuvres architecturales et des espaces aménagés
broader: fabrique de jardin
created: 2011-09-01T00:00:00+02:00
definition: Fabrique fixe ou mobile, imitant la forme d'une tente d'apparat, souvent destinée à servir d'abri pour les fêtes.
status: 1

théâtre de jardin
type: Concept
modified: 2014-10-14T10:33:49+02:00
in scheme: Thésaurus de la désignation des œuvres architecturales et des espaces aménagés
narrower: théâtre de verdure
broader: fabrique de jardin
created: 2011-09-01T00:00:00+02:00
definition: Fabrique en forme de théâtre en plein air, souvent à l'antique.
status: 1

tour de jardin
type: Concept
modified: 2014-12-30T15:48:20+01:00
in scheme: Thésaurus de la désignation des œuvres architecturales et des espaces aménagés
broader: fabrique de jardin
created: 2011-09-01T00:00:00+02:00
scope note: Ne pas confondre avec colombier.
related: tour
definition: Fabrique en forme de tour isolée, caractérisée par un plan massé, carré, circulaire ou polygonal et un fort développement en hauteur.
TermeAssocie: tour
status: 1

tonnelle
type: Concept
modified: 2014-12-30T15:29:03+01:00
in scheme: Thésaurus de la désignation des œuvres architecturales et des espaces aménagés
preferred label: arbors @en-us
broader: fabrique de treillage
created: 2011-09-01T00:00:00+02:00
definition: Petite fabrique de verdure formant abri et contenant un banc, couverte en dôme ou en berceau.
status: 1

faïencerie
type: Concept
modified: 2015-01-23T17:02:22+01:00
in scheme: Thésaurus de la désignation des œuvres architecturales et des espaces aménagés
broader: usine de céramique
created: 2011-09-01T00:00:00+02:00
related: usine de fabrication de matériaux de construction
definition: Usine où l'on fabrique divers objets utilitaires ou décoratifs en faïence (glaçure à l'étain). Elle comprend généralement un entrepôt industriel, un four industriel, un magasin industriel, etc.
TermeAssocie: usine de fabrication de matériaux de construction
status: 1

faisanderie
type: Concept
modified: 2014-12-30T14:28:09+01:00
in scheme: Thésaurus de la désignation des œuvres architecturales et des espaces aménagés
broader: partie d'édifice agricole
created: 2011-09-01T00:00:00+02:00
related: volière
definition: Abri où l'on élève des faisans destinés à la chasse et souvent certains grands oiseaux d'ornement : paons, faisans dorés et argentés.
TermeAssocie: volière
status: 1

féculerie
type: Concept
modified: 2015-01-15T15:21:14+01:00
in scheme: Thésaurus de la désignation des œuvres architecturales et des espaces aménagés
broader: usine de produits agro-alimentaires
created: 2011-09-01T00:00:00+02:00
definition: Usine où l'on fabrique de la fécule (amidon) à partir des tubercules ou racines de diverses plantes. Il comprend généralement des machines à râper, des centrifugeuses, des tamis vibrants, des essoreuses, etc.
status: 1

fenderie
type: Concept
modified: 2013-04-23T00:00:00+02:00
in scheme: Thésaurus de la désignation des œuvres architecturales et des espaces aménagés
broader: usine de transformation des métaux
created: 2011-09-01T00:00:00+02:00
definition: Usine où l'on fend le fer en barres ou sous d'autres formes pour obtenir des tringles de section carrée.
status: 1

usine de transformation des métaux
type: Concept
modified: 2015-04-30T15:01:19+02:00
in scheme: Thésaurus de la désignation des œuvres architecturales et des espaces aménagés
narrower: fenderie
narrower: fonderie
narrower: grosse forge
narrower: laminoir
narrower: bâtiment du martinet
narrower: platinerie
narrower: tréfilerie
broader: usine métallurgique
created: 2011-09-01T00:00:00+02:00
definition: Usine où l'on fait subir aux métaux, ferreux ou non ferreux, une ou plusieurs transformations (fonte, forgeage, laminage, tréfilage, etc.).
status: 1

fenil
type: Concept
modified: 2014-12-30T14:29:18+01:00
in scheme: Thésaurus de la désignation des œuvres architecturales et des espaces aménagés
preferred label: haylofts @en-us
broader: partie d'édifice agricole
created: 2011-09-01T00:00:00+02:00
definition: Local où l'on abrite le foin.
status: 1

grange monastique
type: Concept
modified: 2014-12-30T13:49:45+01:00
in scheme: Thésaurus de la désignation des œuvres architecturales et des espaces aménagés
preferred label: granges (farms) @en-us
broader: ferme
created: 2011-09-01T00:00:00+02:00
scope note: Il convient de préciser l'ordre religieux en désignation.
definition: Exploitation agricole dépendant d'une abbaye ou d'un prieuré, dont elle met les terres en valeur.
status: 1
narrow match: Grange cistercienne

filature
type: Concept
modified: 2015-04-30T15:32:03+02:00
in scheme: Thésaurus de la désignation des œuvres architecturales et des espaces aménagés
narrower: moulinerie
broader: usine textile
created: 2011-09-01T00:00:00+02:00
scope note: Ne pas confondre avec moulinerie.
definition: Usine où l'on transforme en fils différentes matières textiles : coton, laine, lin, chanvre, jute, etc. Elle fonctionne avec des bancs à broches, des continus à filer et comprend généralement un entrepôt industriel, une chaufferie, une salle des machines, etc.
status: 1

moulinerie
type: Concept
modified: 2015-04-30T15:33:43+02:00
in scheme: Thésaurus de la désignation des œuvres architecturales et des espaces aménagés
broader: filature
created: 2011-09-01T00:00:00+02:00
scope note: Ne pas confondre avec filature.
related: moulin
definition: Usine où l'on mouline le fil de soie grège en le régularisant et en le tordant sur des machines à torsader (dites moulins) munies de fuseaux ou de bobines. Elle comprend généralement un bief de dérivation, un bâtiment d'eau, etc.
TermeAssocie: moulin
status: 1
broad match: Filature textile

fondations et sol
type: Concept
modified: 2015-02-25T10:22:43+01:00
in scheme: Thésaurus de la désignation des œuvres architecturales et des espaces aménagés
preferred label: foundations and floors @en-us
narrower: revêtement de sol
broader: partie ou élément commun à tous les types d'architecture et aux espaces aménagés
created: 2011-09-01T00:00:00+02:00
definition: Ouvrage en sous-sol soutenant une construction ou formant le sol de celle-ci.
status: 1

revêtement de sol
type: Concept
modified: 2015-02-25T10:23:33+01:00
in scheme: Thésaurus de la désignation des œuvres architecturales et des espaces aménagés
preferred label: floor coverings @en-us
narrower: parquet
narrower: pavement
broader: fondations et sol
created: 2011-09-01T00:00:00+02:00
scope note: Voir aussi le Thesaurus des objets mobiliers.
definition: Le terme désigne ce qui recouvre le sol, qu'il s'agisse de parquet, de pavement ou de toute autre mise en œuvre.
status: 1

fonderie
type: Concept
modified: 2015-03-16T15:28:20+01:00
in scheme: Thésaurus de la désignation des œuvres architecturales et des espaces aménagés
broader: usine de transformation des métaux
created: 2011-09-01T00:00:00+02:00
definition: Usine métallurgique où l'on fond les métaux et leurs alliages que l'on coule dans des lingotières ou dans des moules. Elle fonctionne généralement avec des fours industriels, des cubilots, etc.
status: 1

grosse forge
type: Concept
modified: 2015-03-16T15:52:56+01:00
in scheme: Thésaurus de la désignation des œuvres architecturales et des espaces aménagés
narrower: usine d'emboutissage
narrower: usine d'estampage
broader: usine de transformation des métaux
created: 2011-09-01T00:00:00+02:00
related: forge artisanale
definition: Usine où l'on façonne les métaux ou les alliages par martelage avec marteau-pilon, presse, mouton, etc.
TermeAssocie: forge artisanale
status: 1

forge anglaise
type: Concept
modified: 2015-04-30T14:51:48+02:00
in scheme: Thésaurus de la désignation des œuvres architecturales et des espaces aménagés
broader: usine de fabrication des métaux
created: 2011-09-01T00:00:00+02:00
definition: Usine où l'on fabrique du fer et comprenant généralement un haut fourneau, un atelier de puddlage et un laminoir.
status: 1
broad match: cb11948058x

forge catalane
type: Concept
modified: 2015-04-30T14:55:59+02:00
in scheme: Thésaurus de la désignation des œuvres architecturales et des espaces aménagés
broader: usine de fabrication des métaux
created: 2011-09-01T00:00:00+02:00
definition: Usine où l'on fabrique directement du fer à partir du minerai sans passer par l'intermédiaire de la fonte, dans un foyer à soufflerie hydraulique.
status: 1

ligne fortifiée
type: Concept
modified: 2015-01-05T12:13:19+01:00
in scheme: Thésaurus de la désignation des œuvres architecturales et des espaces aménagés
preferred label: coastal fortifications & field fortifications @en-us
broader: fortification
created: 2011-09-01T00:00:00+02:00
definition: Ensemble constitué par des ouvrages fortifiés disposés sur l'alignement d'un front ou sur une ligne frontière (ex. : la ligne Maginot, le mur de l'Atlantique).
status: 1
broad match: cb11931504g

oppidum
type: Concept
modified: 2015-01-05T12:14:48+01:00
in scheme: Thésaurus de la désignation des œuvres architecturales et des espaces aménagés
preferred label: oppida @en-us
broader: fortification
created: 2011-09-01T00:00:00+02:00
definition: Agglomération protohistorique fortifiée située généralement sur une hauteur.
status: 1

place forte
type: Concept
modified: 2015-01-05T12:17:49+01:00
in scheme: Thésaurus de la désignation des œuvres architecturales et des espaces aménagés
broader: fortification
created: 2011-09-01T00:00:00+02:00
definition: À l'époque moderne, agglomération entourée par des fortifications. Celles-ci définissent une zone de servitude.
status: 1

forum
type: Concept
modified: 2014-10-17T15:00:25+02:00
in scheme: Thésaurus de la désignation des œuvres architecturales et des espaces aménagés
preferred label: foro @it
preferred label: forums (open spaces) @en-us
broader: quartier
created: 2011-09-01T00:00:00+02:00
definition: Dans l'Antiquité romaine, place ordonnancée réunissant des édifices juridiques, religieux et commerciaux, parfois en plusieurs espaces libres publics connexes, entourée de portiques, le tout formant le centre civique d'une agglomération.
status: 1

four
type: Concept
modified: 2015-02-25T14:43:42+01:00
in scheme: Thésaurus de la désignation des œuvres architecturales et des espaces aménagés
preferred label: ovens (baking equipment) @en-us
narrower: four à chanvre
narrower: four à pain
narrower: four à prunes
broader: partie ou élément commun à tous les types d'architecture et aux espaces aménagés
created: 2011-09-01T00:00:00+02:00
definition: Ouvrage dans lequel on fait cuire le pain, la pâtisserie, ou dans lequel on fait subir des transformations physiques ou chimiques à un matériau sous l'effet de la chaleur.
status: 1

four à chanvre
type: Concept
modified: 2015-02-25T15:39:19+01:00
in scheme: Thésaurus de la désignation des œuvres architecturales et des espaces aménagés
preferred label: hemp ovens @en-us
broader: four
created: 2011-09-01T00:00:00+02:00
scope note: Ne pas confondre avec séchoir à chanvre.
definition: Four dans lequel on fait chauffer le chanvre après le rouissage.
status: 1

four à pain
type: Concept
modified: 2015-02-25T16:06:51+01:00
in scheme: Thésaurus de la désignation des œuvres architecturales et des espaces aménagés
preferred label: bake ovens @en-us
broader: four
created: 2011-09-01T00:00:00+02:00
scope note: Ne pas confondre avec fournil.
related: fournil
definition: Ouvrage dans lequel on fait cuire le pain, la pâtisserie.
TermeAssocie: fournil
status: 1

four à prunes
type: Concept
modified: 2015-02-25T16:07:33+01:00
in scheme: Thésaurus de la désignation des œuvres architecturales et des espaces aménagés
broader: four
created: 2011-09-01T00:00:00+02:00
definition: Ouvrage artisanal destiné à la transformation des prunes en pruneaux.
status: 1

four à chaux
type: Concept
modified: 2015-03-30T16:22:43+02:00
in scheme: Thésaurus de la désignation des œuvres architecturales et des espaces aménagés
broader: four industriel
created: 2011-09-01T00:00:00+02:00
related: usine de chaux
definition: Ouvrage dans lequel s’opère la calcination de la pierre à chaux.
TermeAssocie: usine de chaux
status: 1

usine de chaux
type: Concept
modified: 2015-04-28T15:38:21+02:00
in scheme: Thésaurus de la désignation des œuvres architecturales et des espaces aménagés
broader: usine de fabrication de matériaux de construction
created: 2011-09-01T00:00:00+02:00
related: four à chaux
definition: Usine où l'on calcine la pierre à chaux, dans un ou plusieurs fours industriels spéciaux, généralement en maçonnerie. Elle peut comprendre également une rampe d'accès, un pont-bascule, un atelier de conditionnement, une aire de concassage, etc.
TermeAssocie: four à chaux
status: 1

four industriel
type: Concept
modified: 2015-03-30T15:44:44+02:00
in scheme: Thésaurus de la désignation des œuvres architecturales et des espaces aménagés
narrower: four à chaux
broader: parties industrielles
created: 2011-09-01T00:00:00+02:00
definition: Ouvrage dans lequel s’opère par modifications de température le séchage, la fusion, la cuisson, la calcination, le changement d’état, etc. de diverses matières.
status: 1

séchoir à fromages
type: Concept
modified: 2015-02-26T11:52:58+01:00
in scheme: Thésaurus de la désignation des œuvres architecturales et des espaces aménagés
narrower: pièce d'affinage
broader: séchoir
created: 2011-09-01T00:00:00+02:00
related: fromagerie
related: fromagerie industrielle
definition: Bâtiment spécialement aménagé pour l'achèvement de la maturation des fromages.
TermeAssocie: fromagerie
TermeAssocie: fromagerie industrielle
status: 1

fromagerie industrielle
type: Concept
modified: 2015-04-29T14:56:27+02:00
in scheme: Thésaurus de la désignation des œuvres architecturales et des espaces aménagés
broader: usine de produits agro-alimentaires
created: 2011-09-01T00:00:00+02:00
related: fromagerie
related: séchoir à fromages
definition: Usine où l'on fabrique des fromages et comprenant généralement un laboratoire, une chaufferie, une pièce d'affinage, etc.
TermeAssocie: fromagerie
TermeAssocie: séchoir à fromages
status: 1

front bâti
type: Concept
modified: 2015-01-08T10:34:31+01:00
in scheme: Thésaurus de la désignation des œuvres architecturales et des espaces aménagés
preferred label: waterfronts @en-us
broader: secteur urbain
alternative label: front de mer
created: 2011-09-01T00:00:00+02:00
definition: Ensemble urbain formé de bâtiments, au même alignement et de gabarits voisins, formant une façade plus ou moins continue ; il est souvent disposé face à un espace libre et accompagné d'une promenade.
status: 1
narrow match: http://vocab.getty.edu/aat/300008340

funiculaire
type: Concept
modified: 2014-12-02T14:53:57+01:00
in scheme: Thésaurus de la désignation des œuvres architecturales et des espaces aménagés
preferred label: funicular railways @en-us
broader: remontée mécanique
created: 2011-09-01T00:00:00+02:00
scope note: Ne pas confondre avec chemin de fer à crémaillère.
definition: Remontée mécanique équipée de véhicules circulant sur des rails en pente et dont la traction est assurée par un câble pour s'affranchir de la déclivité du terrain. Il est généralement utilisé comme transport en commun.
status: 1

remontée mécanique
type: Concept
modified: 2014-10-16T15:35:30+02:00
in scheme: Thésaurus de la désignation des œuvres architecturales et des espaces aménagés
preferred label: Cable railroads @en-us
narrower: funiculaire
narrower: téléphérique
broader: ouvrage d'art
alternative label: remonte-pente
created: 2011-09-01T00:00:00+02:00
related: réseau de transport par câble
definition: Installation permettant, en s’affranchissant de la déclivité du terrain, le transport des voyageurs ou des marchandises par véhicule tracté par câble (siège, nacelle, cabine, benne, etc.).
TermeAssocie: réseau de transport par câble
status: 1

galerie
type: Concept
modified: 2015-02-26T11:06:42+01:00
in scheme: Thésaurus de la désignation des œuvres architecturales et des espaces aménagés
preferred label: long galleries @en-us
narrower: galerie fermée
narrower: galerie ouverte
broader: pièce
created: 2011-09-01T00:00:00+02:00
scope note: Ne pas confondre avec coursière, ni avec couloir, ni avec vaisseau.
definition: Espace plus long que large, délimité dans un niveau par les divisions des murs, des cloisons, des alignements de supports verticaux et ayant une fonction de passage ou de représentation.
status: 1

galerie fermée
type: Concept
modified: 2015-02-26T11:07:57+01:00
in scheme: Thésaurus de la désignation des œuvres architecturales et des espaces aménagés
broader: galerie
created: 2011-09-01T00:00:00+02:00
definition: Galerie dont les ouvertures sur l'extérieur sont des fenêtres.
status: 1
broad match: cb12067143x
broad match: http://vocab.getty.edu/aat/300075767
broad match: Galerie (architecture)

galerie ouverte
type: Concept
modified: 2015-02-26T11:09:31+01:00
in scheme: Thésaurus de la désignation des œuvres architecturales et des espaces aménagés
narrower: portique
broader: galerie
created: 2011-09-01T00:00:00+02:00
scope note: Ne pas confondre avec loggia.
definition: Galerie dont les baies sur l'extérieur n'ont pas de fermeture en menuiserie.
status: 1
broad match: cb12067143x

galerie d'art
type: Concept
modified: 2014-10-10T10:57:01+02:00
in scheme: Thésaurus de la désignation des œuvres architecturales et des espaces aménagés
preferred label: art galleries @en-us
broader: lieu d'exposition
created: 2011-09-01T00:00:00+02:00
definition: Édifice ou partie d'édifice destiné à la présentation publique et à la vente d’œuvres d'art.
status: 1

galerie maçonnée
type: Concept
modified: 2015-03-30T16:58:40+02:00
in scheme: Thésaurus de la désignation des œuvres architecturales et des espaces aménagés
broader: parties industrielles
created: 2011-09-01T00:00:00+02:00
scope note: Ne pas confondre avec galerie technique.
definition: Conduit souterrain en maçonnerie permettant l'exploitation d'un gisement : mine, carrière souterraine, etc.
status: 1

galerie marchande
type: Concept
modified: 2014-12-05T10:13:57+01:00
in scheme: Thésaurus de la désignation des œuvres architecturales et des espaces aménagés
preferred label: shopping arcades @en-us
broader: magasin de commerce
created: 2011-09-01T00:00:00+02:00
related: passage couvert
definition: Édifice formé d'un ou plusieurs passages intérieurs, bordé de boutiques.
TermeAssocie: passage couvert
status: 1

passage couvert
type: Concept
modified: 2015-01-07T13:13:00+01:00
in scheme: Thésaurus de la désignation des œuvres architecturales et des espaces aménagés
preferred label: sottopassaggio @it
preferred label: covered way @en-gb
preferred label: Covered walkways @en-us
broader: passage
created: 2011-09-01T00:00:00+02:00
related: galerie marchande
definition: Voie publique ou privée, généralement ordonnancée, traversant un îlot et passant sous un ou plusieurs étages des bâtiments sur tout ou partie de son parcours, notamment à ses extrémités ; sur le reste du parcours, le passage couvert est surmonté d'une verrière ; il est généralement bordé de boutiques.
TermeAssocie: galerie marchande
status: 1

portique
type: Concept
modified: 2015-02-26T11:12:16+01:00
in scheme: Thésaurus de la désignation des œuvres architecturales et des espaces aménagés
preferred label: porticoes @en-us
broader: galerie ouverte
created: 2011-09-01T00:00:00+02:00
scope note: Ne pas confondre avec porche, ni avec colonnade ou portique de jardin.
definition: Galerie ouverte située en rez-de-chaussée.
status: 1

usine de ganterie
type: Concept
modified: 2015-04-28T14:37:03+02:00
in scheme: Thésaurus de la désignation des œuvres architecturales et des espaces aménagés
broader: usine d'habillement
created: 2011-09-01T00:00:00+02:00
related: mégisserie
definition: Usine où l'on fabrique des gants de cuir découpés au gabarit dans des peaux (mégies ou chamoisées) assemblées par couture ; les gants en fil (laine, coton, etc.) sont fabriqués sur des machines à tricoter. Elle comprend généralement un bureau, un entrepôt industriel , un magasin industriel, etc.
TermeAssocie: mégisserie
status: 1

mégisserie
type: Concept
modified: 2015-04-28T16:37:21+02:00
in scheme: Thésaurus de la désignation des œuvres architecturales et des espaces aménagés
broader: tannerie
created: 2011-09-01T00:00:00+02:00
related: usine de ganterie
definition: Usine où l'on prépare, par tannage à l'alun, des peaux très souples, le plus souvent destinées à la ganterie. Elle comprend généralement un entrepôt industriel, une pièce de séchage, etc.
TermeAssocie: usine de ganterie
status: 1

usine d'habillement
type: Concept
modified: 2015-01-22T11:34:29+01:00
in scheme: Thésaurus de la désignation des œuvres architecturales et des espaces aménagés
narrower: usine de ganterie
narrower: usine de boutons
narrower: usine de chapellerie
narrower: usine de chaussures
narrower: usine de confection
narrower: usine de parapluies et cannes
broader: usine
created: 2011-09-01T00:00:00+02:00
definition: Usine où l'on fabrique des vêtements et des accessoires tels que chaussures, chapeaux, gants, parapluies, etc.
status: 1

garage
type: Concept
modified: 2014-12-31T15:57:24+01:00
in scheme: Thésaurus de la désignation des œuvres architecturales et des espaces aménagés
preferred label: parking garages @en-us
broader: remise
alternative label: remise à automobiles
created: 2011-09-01T00:00:00+02:00
scope note: Ne pas confondre avec garage de réparation automobile.
related: stationnement
definition: Partie d'une demeure où l'on remise les automobiles, motocycles et bicyclettes.
TermeAssocie: stationnement
status: 1
broad match: cb15582327q

stationnement
type: Concept
modified: 2015-02-26T12:13:34+01:00
in scheme: Thésaurus de la désignation des œuvres architecturales et des espaces aménagés
preferred label: parking lots @en-us
broader: partie ou élément commun à tous les types d'architecture et aux espaces aménagés
alternative label: parking
alternative label: parc de stationnement
created: 2011-09-01T00:00:00+02:00
related: garage
definition: Aménagement, édifice ou partie d'édifice, en sous-sol, en surface ou hors-sol, réservé au stationnement des véhicules.
TermeAssocie: garage
status: 1

réseau ferré
type: Concept
modified: 2014-10-17T10:10:26+02:00
in scheme: Thésaurus de la désignation des œuvres architecturales et des espaces aménagés
preferred label: railroads (infrastructure) @en-us
narrower: réseau de tramway
narrower: réseau métropolitain
broader: réseau de transport
created: 2011-09-01T00:00:00+02:00
related: gare
related: voie ferrée
definition: Réseau d'équipements permettant le déplacement des personnes et des biens par voie ferrée, avec ses ouvrages d'art, ses stations, etc.
TermeAssocie: gare
TermeAssocie: voie ferrée
status: 1

gare de transbordement
type: Concept
modified: 2014-09-23T15:36:42+02:00
in scheme: Thésaurus de la désignation des œuvres architecturales et des espaces aménagés
broader: gare
created: 2011-09-01T00:00:00+02:00
definition: Gare commune à des réseaux ferroviaires ou à des lignes utilisant des matériels roulants de types différents (réseau à voie normale et réseau à voie métrique, etc.).
status: 1

halte ferroviaire
type: Concept
modified: 2014-10-16T14:04:36+02:00
in scheme: Thésaurus de la désignation des œuvres architecturales et des espaces aménagés
broader: gare
created: 2011-09-01T00:00:00+02:00
definition: Point d'arrêt dépourvu de bâtiment de voyageurs et de présence permanente de personnel ; les infrastructures ferroviaires y sont généralement très réduites.
status: 1
broad match: http://data.bnf.fr/ark:/12148/cb119470471
broad match: http://vocab.getty.edu/aat/300007783

station de métro
type: Concept
modified: 2014-11-28T16:59:09+01:00
in scheme: Thésaurus de la désignation des œuvres architecturales et des espaces aménagés
preferred label: subway stations @en-us
broader: gare
created: 2011-09-01T00:00:00+02:00
definition: Édifice le plus souvent souterrain regroupant les installations nécessaires à l'embarquement et au débarquement des passagers du métropolitain.
status: 1

station de tramway
type: Concept
modified: 2014-10-16T14:06:57+02:00
in scheme: Thésaurus de la désignation des œuvres architecturales et des espaces aménagés
preferred label: streetcar stations @en-us
broader: gare
created: 2011-09-01T00:00:00+02:00
definition: Édicule ou édifice destiné à servir d'abri aux voyageurs attendant un tramway.
status: 1

gare maritime
type: Concept
modified: 2014-11-18T12:58:40+01:00
in scheme: Thésaurus de la désignation des œuvres architecturales et des espaces aménagés
preferred label: marine terminals @en-us
broader: plate-forme multimodale
created: 2011-09-01T00:00:00+02:00
scope note: Ne pas confondre avec embarcadère.
definition: Plate-forme sur le quai d'accostage des paquebots et des navires transbordeurs assurant la coordination du navire et du rail.
status: 1
broad match: Gare

garenne
type: Concept
modified: 2014-10-14T12:02:53+02:00
in scheme: Thésaurus de la désignation des œuvres architecturales et des espaces aménagés
preferred label: rabbit warrens @en-us
broader: parc
created: 2011-09-01T00:00:00+02:00
definition: Parc d’utilité constituant une réserve formée d'une étendue boisée entourée de clôtures ou de fossés, destinée à la reproduction et à la chasse des lapins.
status: 1

parc
type: Concept
modified: 2014-12-31T11:10:01+01:00
in scheme: Thésaurus de la désignation des œuvres architecturales et des espaces aménagés
preferred label: parks @en-us
narrower: garenne
narrower: parc de chasse
narrower: petit parc
broader: jardin
created: 2011-09-01T00:00:00+02:00
definition: Jardin clos de grande superficie, public ou privé, en général d'agrément, présentant un important couvert. On nomme parc ouvert celui dont les limites ne sont pas closes.
status: 1

gazomètre
type: Concept
modified: 2015-04-09T11:37:59+02:00
in scheme: Thésaurus de la désignation des œuvres architecturales et des espaces aménagés
broader: réservoir industriel
created: 2011-09-01T00:00:00+02:00
definition: Réservoir industriel dans lequel le gaz est emmagasiné à volume variable et sous pression constante.
status: 1

réservoir industriel
type: Concept
modified: 2015-04-09T11:23:52+02:00
in scheme: Thésaurus de la désignation des œuvres architecturales et des espaces aménagés
narrower: gazomètre
broader: parties industrielles
created: 2011-09-01T00:00:00+02:00
scope note: Ne pas confondre avec silo.
definition: Bassin, cavité ou ouvrage dans lequel on stocke liquides, gaz, etc.
status: 1

réseau du génie civil
type: Concept
modified: 2013-04-23T00:00:00+02:00
in scheme: Thésaurus de la désignation des œuvres architecturales et des espaces aménagés
narrower: réseau d'équipement urbain
narrower: réseau de communication
narrower: réseau de transport
broader: génie civil
created: 2011-09-01T00:00:00+02:00
definition: Ensemble des édifices, des ouvrages d'ingénierie civile et de leurs connexions permettant de desservir et d’alimenter une même unité territoriale.
status: 1

glacerie
type: Concept
modified: 2015-04-30T16:06:07+02:00
in scheme: Thésaurus de la désignation des œuvres architecturales et des espaces aménagés
broader: usine de verre plat
created: 2011-09-01T00:00:00+02:00
definition: Usine où l'on fabrique des glaces de verre et des miroirs, par coulée, laminage, recuisson et traitement de surface. Elle comprend généralement un four industriel, un entrepôt industriel, etc.
status: 1

usine de verre plat
type: Concept
modified: 2015-04-23T10:58:44+02:00
in scheme: Thésaurus de la désignation des œuvres architecturales et des espaces aménagés
narrower: glacerie
broader: verrerie
created: 2011-09-01T00:00:00+02:00
definition: Usine où l'on fabrique du verre à vitre par le procédé d'étirage. Elle comprend généralement un four industriel, un magasin industriel, etc.
status: 1

goulette de jardin
type: Concept
modified: 2014-09-30T15:16:02+02:00
in scheme: Thésaurus de la désignation des œuvres architecturales et des espaces aménagés
preferred label: water stairs @en-us
broader: pièce d'eau
created: 2011-09-01T00:00:00+02:00
definition: Petit canal maçonné, en pente douce, généralement coupé, de distance en distance, par des chutes d'eau architecturées de faible hauteur et des petits bassins d'ornement pouvant être accompagnés de jeux d'eau.
status: 1

grand ensemble
type: Concept
modified: 2015-01-09T11:13:54+01:00
in scheme: Thésaurus de la désignation des œuvres architecturales et des espaces aménagés
broader: secteur urbain concerté
alternative label: zone d'urbanisation prioritaire
alternative label: cité
alternative label: zone d'aménagement concerté
created: 2011-09-01T00:00:00+02:00
scope note: N'étant pas subdivisé en lots, le grand ensemble ne peut pas constituer un lotissement.
definition: Aménagement urbain comportant plusieurs bâtiments isolés pouvant prendre la forme de barres ou de tours, et éventuellement un ou plusieurs ensembles d'habitats individuels et des équipements divers.
status: 1

secteur urbain concerté
type: Concept
modified: 2015-01-09T12:11:26+01:00
in scheme: Thésaurus de la désignation des œuvres architecturales et des espaces aménagés
preferred label: comparto edilizio @it
narrower: lotissement
narrower: grand ensemble
broader: secteur urbain
created: 2011-09-01T00:00:00+02:00
definition: Partie d'une agglomération constituée par un ensemble concerté d'édifices, d’éléments de voirie et de différents équipements.
status: 1

grand magasin
type: Concept
modified: 2014-12-05T10:16:26+01:00
in scheme: Thésaurus de la désignation des œuvres architecturales et des espaces aménagés
preferred label: department stores @en-us
broader: magasin de commerce
created: 2011-09-01T00:00:00+02:00
definition: Grand établissement de vente comportant de nombreux rayons spécialisés.
status: 1

grange
type: Concept
modified: 2014-12-30T14:32:07+01:00
in scheme: Thésaurus de la désignation des œuvres architecturales et des espaces aménagés
preferred label: barns @en-us
broader: partie d'édifice agricole
created: 2011-09-01T00:00:00+02:00
related: grange aux dîmes
definition: Bâtiment où l'on abrite la récolte de foin, de paille, etc.
TermeAssocie: grange aux dîmes
status: 1

usine d'emboutissage
type: Concept
modified: 2015-04-30T15:20:37+02:00
in scheme: Thésaurus de la désignation des œuvres architecturales et des espaces aménagés
broader: grosse forge
created: 2011-09-01T00:00:00+02:00
definition: Usine où l'on forme à chaud ou à froid une mince plaque de métal, ou flan, par serrage dans une forme en acier ou en fonte.
status: 1

usine d'estampage
type: Concept
modified: 2015-03-17T14:22:49+01:00
in scheme: Thésaurus de la désignation des œuvres architecturales et des espaces aménagés
broader: grosse forge
created: 2011-09-01T00:00:00+02:00
definition: Usine où l'on façonne à froid des pièces de métal à l'aide de matrices afin de leur donner des formes et des dimensions déterminées. Elle fonctionne généralement avec des presses verticales, des balanciers à friction, etc.
status: 1

palais épiscopal
type: Concept
modified: 2014-12-31T12:47:02+01:00
in scheme: Thésaurus de la désignation des œuvres architecturales et des espaces aménagés
broader: palais
alternative label: archevêché
alternative label: évêché
created: 2011-09-01T00:00:00+02:00
related: groupe épiscopal
definition: Résidence de l'évêque ou de l'archevêque, et de leurs services.
TermeAssocie: groupe épiscopal
status: 1

gué
type: Concept
modified: 2014-10-16T14:50:21+02:00
in scheme: Thésaurus de la désignation des œuvres architecturales et des espaces aménagés
preferred label: fords @en-us
broader: ouvrage d'art
alternative label: gué carrossable
alternative label: chaussée de rivière
created: 2011-09-01T00:00:00+02:00
definition: Aménagement d'un cours d'eau assez peu profond permettant la traversée à pied, en voiture, etc.
status: 1

hangar
type: Concept
modified: 2015-02-25T16:09:59+01:00
in scheme: Thésaurus de la désignation des œuvres architecturales et des espaces aménagés
broader: partie ou élément commun à tous les types d'architecture et aux espaces aménagés
created: 2011-09-01T00:00:00+02:00
scope note: Ne pas confondre avec remise agricole.
definition: Abri ouvert à usages divers formé seulement d'un toit et de supports verticaux.
status: 1

haut fourneau
type: Concept
modified: 2015-03-16T10:49:54+01:00
in scheme: Thésaurus de la désignation des œuvres architecturales et des espaces aménagés
broader: usine de fabrication des métaux
created: 2011-09-01T00:00:00+02:00
scope note: Voir aussi le Thesaurus des objets mobiliers (machine liée à la production industrielle).
definition: Usine où l'on effectue la réduction et la fusion des minerais de fer en vue d'obtenir de la fonte et comprenant généralement un four industriel, un poste de chargement, des cowpers, un bâtiment de coulée, etc. L’équipement donne ici son nom au bâtiment de production.
status: 1

hôpital d'isolement
type: Concept
modified: 2014-10-20T10:06:14+02:00
in scheme: Thésaurus de la désignation des œuvres architecturales et des espaces aménagés
narrower: hôpital marin
narrower: lazaret
narrower: maladrerie
narrower: préventorium
narrower: sanatorium
broader: hôpital
created: 2011-09-01T00:00:00+02:00
definition: Établissement toujours établi à l'écart des agglomérations et destiné à la relégation des personnes atteintes d'une maladie réputée transmissible ou présentant le risque de développer pareille maladie (le soin peut en être absent).
status: 1
broad match: http://vocab.getty.edu/aat/300004543

maternité
type: Concept
modified: 2015-01-02T12:16:46+01:00
in scheme: Thésaurus de la désignation des œuvres architecturales et des espaces aménagés
preferred label: maternity hospitals @en-us
broader: hôpital
created: 2011-09-01T00:00:00+02:00
definition: Établissement hospitalier destiné aux femmes en couches.
status: 1

hôpital marin
type: Concept
modified: 2015-01-02T12:03:04+01:00
in scheme: Thésaurus de la désignation des œuvres architecturales et des espaces aménagés
broader: hôpital d'isolement
created: 2011-09-01T00:00:00+02:00
definition: Établissement situé en bord de mer destiné à accueillir des personnes, et plus particulièrement des enfants, atteintes de scrofule, de lymphatisme, d'anémie ou de rachitisme pour les faire bénéficier de bains de mer et de cures d'air et de soleil.
status: 1

lazaret
type: Concept
modified: 2015-01-02T12:04:45+01:00
in scheme: Thésaurus de la désignation des œuvres architecturales et des espaces aménagés
preferred label: lazarettos @en-us
broader: hôpital d'isolement
created: 2011-09-01T00:00:00+02:00
definition: Établissement de quarantaine isolé et aménagé pour recevoir des malades, les équipages de bateaux suspects de contagion, ainsi que des marchandises.
status: 1

maladrerie
type: Concept
modified: 2015-01-02T12:07:12+01:00
in scheme: Thésaurus de la désignation des œuvres architecturales et des espaces aménagés
preferred label: leprosaria @en-us
broader: hôpital d'isolement
alternative label: léproserie
created: 2011-09-01T00:00:00+02:00
definition: Établissement hospitalier médiéval destiné à isoler les lépreux.
status: 1

préventorium
type: Concept
modified: 2015-01-02T12:10:21+01:00
in scheme: Thésaurus de la désignation des œuvres architecturales et des espaces aménagés
broader: hôpital d'isolement
alternative label: aérium
created: 2011-09-01T00:00:00+02:00
definition: Établissement hospitalier préventif, situé dans un milieu réputé salubre, à la montagne ou à la campagne, et destiné à traiter par la cure hygiéno-diététique les enfants et adolescents atteints de tuberculose sous une forme en apparence bénigne et surtout non contagieuse.
status: 1

sanatorium
type: Concept
modified: 2015-01-02T12:13:56+01:00
in scheme: Thésaurus de la désignation des œuvres architecturales et des espaces aménagés
preferred label: sanatoriums @en-us
broader: hôpital d'isolement
created: 2011-09-01T00:00:00+02:00
definition: Établissement hospitalier curatif, situé dans un milieu réputé salubre, au bord de la mer, à la montagne, à la campagne, destiné aux phtisiques ayant besoin d'une cure d'air. Il comporte des galeries de cure extérieures pour y installer les patients sur des chaises longues.
status: 1

hôtel de ville
type: Concept
modified: 2014-12-12T10:42:30+01:00
in scheme: Thésaurus de la désignation des œuvres architecturales et des espaces aménagés
preferred label: city halls @en-us
broader: mairie
created: 2011-09-01T00:00:00+02:00
scope note: L'hôtel de ville se différencie de la mairie notamment par un nombre plus important de pièces aux fonctions différenciées.
definition: Dans une agglomération importante, édifice ou partie d'édifice présentant généralement un caractère monumental (escalier, etc.), où se réunissent les magistrats municipaux et où sont groupés tout ou partie des services administratifs d'une commune.
status: 1

hourd
type: Concept
modified: 2015-01-05T12:55:12+01:00
in scheme: Thésaurus de la désignation des œuvres architecturales et des espaces aménagés
broader: ouvrage fortifié
created: 2011-09-01T00:00:00+02:00
definition: Coursière en bois formant surplomb en couronnement d’une courtine, d’une tour, de l’ensemble de l’enceinte pour battre le pied de la muraille.
status: 1

huilerie
type: Concept
modified: 2015-01-19T12:24:29+01:00
in scheme: Thésaurus de la désignation des œuvres architecturales et des espaces aménagés
broader: usine de produits agro-alimentaires
created: 2011-09-01T00:00:00+02:00
related: moulin à huile
definition: Usine où l'on fabrique de l'huile végétale ou animale, soit par des procédés mécaniques mettant en jeu de très fortes pressions associées ou non à la température, soit par pressage, extraction par solvant et raffinage. Elle comprend généralement un bureau, un silo, un atelier de conditionnement, etc.
TermeAssocie: moulin à huile
status: 1

moulin à huile
type: Concept
modified: 2015-01-20T11:40:21+01:00
in scheme: Thésaurus de la désignation des œuvres architecturales et des espaces aménagés
broader: usine de produits agro-alimentaires
created: 2011-09-01T00:00:00+02:00
related: huilerie
related: moulin
related: pressoir à huile
definition: Usine où l’on presse différentes substances (olives, noix, graines, etc.) dans le but d'obtenir de l'huile. Elle comprend généralement un bief de dérivation, un bâtiment d'eau, un magasin industriel, etc.
TermeAssocie: huilerie
TermeAssocie: moulin
TermeAssocie: pressoir à huile
status: 1

hypermarché
type: Concept
modified: 2014-10-09T11:33:50+02:00
in scheme: Thésaurus de la désignation des œuvres architecturales et des espaces aménagés
broader: magasin de commerce
created: 2011-09-01T00:00:00+02:00
definition: Magasin de plus de 2500 m2 de surface vendant en libre-service des denrées alimentaires et divers autres produits, et comportant des aires de stationnement.
status: 1
broad match: cb11937759r
broad match: http://vocab.getty.edu/aat/300005246

îlot
type: Concept
modified: 2015-01-08T10:36:54+01:00
in scheme: Thésaurus de la désignation des œuvres architecturales et des espaces aménagés
preferred label: isolato @it
preferred label: city blocks @en-us
broader: secteur urbain
created: 2011-09-01T00:00:00+02:00
definition: Secteur urbain délimité en continu à son pourtour par des rues ou des obstacles naturels (cours d'eau, falaise, etc.).
status: 1

impasse
type: Concept
modified: 2015-01-07T13:09:04+01:00
in scheme: Thésaurus de la désignation des œuvres architecturales et des espaces aménagés
preferred label: dead-end streets @en-us
broader: voie
created: 2011-09-01T00:00:00+02:00
definition: Voie n’ayant qu’une seule issue.
status: 1

imprimerie
type: Concept
modified: 2015-01-23T12:17:30+01:00
in scheme: Thésaurus de la désignation des œuvres architecturales et des espaces aménagés
broader: usine d'impression sur papier
created: 2011-09-01T00:00:00+02:00
definition: Usine ou atelier où l'on imprime des livres, des journaux, etc., à l'aide de linotypes, de postes de photocomposition, de presses ou rotatives typographiques, offset, hélio, à impression laser, etc. Elle comprend généralement un bureau, un entrepôt industriel, etc.
status: 1

usine d'impression sur papier
type: Concept
modified: 2013-04-23T00:00:00+02:00
in scheme: Thésaurus de la désignation des œuvres architecturales et des espaces aménagés
narrower: imprimerie
narrower: usine de papiers peints
broader: usine
created: 2011-09-01T00:00:00+02:00
definition: Usine où l'on transporte sur le papier les caractères disposés dans les formes, les dessins préparés sur les planches, les cylindres ou les pierres lithographiques.
status: 1

installation hydraulique
type: Concept
modified: 2015-02-25T16:11:33+01:00
in scheme: Thésaurus de la désignation des œuvres architecturales et des espaces aménagés
preferred label: water distribution structures @en-us
broader: partie ou élément commun à tous les types d'architecture et aux espaces aménagés
created: 2011-09-01T00:00:00+02:00
scope note: Ne pas confondre avec réseau hydraulique.
definition: Installation d’un édifice relative à la circulation et la distribution de l'eau.
status: 1

laboratoire
type: Concept
modified: 2014-12-19T10:19:45+01:00
in scheme: Thésaurus de la désignation des œuvres architecturales et des espaces aménagés
preferred label: laboratories @en-us
broader: institut de recherche
alternative label: bassin d'essais
alternative label: laboratoire d'essais
created: 2011-09-01T00:00:00+02:00
definition: Bâtiment, local ou espace libre où l'on effectue les expériences, mesures, essais pour l'industrie, la recherche, l'enseignement, etc.
status: 1

internat
type: Concept
modified: 2014-12-08T11:38:32+01:00
in scheme: Thésaurus de la désignation des œuvres architecturales et des espaces aménagés
broader: partie d'édifice scolaire
created: 2011-09-01T00:00:00+02:00
scope note: Ne pas confondre avec dortoir, ni avec pensionnat.
definition: Partie d'un établissement scolaire où sont logés les élèves ou les étudiants. Elle peut aussi comporter des lieux de restauration, d'étude, etc.
status: 1

jardin botanique
type: Concept
modified: 2014-12-31T10:26:47+01:00
in scheme: Thésaurus de la désignation des œuvres architecturales et des espaces aménagés
preferred label: botanical gardens @en-us
narrower: jardin alpin
broader: jardin
alternative label: arboretum
alternative label: jardin de collection
created: 2011-09-01T00:00:00+02:00
definition: Jardin destiné à l'étude et à la collection des végétaux. L'arboretum est un parc botanique spécialisé dans l'étude des végétaux ligneux.
status: 1

jardin d'utilité
type: Concept
modified: 2014-09-18T15:43:45+02:00
in scheme: Thésaurus de la désignation des œuvres architecturales et des espaces aménagés
narrower: jardin de plantes médicinales
narrower: jardin fleuriste
narrower: jardin potager
narrower: jardins ouvriers
narrower: pépinière
narrower: verger
broader: jardin
created: 2011-09-01T00:00:00+02:00
definition: Jardin consacré à la culture des végétaux d'utilité.
status: 1

jardin en couverture
type: Concept
modified: 2014-10-14T11:52:18+02:00
in scheme: Thésaurus de la désignation des œuvres architecturales et des espaces aménagés
broader: jardin
created: 2011-09-01T00:00:00+02:00
scope note: Le jardin sur dalle est un jardin en couverture où les végétaux sont plantés en pleine terre.
definition: Jardin établi sur la couverture d'un édifice, comportant des végétaux d'ornement hors-sol.
status: 1
narrow match: http://data.bnf.fr/ark:/12148/cb150027368
narrow match: http://vocab.getty.edu/aat/300008131

jardin zoologique
type: Concept
modified: 2014-12-31T11:00:16+01:00
in scheme: Thésaurus de la désignation des œuvres architecturales et des espaces aménagés
preferred label: zoos @en-us
broader: jardin
alternative label: zoo
created: 2011-09-01T00:00:00+02:00
related: ménagerie
definition: Jardin où des animaux rares ou exotiques sont présentés vivant dans des compositions rappelant leur vie en liberté.
TermeAssocie: ménagerie
status: 1

roseraie
type: Concept
modified: 2014-12-31T11:19:50+01:00
in scheme: Thésaurus de la désignation des œuvres architecturales et des espaces aménagés
preferred label: rose gardens @en-us
broader: jardin
created: 2011-09-01T00:00:00+02:00
definition: Jardin d'agrément destiné à la culture des roses. La roseraie peut être un conservatoire de variétés anciennes et un lieu d'expérimentation d'espèces nouvelles.
status: 1

jardin alpin
type: Concept
modified: 2014-12-31T10:29:05+01:00
in scheme: Thésaurus de la désignation des œuvres architecturales et des espaces aménagés
preferred label: alpine gardens @en-us
broader: jardin botanique
created: 2011-09-01T00:00:00+02:00
scope note: Ne pas confondre avec rocaille de jardin.
definition: Jardin d'agrément ou partie d'un jardin destiné à la collection de plantes alpines ou alpestres.
status: 1

promenade
type: Concept
modified: 2015-01-07T13:22:43+01:00
in scheme: Thésaurus de la désignation des œuvres architecturales et des espaces aménagés
preferred label: passeggiata @it
preferred label: promenades @en-us
broader: voie
alternative label: promenade de bord de mer
alternative label: cours
created: 2011-09-01T00:00:00+02:00
related: mail
related: jardin d'agrément
definition: Espace public de forme allongée, généralement bordé d'arbres en alignement, à l'origine fermé à chaque extrémité et destiné à la promenade à pied ou en attelage.
TermeAssocie: mail
TermeAssocie: jardin d'agrément
status: 1

jardin d'attractions
type: Concept
modified: 2014-09-18T16:04:26+02:00
in scheme: Thésaurus de la désignation des œuvres architecturales et des espaces aménagés
broader: jardin d'agrément
created: 2011-09-01T00:00:00+02:00
related: parc d'attractions
definition: Jardin ou parc d'agrément public ou privé comportant des fabriques, fontaines et jeux destinés au divertissement des visiteurs.
TermeAssocie: parc d'attractions
status: 1

jardin public
type: Concept
modified: 2014-12-31T10:39:14+01:00
in scheme: Thésaurus de la désignation des œuvres architecturales et des espaces aménagés
preferred label: public gardens @en-us
narrower: square
broader: jardin d'agrément
created: 2011-09-01T00:00:00+02:00
definition: Jardin d'agrément, appartenant en général à une collectivité locale et conçu pour le délassement de la population.
status: 1
broad match: cb11936865q

jardin d'hiver
type: Concept
modified: 2014-12-31T16:21:23+01:00
in scheme: Thésaurus de la désignation des œuvres architecturales et des espaces aménagés
preferred label: winter gardens @en-us
broader: logis
created: 2011-09-01T00:00:00+02:00
scope note: Ne pas confondre avec véranda.
definition: Jardin d'agrément en serre, généralement associé à une demeure.
status: 1

jardin de plantes médicinales
type: Concept
modified: 2014-10-14T11:58:26+02:00
in scheme: Thésaurus de la désignation des œuvres architecturales et des espaces aménagés
preferred label: herb gardens @en-us
broader: jardin d'utilité
created: 2011-09-01T00:00:00+02:00
definition: Jardin ou portion d'un parc ou d'un jardin consacré à la culture de végétaux aux vertus curatives.
status: 1

jardin fleuriste
type: Concept
modified: 2014-12-31T10:44:43+01:00
in scheme: Thésaurus de la désignation des œuvres architecturales et des espaces aménagés
preferred label: flower gardens @en-us
broader: jardin d'utilité
created: 2011-09-01T00:00:00+02:00
definition: Jardin d'utilité ou partie d'un parc ou d'un jardin consacré à la culture de plantes fleuries.
status: 1

jardin potager
type: Concept
modified: 2014-12-31T10:46:32+01:00
in scheme: Thésaurus de la désignation des œuvres architecturales et des espaces aménagés
preferred label: vegetable gardens & kitchen gardens @en-us
narrower: jardin maraîcher
broader: jardin d'utilité
created: 2011-09-01T00:00:00+02:00
definition: Jardin consacré à la culture de légumes et de fruits destinés à la consommation personnelle.
status: 1

jardins ouvriers
type: Concept
modified: 2014-12-31T10:50:41+01:00
in scheme: Thésaurus de la désignation des œuvres architecturales et des espaces aménagés
preferred label: allotment gardens @en-us
broader: jardin d'utilité
created: 2011-09-01T00:00:00+02:00
definition: Lotissement de jardins dissociés de l'habitat et loués à bas prix à des familles d'ouvriers par des entreprises, des municipalités ou des institutions de bienfaisance.
status: 1

pépinière
type: Concept
modified: 2014-12-31T10:53:04+01:00
in scheme: Thésaurus de la désignation des œuvres architecturales et des espaces aménagés
preferred label: nurseries (horticulture) @en-us
broader: jardin d'utilité
created: 2011-09-01T00:00:00+02:00
definition: Jardin ou portion d'un parc ou d'un jardin consacré à la multiplication des végétaux en pleine terre.
status: 1

verger
type: Concept
modified: 2014-12-31T10:54:38+01:00
in scheme: Thésaurus de la désignation des œuvres architecturales et des espaces aménagés
preferred label: orchards @en-us
broader: jardin d'utilité
alternative label: jardin fruitier
created: 2011-09-01T00:00:00+02:00
definition: Jardin ou portion d'un parc ou d'un jardin consacré à la culture d'arbres fruitiers de haute-tige de plein-vent.
status: 1

jardin maraîcher
type: Concept
modified: 2014-12-31T10:47:19+01:00
in scheme: Thésaurus de la désignation des œuvres architecturales et des espaces aménagés
preferred label: market gardens @en-us
broader: jardin potager
created: 2011-09-01T00:00:00+02:00
definition: Jardin potager affecté à la culture de végétaux consommables destinés à la vente.
status: 1
broad match: Jardin potager

square
type: Concept
modified: 2014-12-31T10:41:59+01:00
in scheme: Thésaurus de la désignation des œuvres architecturales et des espaces aménagés
broader: jardin public
created: 2011-09-01T00:00:00+02:00
definition: Petite place comprenant un jardin central : l'espace ouvert à la circulation générale y est réduit aux voies qui entourent le jardin.
status: 1
broad match: cb11954989x

laiterie industrielle
type: Concept
modified: 2015-01-19T12:50:34+01:00
in scheme: Thésaurus de la désignation des œuvres architecturales et des espaces aménagés
broader: usine de produits agro-alimentaires
created: 2011-09-01T00:00:00+02:00
related: laiterie
definition: Usine où s'effectuent le traitement du lait (lait nature, en poudre, concentré, etc.) et la fabrication du beurre. Elle comprend parfois une porcherie et généralement une chaufferie, un quai, etc.
TermeAssocie: laiterie
status: 1

laminoir
type: Concept
modified: 2015-03-17T14:48:57+01:00
in scheme: Thésaurus de la désignation des œuvres architecturales et des espaces aménagés
broader: usine de transformation des métaux
created: 2011-09-01T00:00:00+02:00
scope note: Voir aussi le Thesaurus des objets mobiliers (machine liée à la production industrielle).
definition: Usine où s'effectue le laminage des métaux, en vue d'obtenir des tôles, des barres et des profilés. Elle comprend généralement une ou plusieurs cages, équipées de deux ou plusieurs cylindres. L’équipement donne ici son nom au bâtiment de production.
status: 1

lampisterie
type: Concept
modified: 2015-02-25T16:13:45+01:00
in scheme: Thésaurus de la désignation des œuvres architecturales et des espaces aménagés
broader: partie ou élément commun à tous les types d'architecture et aux espaces aménagés
created: 2011-09-01T00:00:00+02:00
definition: Bâtiment ou local d'une usine, d’un site minier, d’une gare, etc. où l'on entrepose, répare et entretient les lampes nécessaires au personnel comme au matériel.
status: 1

latrine
type: Concept
modified: 2014-12-31T16:23:14+01:00
in scheme: Thésaurus de la désignation des œuvres architecturales et des espaces aménagés
preferred label: lavatories & latrines @en-us
broader: logis
created: 2011-09-01T00:00:00+02:00
scope note: A ne confondre avec latrines, terme non préférentiel de toilettes publiques.
definition: Lieu d'aisances.
status: 1

lice
type: Concept
modified: 2015-01-07T12:08:53+01:00
in scheme: Thésaurus de la désignation des œuvres architecturales et des espaces aménagés
broader: place
created: 2011-09-01T00:00:00+02:00
definition: Place en forme de tronçon de boulevard, établie sur l'emplacement d’une partie du fossé longeant l'enceinte d'une ville.
status: 1
broad match: cb11954989x
broad match: http://vocab.getty.edu/aat/300008304

pavillon d'exposition
type: Concept
modified: 2014-12-19T10:29:01+01:00
in scheme: Thésaurus de la désignation des œuvres architecturales et des espaces aménagés
preferred label: exhibitions buildings @en-us
broader: lieu d'exposition
alternative label: palais d'exposition
created: 2011-09-01T00:00:00+02:00
definition: Édifice en général éphémère construit pour abriter une exposition. Le palais d’exposition se distingue par des dimensions supérieures à celles du pavillon.
status: 1
broad match: http://data.bnf.fr/ark:/12148/cb122047340

salle d'exposition
type: Concept
modified: 2014-10-17T16:04:18+02:00
in scheme: Thésaurus de la désignation des œuvres architecturales et des espaces aménagés
broader: lieu d'exposition
created: 2011-09-01T00:00:00+02:00
definition: Partie d'édifice destinée à la présentation publique d’œuvres d'art.
status: 1
broad match: http://vocab.getty.edu/aat/300005748

siège de presse
type: Concept
modified: 2014-12-19T10:33:36+01:00
in scheme: Thésaurus de la désignation des œuvres architecturales et des espaces aménagés
broader: lieu de production médiatique
created: 2011-09-01T00:00:00+02:00
definition: Édifice abritant les activités éditoriales d'un journal ou d'une revue. Il peut abriter une imprimerie.
status: 1

studio de cinéma
type: Concept
modified: 2014-12-19T10:34:28+01:00
in scheme: Thésaurus de la désignation des œuvres architecturales et des espaces aménagés
preferred label: motion-picture studios @en-us
broader: lieu de production médiatique
created: 2011-09-01T00:00:00+02:00
definition: Bâtiment ou groupe de bâtiments comprenant plusieurs plateaux et l'équipement nécessaire au tournage d'un film cinématographique.
status: 1

local du comité d'entreprise
type: Concept
modified: 2015-04-30T17:03:32+02:00
in scheme: Thésaurus de la désignation des œuvres architecturales et des espaces aménagés
broader: parties industrielles
created: 2011-09-01T00:00:00+02:00
definition: Bâtiment ou local d'une entreprise affecté au comité d'entreprise.
status: 1

local syndical
type: Concept
modified: 2015-02-25T16:14:42+01:00
in scheme: Thésaurus de la désignation des œuvres architecturales et des espaces aménagés
broader: partie ou élément commun à tous les types d'architecture et aux espaces aménagés
created: 2011-09-01T00:00:00+02:00
scope note: Ne pas confondre avec bourse du travail.
definition: Bâtiment ou local d’une entreprise, d’une administration, etc., affecté aux organisations syndicales.
status: 1

logette
type: Concept
modified: 2015-02-26T11:20:29+01:00
in scheme: Thésaurus de la désignation des œuvres architecturales et des espaces aménagés
broader: pièce
created: 2011-09-01T00:00:00+02:00
scope note: Ne pas confondre avec oriel, ni avec échauguette, ni avec bretèche, dont le sol est percé pour le tir plongeant.
definition: Petit ouvrage en surplomb, de plan allongé et à un seul étage.
status: 1

loggia
type: Concept
modified: 2015-02-26T11:25:14+01:00
in scheme: Thésaurus de la désignation des œuvres architecturales et des espaces aménagés
preferred label: loggias @en-us
broader: pièce
created: 2011-09-01T00:00:00+02:00
scope note: Ne pas confondre avec tribune, ni avec balcon, ni avec terrasse qui ne sont pas couverts, ni avec galerie ouverte.
definition: Pièce située à l'étage, ouverte sur l'extérieur et dont les baies n'ont pas de menuiseries.
status: 1

salle
type: Concept
modified: 2014-12-31T16:27:17+01:00
in scheme: Thésaurus de la désignation des œuvres architecturales et des espaces aménagés
preferred label: halls (interior spaces) @en-us
broader: logis
created: 2011-09-01T00:00:00+02:00
definition: Pièce principale du logis, en général de forme rectangulaire et de grandes dimensions, notamment dans l'architecture médiévale et moderne. Elle recouvre des fonctions domestiques et de représentation.
status: 1

salle à manger
type: Concept
modified: 2014-12-31T16:28:49+01:00
in scheme: Thésaurus de la désignation des œuvres architecturales et des espaces aménagés
preferred label: dining rooms @en-us
broader: logis
created: 2011-09-01T00:00:00+02:00
definition: Pièce aménagée pour y prendre les repas.
status: 1

salle de bains
type: Concept
modified: 2014-12-31T16:31:04+01:00
in scheme: Thésaurus de la désignation des œuvres architecturales et des espaces aménagés
preferred label: bathrooms @en-us
broader: logis
created: 2011-09-01T00:00:00+02:00
definition: Pièce aménagée pour y prendre des bains et plus largement y faire sa toilette.
status: 1

salon
type: Concept
modified: 2014-12-31T16:33:56+01:00
in scheme: Thésaurus de la désignation des œuvres architecturales et des espaces aménagés
preferred label: salons & reception rooms @en-us
broader: logis
created: 2011-09-01T00:00:00+02:00
definition: Pièce de réception principale.
status: 1

magasin coopératif
type: Concept
modified: 2014-12-05T10:18:10+01:00
in scheme: Thésaurus de la désignation des œuvres architecturales et des espaces aménagés
preferred label: cooperative stores @en-us
broader: magasin de commerce
created: 2011-09-01T00:00:00+02:00
status: 1

superette
type: Concept
modified: 2014-12-05T10:19:00+01:00
in scheme: Thésaurus de la désignation des œuvres architecturales et des espaces aménagés
broader: magasin de commerce
created: 2011-09-01T00:00:00+02:00
definition: Magasin d'alimentation et autres produits courants, en libre-service, d'une superficie comprise entre 120 et 400 m2.
status: 1

supermarché
type: Concept
modified: 2014-12-05T10:23:02+01:00
in scheme: Thésaurus de la désignation des œuvres architecturales et des espaces aménagés
preferred label: supermarkets @en-us
broader: magasin de commerce
created: 2011-09-01T00:00:00+02:00
definition: Vaste magasin (de 400 à 2500 m2) vendant en libre-service des denrées alimentaires et autres produits courants.
status: 1
broad match: cb11937759r

maison commune
type: Concept
modified: 2014-12-12T10:43:44+01:00
in scheme: Thésaurus de la désignation des œuvres architecturales et des espaces aménagés
broader: mairie
created: 2011-09-01T00:00:00+02:00
definition: Sous l'Ancien Régime, édifice public où se réunissent les échevins ou les consuls formant le corps administratif d'une ville ou d'un bourg.
status: 1
broad match: http://vocab.getty.edu/aat/300006063
broad match: cb12049407z

maison consulaire
type: Concept
modified: 2014-12-12T10:44:48+01:00
in scheme: Thésaurus de la désignation des œuvres architecturales et des espaces aménagés
broader: mairie
created: 2011-09-01T00:00:00+02:00
definition: Sous l'Ancien Régime et dans le sud de la France, édifice public où se réunissent les consuls formant le corps administratif d'une ville.
status: 1
broad match: http://vocab.getty.edu/aat/300006063
broad match: cb12049407z

maison du peuple
type: Concept
modified: 2014-10-09T12:52:56+02:00
in scheme: Thésaurus de la désignation des œuvres architecturales et des espaces aménagés
broader: siège d'association ou d'organisation
created: 2011-09-01T00:00:00+02:00
definition: Édifice destiné aux ouvriers et à leur famille, regroupant magasin coopératif et centre de culture et de loisirs (salles de réunion, généralement syndicale, bibliothèque, théâtre, salle des fêtes, salles de sports, débit de boissons non alcoolisées, etc.).
status: 1

malterie
type: Concept
modified: 2015-02-04T16:13:01+01:00
in scheme: Thésaurus de la désignation des œuvres architecturales et des espaces aménagés
broader: usine de préparation d'un produit agroalimentaire
created: 2011-09-01T00:00:00+02:00
definition: Usine où l'on prépare le malt en vue de la fabrication de la bière. Elle comprend généralement des cuves à tremper, une salle de germination, une pièce de séchage (touraille), etc.
status: 1

usine de préparation d'un produit agroalimentaire
type: Concept
modified: 2013-04-23T00:00:00+02:00
in scheme: Thésaurus de la désignation des œuvres architecturales et des espaces aménagés
narrower: malterie
narrower: râperie
narrower: usine de sélection de semences
broader: usine de produits agro-alimentaires
created: 2011-09-01T00:00:00+02:00
definition: Usine où l'on fait subir un premier traitement à un produit agricole (sélection, fermentation, grillage, râpage, germination, etc.) en vue de sa transformation industrielle.
status: 1

marais salant
type: Concept
modified: 2015-01-15T16:45:57+01:00
in scheme: Thésaurus de la désignation des œuvres architecturales et des espaces aménagés
broader: usine d'extraction
created: 2011-09-01T00:00:00+02:00
definition: Ensemble de bassins et canaux creusés à proximité des côtes pour la production de sel marin par évaporation naturelle.
status: 1

marché couvert
type: Concept
modified: 2014-12-05T10:26:23+01:00
in scheme: Thésaurus de la désignation des œuvres architecturales et des espaces aménagés
preferred label: market halls @en-us
broader: marché
alternative label: halles
created: 2011-09-01T00:00:00+02:00
definition: Espace couvert, généralement clos, abritant les étals des vendeurs d'un marché.
status: 1

mare
type: Concept
modified: 2014-12-30T14:33:27+01:00
in scheme: Thésaurus de la désignation des œuvres architecturales et des espaces aménagés
preferred label: ponds (water) @en-us
broader: partie d'édifice agricole
created: 2011-09-01T00:00:00+02:00
definition: Étendue d'eau stagnante, naturelle ou artificielle, de petite superficie et de forme aléatoire.
status: 1

marégraphe
type: Concept
modified: 2014-10-10T10:48:03+02:00
in scheme: Thésaurus de la désignation des œuvres architecturales et des espaces aménagés
preferred label: tide gages @en-us
broader: observatoire
created: 2011-09-01T00:00:00+02:00
scope note: Pour étudier l’instrumentation de mesure et d'enregistrement, voir le Thesaurus des objets mobiliers.
definition: Édifice ou édicule abritant l'instrumentation nécessaire à la mesure du niveau de la mer et des hauteurs d'eau consécutives aux marées.
status: 1

marina
type: Concept
modified: 2015-01-08T10:41:57+01:00
in scheme: Thésaurus de la désignation des œuvres architecturales et des espaces aménagés
preferred label: marinas @en-us
broader: quartier
created: 2011-09-01T00:00:00+02:00
definition: Complexe touristique, aménagé en bord de mer, comprenant un port de plaisance, des logements, etc.
status: 1

bâtiment du martinet
type: Concept
modified: 2015-04-30T15:08:52+02:00
in scheme: Thésaurus de la désignation des œuvres architecturales et des espaces aménagés
broader: usine de transformation des métaux
created: 2011-09-01T00:00:00+02:00
scope note: Voir aussi le Thesaurus des objets mobiliers (machine liée à la production industrielle).
definition: Usine où se trouve un marteau mû au moyen d'une roue à cames, utilisé pour le forgeage des petites pièces. L’équipement donne ici son nom au bâtiment de production.
status: 1

massif antérieur
type: Concept
modified: 2014-10-15T17:30:38+02:00
in scheme: Thésaurus de la désignation des œuvres architecturales et des espaces aménagés
preferred label: westworks @en-us
preferred label: corpo occidentale @it
preferred label: westwork @en-gb
broader: partie d'église
alternative label: massif occidental
created: 2011-09-01T00:00:00+02:00
scope note: Le massif antérieur ne fait pas partie de la nef.
definition: Dispositions structurelles situées à l'entrée de la nef, comprenant habituellement des tours, un porche, une tribune.
status: 1

mausolée
type: Concept
modified: 2015-02-24T16:04:20+01:00
in scheme: Thésaurus de la désignation des œuvres architecturales et des espaces aménagés
preferred label: mausoleo @it
preferred label: mausoleums @en-us
preferred label: mausoleum @en-gb
broader: monument funéraire
alternative label: martyrium
created: 2011-09-01T00:00:00+02:00
scope note: Le martyrium est un mausolée élevé sur la tombe d'un martyr.
definition: Monument funéraire, ayant les dimensions d'un édifice, construit pour recevoir une ou plusieurs tombes. Certaines églises sont des mausolées.
status: 1

menhir
type: Concept
modified: 2015-02-24T16:20:16+01:00
in scheme: Thésaurus de la désignation des œuvres architecturales et des espaces aménagés
preferred label: standing stone 2 @en-gb
preferred label: menhirs @en-us
broader: mégalithe
alternative label: statue-menhir
alternative label: peulven
alternative label: peulvan
created: 2011-09-01T00:00:00+02:00
related: roche ornée
TermeAssocie: roche ornée
status: 1

trilithe
type: Concept
modified: 2015-02-24T16:22:06+01:00
in scheme: Thésaurus de la désignation des œuvres architecturales et des espaces aménagés
preferred label: trilite @it
preferred label: trilithons @en-us
preferred label: trilithon @en-gb
broader: mégalithe
alternative label: lichaven
created: 2011-09-01T00:00:00+02:00
definition: Monument mégalithique formé par deux orthostates généralement élancés réunis par un linteau.
status: 1
broad match: http://data.bnf.fr/ark:/12148/cb119343039

roche ornée
type: Concept
modified: 2015-02-24T16:38:21+01:00
in scheme: Thésaurus de la désignation des œuvres architecturales et des espaces aménagés
preferred label: pitture rupestri + scultura preistorica @it
preferred label: rock carving + rune stone + inscribed stone @en-gb
broader: monument
created: 2011-09-01T00:00:00+02:00
related: menhir
definition: Roche décorée par l'homme de gravures, sculptures, peintures, etc.
TermeAssocie: menhir
status: 1

mine
type: Concept
modified: 2015-04-28T14:17:56+02:00
in scheme: Thésaurus de la désignation des œuvres architecturales et des espaces aménagés
narrower: mine à ciel ouvert
broader: usine d'extraction
created: 2011-09-01T00:00:00+02:00
definition: Exploitation, généralement souterraine, de substances concassables, minérales ou fossiles (houille, minerai métallique, potasse, sel, etc.) et comprenant généralement un puits d'extraction, un puits de service, un chevalement ou une tour d'extraction, un bâtiment de recette, etc.
status: 1

mine à ciel ouvert
type: Concept
modified: 2015-01-21T15:39:13+01:00
in scheme: Thésaurus de la désignation des œuvres architecturales et des espaces aménagés
broader: mine
created: 2011-09-01T00:00:00+02:00
definition: Exploitation à ciel ouvert de substances concassables, minérales ou fossiles et comprenant généralement une excavation en forme de gradins.
status: 1

minoterie
type: Concept
modified: 2015-04-29T15:07:56+02:00
in scheme: Thésaurus de la désignation des œuvres architecturales et des espaces aménagés
broader: usine de produits agro-alimentaires
created: 2011-09-01T00:00:00+02:00
definition: Établissement industriel où les grains de céréales subissent par gravitation, sur plusieurs niveaux, les opérations suivantes : nettoyage (avec séparateurs, épierreurs, nettoyeurs, etc.), mouture (avec broyeurs à cylindre, plansichters, sasseurs, convertisseurs, etc.), mélange des farines et conditionnement. Il comprend généralement un silo, un atelier de conditionnement, un poste de chargement, etc.
status: 1

miroir d'eau
type: Concept
modified: 2014-12-31T10:21:54+01:00
in scheme: Thésaurus de la désignation des œuvres architecturales et des espaces aménagés
preferred label: reflecting pools @en-us
broader: pièce d'eau
created: 2011-09-01T00:00:00+02:00
definition: Bassin sans fontaine : la surface de ses eaux n'est pas troublée par des jets ou des chutes ; elle multiplie souvent par réflexion les effets d'une ordonnance.
status: 1

montagne artificielle
type: Concept
modified: 2014-10-22T12:17:05+02:00
in scheme: Thésaurus de la désignation des œuvres architecturales et des espaces aménagés
broader: relief artificiel de jardin
created: 2011-09-01T00:00:00+02:00
definition: Levée de terre adoptant la forme irrégulière d'une montagne. La colline artificielle est de hauteur moindre.
status: 1

trophée monumental
type: Concept
modified: 2014-11-18T13:04:00+01:00
in scheme: Thésaurus de la désignation des œuvres architecturales et des espaces aménagés
preferred label: trofeo @it
preferred label: trophies (monuments) @en-us
preferred label: trophy @en-gb
broader: édicule commémoratif
created: 2011-09-01T00:00:00+02:00
scope note: Voir aussi le Thesaurus des objets mobiliers.
definition: Monument élevé en commémoration d'une victoire et portant la représentation des dépouilles des vaincus.
status: 1

motte
type: Concept
modified: 2015-01-05T12:57:45+01:00
in scheme: Thésaurus de la désignation des œuvres architecturales et des espaces aménagés
preferred label: mottes @en-us
broader: ouvrage fortifié
created: 2011-09-01T00:00:00+02:00
scope note: Ne pas confondre avec tumulus.
definition: Éminence artificielle créée pour servir de base à une place forte, à un donjon et assurer son commandement sur la campagne.
status: 1

moulin
type: Concept
modified: 2014-12-17T16:57:16+01:00
in scheme: Thésaurus de la désignation des œuvres architecturales et des espaces aménagés
preferred label: mills @en-us
broader: usine
alternative label: moulin à traction animale
alternative label: moulin édicule
alternative label: moulin à vent
alternative label: moulin à eau
created: 2011-09-01T00:00:00+02:00
related: parties artisanales
related: moulinerie
related: moulin à huile
related: moulin à farine
related: moulin à foulon
related: moulin à tan
related: moulin à papier
definition: Édifice industriel ou artisanal comportant des installations techniques permettant de broyer, piler, pulvériser, battre ou presser des matières premières (graines, fruits, oléagineux, céréales, écorces, fibres, minerais, etc.) ou des produits (draps, chiffons, métaux, etc.). La force motrice est transformée en mouvement actionnant les machines (meules, marteaux, presses, etc.).
TermeAssocie: parties artisanales
TermeAssocie: moulinerie
TermeAssocie: moulin à huile
TermeAssocie: moulin à farine
TermeAssocie: moulin à foulon
TermeAssocie: moulin à tan
TermeAssocie: moulin à papier
status: 1

moulin à farine
type: Concept
modified: 2015-01-19T16:28:38+01:00
in scheme: Thésaurus de la désignation des œuvres architecturales et des espaces aménagés
narrower: moulin à blé
broader: usine de produits agro-alimentaires
created: 2011-09-01T00:00:00+02:00
related: moulin
definition: Établissement souvent artisanal où l'on effectue la mouture par meules des grains de céréales. Elle comprend généralement un bief de dérivation, un bâtiment d'eau, un logement patronal, etc.
TermeAssocie: moulin
status: 1

moulin à foulon
type: Concept
modified: 2015-03-18T15:59:12+01:00
in scheme: Thésaurus de la désignation des œuvres architecturales et des espaces aménagés
broader: usine d'apprêt des étoffes
created: 2011-09-01T00:00:00+02:00
related: moulin
definition: Usine où s'effectue le foulage des étoffes, à l'aide d'un arbre à cames actionnant une batterie de maillets. Elle comprend généralement un bief de dérivation, un bâtiment d'eau, etc.
TermeAssocie: moulin
status: 1

moulin à tan
type: Concept
modified: 2014-12-08T15:19:56+01:00
in scheme: Thésaurus de la désignation des œuvres architecturales et des espaces aménagés
broader: tannerie
created: 2011-09-01T00:00:00+02:00
related: moulin
definition: Usine où l'on broie, à l'aide d'un arbre à cames actionnant des pilons, l'écorce de chêne qui sert au tannage des peaux. Elle comprend généralement un bief de dérivation, un bâtiment d'eau, etc.
TermeAssocie: moulin
status: 1

moulin à papier
type: Concept
modified: 2015-04-28T16:06:23+02:00
in scheme: Thésaurus de la désignation des œuvres architecturales et des espaces aménagés
broader: usine de papeterie
created: 2011-09-01T00:00:00+02:00
related: moulin
definition: Usine où l'on fabrique du papier, à l'aide de piles hollandaises, de cuves de raffinage, etc. Elle comprend généralement un bief dedérivation , un bâtiment d'eau, une pièce de séchage, etc.
TermeAssocie: moulin
status: 1

moulin à blé
type: Concept
modified: 2015-04-29T15:12:32+02:00
in scheme: Thésaurus de la désignation des œuvres architecturales et des espaces aménagés
broader: moulin à farine
created: 2011-09-01T00:00:00+02:00
definition: Établissement souvent artisanal où l'on effectue la mouture par meules des grains de blé. Elle comprend généralement un magasin industriel , un bâtiment d'eau, un logement patronal, etc.
status: 1
broad match: Moulin à farine
broad match: cb11970822t
broad match: http://vocab.getty.edu/aat/300006286

usine d'apprêt des étoffes
type: Concept
modified: 2015-03-18T15:37:45+01:00
in scheme: Thésaurus de la désignation des œuvres architecturales et des espaces aménagés
narrower: moulin à foulon
narrower: usine de blanchiment
narrower: usine de feutre
narrower: usine de moirage
broader: usine textile
created: 2011-09-01T00:00:00+02:00
definition: Usine où l'on apprête les étoffes : crêpage, empesage, lustrage, glaçage, gaufrage, ignifugation, etc. Elle fonctionne généralement avec des calandres, des rames sécheuses-élargisseuses, des machines à apprêter (foulards), etc.
status: 1

pressoir à huile
type: Concept
modified: 2014-12-30T14:46:15+01:00
in scheme: Thésaurus de la désignation des œuvres architecturales et des espaces aménagés
preferred label: oil presses @en-us
broader: pressoir
created: 2011-09-01T00:00:00+02:00
related: moulin à huile
definition: Pressoir servant à extraire de l'huile à partir d'olives, graines de tournesol, pépins de raisin, etc.
TermeAssocie: moulin à huile
status: 1

mur de soutènement
type: Concept
modified: 2015-02-25T16:23:28+01:00
in scheme: Thésaurus de la désignation des œuvres architecturales et des espaces aménagés
preferred label: retaining walls @en-us
broader: mur - garde-corps - clôture
created: 2011-09-01T00:00:00+02:00
definition: Mur servant à contenir la poussée des terres à un changement de niveau du sol. Il est donc enterré sur une de ses faces.
status: 1

mur défensif
type: Concept
modified: 2015-01-05T12:58:36+01:00
in scheme: Thésaurus de la désignation des œuvres architecturales et des espaces aménagés
broader: ouvrage fortifié
created: 2011-09-01T00:00:00+02:00
definition: Dans l'architecture médiévale et moderne, ouvrage défensif fortifié, constitué d'un mur percé de meurtrières.
status: 1
broad match: cb11931504g

pignon
type: Concept
modified: 2015-02-25T16:27:37+01:00
in scheme: Thésaurus de la désignation des œuvres architecturales et des espaces aménagés
preferred label: gables (architectural elements) @en-us
broader: mur - garde-corps - clôture
created: 2011-09-01T00:00:00+02:00
definition: Partie supérieure d'un mur pignon, correspondant à la hauteur du comble. Comme les fermes, le pignon porte habituellement les versants ; mais il peut aussi se prolonger au-dessus de ceux-ci : suivant le cas, il est dit couvert ou découvert.
status: 1

mur végétal
type: Concept
modified: 2014-10-16T11:33:40+02:00
in scheme: Thésaurus de la désignation des œuvres architecturales et des espaces aménagés
broader: partie ou élément commun à tous les types d'architecture et aux espaces aménagés
created: 2011-09-01T00:00:00+02:00
definition: Aménagement paysager réalisé grâce à une technique de culture permettant de végétaliser une surface verticale.
status: 1

nef
type: Concept
modified: 2014-11-28T16:00:53+01:00
in scheme: Thésaurus de la désignation des œuvres architecturales et des espaces aménagés
preferred label: navata @it
preferred label: naves @en-us
preferred label: nave @en-gb
broader: partie d'église
created: 2011-09-01T00:00:00+02:00
scope note: Ne pas employer le mot nef pour les églises de plan centré (ou en croix grecque).
definition: Partie d'une église de plan allongé comprise entre le massif antérieur et l'entrée du chœur, éventuellement l'avant-chœur ou la croisée du transept.
status: 1

station de sismologie
type: Concept
modified: 2014-10-17T16:02:03+02:00
in scheme: Thésaurus de la désignation des œuvres architecturales et des espaces aménagés
broader: observatoire
created: 2011-09-01T00:00:00+02:00
scope note: Pour étudier l’instrumentation de mesure et d'enregistrement (sismomètres, sismographes, etc.), voir le Thesaurus des objets mobiliers.
definition: Édifice abritant l’instrumentation nécessaire à l’observation et la mesure des ondes mécaniques générées par les séismes.
status: 1

station météorologique
type: Concept
modified: 2014-12-19T10:26:08+01:00
in scheme: Thésaurus de la désignation des œuvres architecturales et des espaces aménagés
preferred label: meteorological stations @en-us
broader: observatoire
created: 2011-09-01T00:00:00+02:00
scope note: Pour étudier l’instrumentation de mesure et d'enregistrement (thermomètres, baromètres, hygromètres, etc.), voir le Thesaurus des objets mobiliers.
definition: Édifice, édicule ou local abritant l’instrumentation nécessaire à l’observation et la mesure des phénomènes atmosphériques tels que les nuages, les précipitations, le vent, etc.
status: 1

opéra
type: Concept
modified: 2014-12-19T11:15:09+01:00
in scheme: Thésaurus de la désignation des œuvres architecturales et des espaces aménagés
preferred label: opera houses @en-us
broader: salle de spectacle
created: 2011-09-01T00:00:00+02:00
definition: Édifice destiné aux représentations d'art lyrique ou de ballets.
status: 1

ouvrage avancé
type: Concept
modified: 2015-01-05T13:14:37+01:00
in scheme: Thésaurus de la désignation des œuvres architecturales et des espaces aménagés
narrower: redan
narrower: redoute
broader: ouvrage extérieur
created: 2011-09-01T00:00:00+02:00
definition: Ouvrage extérieur construit au-delà du chemin couvert.
status: 1
broad match: http://vocab.getty.edu/aat/300003701

redan
type: Concept
modified: 2015-01-05T13:08:39+01:00
in scheme: Thésaurus de la désignation des œuvres architecturales et des espaces aménagés
preferred label: redans @en-us
broader: ouvrage avancé
created: 2011-09-01T00:00:00+02:00
definition: Dans l'architecture classique et moderne, ouvrage avancé en forme de V dont l'angle saillant est tourné vers la campagne.
status: 1

redoute
type: Concept
modified: 2015-01-05T13:12:07+01:00
in scheme: Thésaurus de la désignation des œuvres architecturales et des espaces aménagés
preferred label: redoubts @en-us
broader: ouvrage avancé
created: 2011-09-01T00:00:00+02:00
definition: Dans l'architecture classique et moderne, ouvrage extérieur spécialement construit pour servir de réduit local et généralement pour porter de l'artillerie. Sa forme est souvent carrée. C'est un ouvrage d'attaque comme de défense, aussi est-ce quelquefois une construction provisoire.
status: 1

porte de garde
type: Concept
modified: 2014-12-02T13:09:02+01:00
in scheme: Thésaurus de la désignation des œuvres architecturales et des espaces aménagés
broader: ouvrage d'art
created: 2011-09-01T00:00:00+02:00
scope note: Ne pas confondre avec vanne, ni avec porte d’écluse qui assure la passage à la navigation.
definition: Dans un canal de dérivation, ouvrage muni de vantaux, situé aux entrées du canal, permettant d’isoler celui-ci lors des crues de la rivière, tout en laissant le passage libre en temps normal. Installé également sur les biefs importants d’un canal de navigation, il permet lors de sa fermeture d’isoler une partie du bief pour l’entretenir sans avoir à le vidanger complètement.
status: 1

passage à niveau
type: Concept
modified: 2014-12-02T13:03:57+01:00
in scheme: Thésaurus de la désignation des œuvres architecturales et des espaces aménagés
preferred label: grade crossings @en-us
broader: ouvrage d'art
created: 2011-09-01T00:00:00+02:00
definition: Aménagement au croisement d'une voie ferrée et d'une route de même niveau. Il est souvent associé à une signalisation, à des barrières mobiles et à une maison de garde-barrières.
status: 1

passage souterrain
type: Concept
modified: 2014-10-16T15:24:47+02:00
in scheme: Thésaurus de la désignation des œuvres architecturales et des espaces aménagés
broader: ouvrage d'art
created: 2011-09-01T00:00:00+02:00
definition: Aménagement destiné au passage des piétons, des cycles ou des animaux sous une voie de communication.
status: 1

pente d'eau
type: Concept
modified: 2014-10-16T15:25:29+02:00
in scheme: Thésaurus de la désignation des œuvres architecturales et des espaces aménagés
broader: ouvrage d'art
created: 2011-09-01T00:00:00+02:00
definition: Ouvrage d'art permettant le franchissement d'une dénivelée entre deux biefs selon le principe suivant : un engin prenant appui sur les bords du canal déplace un bouclier métallique qui fait avancer sur un plan incliné, en maçonnerie, le « coin d'eau » porteur du bateau.
status: 1

piste d'aviation
type: Concept
modified: 2014-10-16T15:26:27+02:00
in scheme: Thésaurus de la désignation des œuvres architecturales et des espaces aménagés
preferred label: runways @en-us
broader: ouvrage d'art
created: 2011-09-01T00:00:00+02:00
scope note: Ne pas confondre avec aérodrome.
definition: Bande de terrain pouvant comporter des fondations importantes et un revêtement en bitume ou en béton, sur laquelle roulent les avions pendant le décollage ou l'atterrissage.
status: 1

pont
type: Concept
modified: 2014-12-02T13:05:30+01:00
in scheme: Thésaurus de la désignation des œuvres architecturales et des espaces aménagés
preferred label: bridges (builtworks) @en-us
narrower: passerelle
narrower: pont canal
narrower: pont à plusieurs niveaux
narrower: pont mobile
broader: ouvrage d'art
alternative label: ponceau
alternative label: viaduc
created: 2011-09-01T00:00:00+02:00
related: pont de jardin
definition: Ouvrage de franchissement portant une voie de communication. Le viaduc est un pont de grande longueur et de grande hauteur permettant le franchissement d’une dépression. Le ponceau est un petit pont d’une seule travée.
TermeAssocie: pont de jardin
status: 1

poste de commande
type: Concept
modified: 2014-10-16T15:32:12+02:00
in scheme: Thésaurus de la désignation des œuvres architecturales et des espaces aménagés
narrower: tour de contrôle
narrower: poste d'aiguillage
broader: ouvrage d'art
alternative label: tour d'observation
created: 2011-09-01T00:00:00+02:00
scope note: Ne pas confondre avec mirador, ni avec poste d’observation.
related: poste de secours
definition: Édifice ou édicule abritant les dispositifs permettant de contrôler, de commander ou de surveiller des circulations de personnes ou de biens, des activités humaines, des processus de production, de manutention, etc.
TermeAssocie: poste de secours
status: 1
narrow match: cb12320286g

relais de télécommunication
type: Concept
modified: 2014-10-16T15:34:30+02:00
in scheme: Thésaurus de la désignation des œuvres architecturales et des espaces aménagés
preferred label: broadcasting stations @en-us
broader: ouvrage d'art
created: 2011-09-01T00:00:00+02:00
scope note: Les équipements (émetteur, récepteur et leurs générateurs) font l’objet d’un dossier objet mobilier.
related: station radar
definition: Ouvrage abritant ou supportant les équipements permettant d'assurer les fonctions d'émission et de réception d'ondes électromagnétiques pour la radiodiffusion (radio et télévision) ou les télécommunications (téléphonie, internet, etc.).
TermeAssocie: station radar
status: 1

sémaphore
type: Concept
modified: 2014-12-02T15:03:25+01:00
in scheme: Thésaurus de la désignation des œuvres architecturales et des espaces aménagés
broader: ouvrage d'art
created: 2011-09-01T00:00:00+02:00
related: réseau télégraphique
definition: Ouvrage muni d'un appareillage destiné à signaler, par un dispositif optique, des informations à des conducteurs ou à des piétons.
TermeAssocie: réseau télégraphique
status: 1
broad match: cb11976175x
broad match: http://vocab.getty.edu/aat/300122187

station de télégraphe
type: Concept
modified: 2014-10-23T13:08:43+02:00
in scheme: Thésaurus de la désignation des œuvres architecturales et des espaces aménagés
preferred label: telegraph stations @en-us
broader: ouvrage d'art
alternative label: tour de télégraphe
created: 2011-09-01T00:00:00+02:00
related: réseau télégraphique
definition: Édifice ou édicule abritant ou supportant l'appareillage nécessaire à la transmission codée de messages. Dans le cadre de la télégraphie optique, seule l'émission des messages est permise par l'instrumentation, alors que pour la télégraphie électrique ou sans fil, l'émission et la réception des messages peuvent être assurées.
TermeAssocie: réseau télégraphique
status: 1

transformateur (abri)
type: Concept
modified: 2014-12-02T15:04:59+01:00
in scheme: Thésaurus de la désignation des œuvres architecturales et des espaces aménagés
preferred label: electric substations @en-us
broader: ouvrage d'art
alternative label: sous-station électrique
created: 2011-09-01T00:00:00+02:00
definition: Édifice ou édicule abritant un convertisseur électrique servant à faire varier la tension électrique et à distribuer l’électricité aux utilisateurs.
status: 1

tunnel
type: Concept
modified: 2014-12-02T15:05:59+01:00
in scheme: Thésaurus de la désignation des œuvres architecturales et des espaces aménagés
preferred label: tunnels @en-us
broader: ouvrage d'art
created: 2011-09-01T00:00:00+02:00
definition: Ouvrage de franchissement souterrain par une voie de communication d’un obstacle naturel (montagne, cours d’eau, bras de mer, etc.).
status: 1

ouvrage d'entrée
type: Concept
modified: 2015-01-05T13:01:34+01:00
in scheme: Thésaurus de la désignation des œuvres architecturales et des espaces aménagés
broader: ouvrage fortifié
alternative label: châtelet d'entrée
alternative label: châtelet
created: 2011-09-01T00:00:00+02:00
related: porte de ville
related: tour porte
definition: Ouvrage généralement constitué de deux tours entre lesquelles est percée une porte.
TermeAssocie: porte de ville
TermeAssocie: tour porte
status: 1

tour porte
type: Concept
modified: 2015-02-25T13:46:24+01:00
in scheme: Thésaurus de la désignation des œuvres architecturales et des espaces aménagés
preferred label: gatehouses @en-us
broader: passage d'entrée
created: 2011-09-01T00:00:00+02:00
scope note: Ne pas confondre avec tour-porche.
related: ouvrage d'entrée
definition: Tour dont le rez-de-chaussée est un passage d'entrée.
TermeAssocie: ouvrage d'entrée
status: 1

ouvrage Maginot
type: Concept
modified: 2015-01-05T13:16:29+01:00
in scheme: Thésaurus de la désignation des œuvres architecturales et des espaces aménagés
broader: ouvrage fortifié
created: 2011-09-01T00:00:00+02:00
scope note: Ne pas confondre avec ligne fortifiée dite « Ligne Maginot », qui regroupe l'ensemble des ouvrages de fortification, permanente ou légère, répartis sur la frontière nord-est de la France.
definition: Ouvrage fortifié constitué de différents blocs reliés entre eux par des galeries souterraines. On distingue trois types d’élèments : les blocs d’entrée (entrée des hommes, entrée des munitions), les blocs de combat (blocs d’infanterie, blocs d’artillerie et tourelles, blocs d’observation) et les dessous (éléments souterrains constitués des galeries parfois équipées de voie ferrée, des casernements, des magasins de munition, du poste de commandement, du bloc opératoire et des usines nanties de groupes électrogènes et de batteries de filtre pour traiter les gaz).
status: 1
narrow match: Ouvrage de la ligne Maginot

pont-levis
type: Concept
modified: 2015-01-05T13:21:03+01:00
in scheme: Thésaurus de la désignation des œuvres architecturales et des espaces aménagés
preferred label: drawbridges @en-us
broader: ouvrage fortifié
created: 2011-09-01T00:00:00+02:00
related: pont mobile
definition: Pont mobile défensif qui se baisse et se lève pour ouvrir ou fermer le passage au-dessus d'un fossé ou de douves entourant un ouvrage fortifié.
TermeAssocie: pont mobile
status: 1

position fortifiée
type: Concept
modified: 2015-01-05T13:22:27+01:00
in scheme: Thésaurus de la désignation des œuvres architecturales et des espaces aménagés
broader: ouvrage fortifié
created: 2011-09-01T00:00:00+02:00
definition: Petit ouvrage de tir fortifié.
status: 1

poterne
type: Concept
modified: 2015-01-05T13:24:21+01:00
in scheme: Thésaurus de la désignation des œuvres architecturales et des espaces aménagés
preferred label: posterns @en-us
broader: ouvrage fortifié
created: 2011-09-01T00:00:00+02:00
definition: Petite porte dérobée dans une fortification, ouverte dans les endroits les moins apparents et les moins exposés, notamment dans les fossés.
status: 1

réduit
type: Concept
modified: 2015-01-05T13:29:39+01:00
in scheme: Thésaurus de la désignation des œuvres architecturales et des espaces aménagés
broader: ouvrage fortifié
created: 2011-09-01T00:00:00+02:00
definition: Ouvrage construit à l'intérieur d'un autre, où l'on peut se retrancher pour prolonger la résistance. La citadelle sert de réduit à une ville fortifiée, le donjon à un château fort.
status: 1
narrow match: cb11948553k

puits
type: Concept
modified: 2015-02-24T15:47:37+01:00
in scheme: Thésaurus de la désignation des œuvres architecturales et des espaces aménagés
preferred label: wells @en-us
broader: ouvrage lié à l'alimentation en eau
created: 2011-09-01T00:00:00+02:00
definition: Forage vertical, creusé et généralement chemisé, pour atteindre la nappe aquifère souterraine, souvent accompagné, en surface, d'une margelle en forme de pierre percée ou d'une assise de pierres qui en marque l'orifice. Des superstructures de formes diverses permettent de remonter le seau, l’outre, etc.
status: 1

regard
type: Concept
modified: 2014-10-16T15:16:05+02:00
in scheme: Thésaurus de la désignation des œuvres architecturales et des espaces aménagés
preferred label: manholes @en-us
broader: ouvrage lié à l'alimentation en eau
created: 2011-09-01T00:00:00+02:00
definition: Édicule situé à l'aplomb d'une conduite d'eau pour assurer sa surveillance et son entretien. Un escalier est généralement construit à l'intérieur pour atteindre le niveau de la conduite.
status: 1

rigole
type: Concept
modified: 2014-12-02T12:44:16+01:00
in scheme: Thésaurus de la désignation des œuvres architecturales et des espaces aménagés
broader: ouvrage lié à l'alimentation en eau
created: 2011-09-01T00:00:00+02:00
definition: Petit conduit maçonné, parfois souterrain, ou petit fossé aménagé pour amener l'eau dans un bief, un réservoir, etc. ou au contraire pour en évacuer le trop-plein.
status: 1

siphon
type: Concept
modified: 2014-10-16T15:20:46+02:00
in scheme: Thésaurus de la désignation des œuvres architecturales et des espaces aménagés
broader: ouvrage lié à l'alimentation en eau
created: 2011-09-01T00:00:00+02:00
definition: Conduite maçonnée, généralement chemisée, destinée à faire circuler de l’eau à des niveaux différents ; le dispositif est notamment composé de deux coudes permettant au liquide de s’écouler d’un niveau donné à un niveau sensiblement égal en passant par un niveau inférieur.
status: 1

station de captage
type: Concept
modified: 2014-12-02T12:46:28+01:00
in scheme: Thésaurus de la désignation des œuvres architecturales et des espaces aménagés
broader: ouvrage lié à l'alimentation en eau
created: 2011-09-01T00:00:00+02:00
definition: Ouvrage destiné à recueillir les eaux d'une source ou d'une rivière, regroupant les installations et canalisations nécessaires à l’alimentation d’un réseau hydraulique, d’un réservoir, d’un canal, etc.
status: 1

station de pompage
type: Concept
modified: 2014-12-02T12:48:07+01:00
in scheme: Thésaurus de la désignation des œuvres architecturales et des espaces aménagés
preferred label: pumping stations @en-us
broader: ouvrage lié à l'alimentation en eau
created: 2011-09-01T00:00:00+02:00
definition: Ouvrage regroupant les installations nécessaires au pompage des eaux, généralement souterraines, en vue de leur utilisation.
status: 1

vanne
type: Concept
modified: 2014-10-16T15:22:40+02:00
in scheme: Thésaurus de la désignation des œuvres architecturales et des espaces aménagés
preferred label: sluice gates @en-us
broader: ouvrage lié à l'alimentation en eau
created: 2011-09-01T00:00:00+02:00
scope note: Ne pas confondre avec porte de garde, ni avec porte d'écluse, qui assure le passage à la navigation.
definition: Ouvrage de régulation des eaux, permettant à volonté la mise en communication de deux plans d’eau ou leur isolement l’un de l’autre. L’ouvrage se compose le plus souvent d’une porte mobile placée verticalement entre deux coulisses.
status: 1

poste d'observation
type: Concept
modified: 2015-01-05T13:33:16+01:00
in scheme: Thésaurus de la désignation des œuvres architecturales et des espaces aménagés
preferred label: watchtowers @en-us
broader: ouvrage militaire
alternative label: observatoire d'artillerie
alternative label: poste de guet
created: 2011-09-01T00:00:00+02:00
scope note: Ne pas confondre avec mirador, ni avec poste d’affût.
definition: Ouvrage isolé ou partie d'un ouvrage, permanent ou temporaire, aménagé en un lieu élevé pour permettre la surveillance d'une étendue de terrain, l'observation du tir. Le poste d'observation peut être fortifié, camouflé, cuirassé, équipé de matériel optique.
status: 1

rampe de lancement
type: Concept
modified: 2014-10-21T14:04:05+02:00
in scheme: Thésaurus de la désignation des œuvres architecturales et des espaces aménagés
preferred label: launching ramps @en-us
broader: ouvrage militaire
created: 2011-09-01T00:00:00+02:00
related: pas de tir
definition: Structure permettant le lancement de missiles ou d'engins spatiaux.
TermeAssocie: pas de tir
status: 1

palais de justice
type: Concept
modified: 2015-01-05T10:36:38+01:00
in scheme: Thésaurus de la désignation des œuvres architecturales et des espaces aménagés
broader: tribunal
created: 2011-09-01T00:00:00+02:00
definition: Édifice où siègent les cours et tribunaux.
status: 1
broad match: http://vocab.getty.edu/aat/300005969

parc de chasse
type: Concept
modified: 2014-10-14T12:03:41+02:00
in scheme: Thésaurus de la désignation des œuvres architecturales et des espaces aménagés
preferred label: preserves @en-us
broader: parc
alternative label: grand parc
created: 2011-09-01T00:00:00+02:00
definition: Réserve de chasse destinée à la vénerie et, accessoirement, à d'autres formes de chasse : fauconnerie, chasse aux toiles, chasse à tir. Dans les grands châteaux, sous l'Ancien Régime, le parc de chasse porte souvent le nom de grand parc.
status: 1

petit parc
type: Concept
modified: 2014-12-31T11:06:21+01:00
in scheme: Thésaurus de la désignation des œuvres architecturales et des espaces aménagés
broader: parc
created: 2011-09-01T00:00:00+02:00
definition: Parc d'agrément proche d'une demeure, généralement constitué par des arbres forestiers de moyenne futaie comportant des bosquets. Il assure la transition entre le jardin régulier et le parc de chasse.
status: 1
broad match: cb11933025j
broad match: http://vocab.getty.edu/aat/300254248

parfumerie
type: Concept
modified: 2015-02-06T16:07:46+01:00
in scheme: Thésaurus de la désignation des œuvres architecturales et des espaces aménagés
narrower: usine de cosmétiques
broader: usine de produits chimiques
created: 2011-09-01T00:00:00+02:00
definition: Usine où l'on fabrique des parfums et des produits de toilette et de beauté : shampooings, dentifrices, etc. Elle comprend généralement un laboratoire, un réservoir industriel, un atelier de conditionnement, un magasin industriel, etc.
status: 1

usine de produits chimiques
type: Concept
modified: 2015-02-06T15:35:02+01:00
in scheme: Thésaurus de la désignation des œuvres architecturales et des espaces aménagés
narrower: parfumerie
narrower: raffinerie de pétrole
narrower: usine de traitement des corps gras
narrower: usine d'acide sulfurique
narrower: usine de produits explosifs
narrower: usine de caoutchouc
narrower: usine de matières plastiques
narrower: usine de matières colorantes synthétiques
narrower: usine d'engrais
narrower: usine d'ouvrages en amiante
narrower: usine de colles
narrower: usine de fabrication et distillation des goudrons
narrower: usine de fibres artificielles et synthétiques
narrower: usine de gaz comprimés
narrower: usine de produits électrochimiques
narrower: usine de produits d'entretien
narrower: usine de produits organiques de synthèse
narrower: usine de produits pharmaceutiques
narrower: usine de produits photographiques et cinématographiques
narrower: usine de produits phytosanitaires
narrower: usine de soufre
broader: usine
created: 2011-09-01T00:00:00+02:00
definition: Usine où l'on fabrique des produits de base, des produits issus de la pétrochimie, de la chimie phytosanitaire, de l'oléochimie et où l’on élabore des polymères, des produits pharmaceutiques ou de parfumerie, des peintures, etc.
status: 1

usine de cosmétiques
type: Concept
modified: 2015-02-06T16:20:55+01:00
in scheme: Thésaurus de la désignation des œuvres architecturales et des espaces aménagés
broader: parfumerie
created: 2011-09-01T00:00:00+02:00
definition: Usine où l'on fabrique des produits d'hygiène et de beauté, et comprenant généralement un bureau, un laboratoire, un atelier deconditionnement , un magasin industriel, etc.
status: 1

parlement
type: Concept
modified: 2015-01-05T10:41:02+01:00
in scheme: Thésaurus de la désignation des œuvres architecturales et des espaces aménagés
broader: tribunal
alternative label: cour de parlement
created: 2011-09-01T00:00:00+02:00
definition: Sous l'Ancien Régime, cour souveraine regroupant des chambres aux fonctions judiciaires - tribunaux d'appel et juridiction propre en première instance -, législatives, politiques - enregistrement des édits royaux et remontrances au roi - et administratives - surveillance des douanes, impôts, imprimerie, université, etc.
status: 1

parloir
type: Concept
modified: 2015-02-26T11:27:40+01:00
in scheme: Thésaurus de la désignation des œuvres architecturales et des espaces aménagés
broader: pièce
created: 2011-09-01T00:00:00+02:00
definition: Dans des communautés religieuses, dans des édifices scolaires, dans des prisons, etc., pièce où des personnes du dehors peuvent venir parler aux religieux, aux élèves, aux détenus, etc.
status: 1

parquet
type: Concept
modified: 2015-02-25T10:24:25+01:00
in scheme: Thésaurus de la désignation des œuvres architecturales et des espaces aménagés
preferred label: parquetry @en-us
broader: revêtement de sol
created: 2011-09-01T00:00:00+02:00
scope note: Voir aussi le Thesaurus des objets mobiliers.
definition: Aire de planches appelées lames, clouées et assemblées, soit directement sur les solives, soit, plus souvent, sur les lambourdes.
status: 1

parterre de carrés
type: Concept
modified: 2014-10-14T10:58:53+02:00
in scheme: Thésaurus de la désignation des œuvres architecturales et des espaces aménagés
broader: parterre
created: 2011-09-01T00:00:00+02:00
definition: Parterre constitué de carrés contenant des végétaux d'ornement, des broderies ou d'autres types d'ornement.
status: 1
broad match: Parterre (jardinage)

parterre de gazon
type: Concept
modified: 2014-12-30T16:38:37+01:00
in scheme: Thésaurus de la désignation des œuvres architecturales et des espaces aménagés
broader: parterre
created: 2011-09-01T00:00:00+02:00
definition: Parterre formé d'un tapis de gazon sans découpe ou peu découpé, limité par un passe-pied et généralement entouré de plates-bandes qui peuvent comporter une bordure de buis ou de treillage ; le tapis de gazon peut être nu ou comprendre quelques motifs de broderie.
status: 1

parterre de pièces coupées
type: Concept
modified: 2014-10-14T11:02:15+02:00
in scheme: Thésaurus de la désignation des œuvres architecturales et des espaces aménagés
broader: parterre
created: 2011-09-01T00:00:00+02:00
definition: Parterre constitué par un ensemble de petites pièces séparées par des passe-pieds et plantées de fleurs ou d'arbustes d'ornement. Les pièces sont généralement entourées de plates-bandes ou de bordures de buis.
status: 1
broad match: http://data.bnf.fr/ark:/12148/cb15076134b
broad match: http://vocab.getty.edu/aat/300184573
broad match: Parterre (jardinage)

parterre de broderie
type: Concept
modified: 2014-12-30T16:42:33+01:00
in scheme: Thésaurus de la désignation des œuvres architecturales et des espaces aménagés
preferred label: carpet beds @en-us
broader: parterre
created: 2011-09-01T00:00:00+02:00
definition: Parterre sans compartiments caractérisé par une surface recouverte de terre ou de particules minérales qui forment un fond sur lequel se détachent les motifs de broderie.
status: 1
broad match: Parterre (jardinage)

parterre en mosaïculture
type: Concept
modified: 2014-10-14T11:02:44+02:00
in scheme: Thésaurus de la désignation des œuvres architecturales et des espaces aménagés
broader: parterre
created: 2011-09-01T00:00:00+02:00
definition: Parterre comportant des végétaux d'ornement plantés selon la technique de la mosaïculture.
status: 1

parterre d'eau
type: Concept
modified: 2014-12-31T10:23:26+01:00
in scheme: Thésaurus de la désignation des œuvres architecturales et des espaces aménagés
broader: pièce d'eau
created: 2011-09-01T00:00:00+02:00
definition: Composition formée de plusieurs bassins d'ornement disposés de façon à adopter l'aspect d'un parterre de compartiments. Elle comporte généralement des jeux d'eau.
status: 1

poulailler
type: Concept
modified: 2014-12-30T14:39:41+01:00
in scheme: Thésaurus de la désignation des œuvres architecturales et des espaces aménagés
preferred label: poultry houses @en-us
broader: partie d'édifice agricole
created: 2011-09-01T00:00:00+02:00
definition: Édicule où on élève poules ou autres volailles.
status: 1

pressoir
type: Concept
modified: 2014-12-30T14:43:23+01:00
in scheme: Thésaurus de la désignation des œuvres architecturales et des espaces aménagés
preferred label: presses (culinary tools) @en-us
narrower: pressoir à huile
narrower: pressoir à cidre
narrower: pressoir à vin
broader: partie d'édifice agricole
created: 2011-09-01T00:00:00+02:00
related: parties artisanales
definition: Construction abritant une machine servant à extraire par pression les liquides que contiennent certains fruits ou graines.
TermeAssocie: parties artisanales
status: 1
narrow match: cb11974635k

rucher
type: Concept
modified: 2014-12-30T14:52:39+01:00
in scheme: Thésaurus de la désignation des œuvres architecturales et des espaces aménagés
preferred label: apiaries @en-us
broader: partie d'édifice agricole
created: 2011-09-01T00:00:00+02:00
definition: Construction servant à la fabrication du miel, constituée de ruches qui contiennent les rayons où les abeilles déposent le miel. Les ruches sont installées à proximité d'arbres, de plantes ou de fleurs odoriférantes.
status: 1

vivier
type: Concept
modified: 2014-12-30T14:55:24+01:00
in scheme: Thésaurus de la désignation des œuvres architecturales et des espaces aménagés
preferred label: fishponds @en-us
broader: partie d'édifice agricole
created: 2011-09-01T00:00:00+02:00
definition: Bassin ou étang pour l'élevage, l’engraissage ou la conservation des poissons et crustacés.
status: 1

piste d'athlétisme
type: Concept
modified: 2014-10-10T12:21:21+02:00
in scheme: Thésaurus de la désignation des œuvres architecturales et des espaces aménagés
preferred label: running tracks @en-us
broader: partie d'édifice de culture recherche sport ou loisir
created: 2011-09-01T00:00:00+02:00
definition: Aire couverte ou découverte aménagée pour la course, le saut et le lancer.
status: 1

salle du théâtre
type: Concept
modified: 2014-10-17T16:43:12+02:00
in scheme: Thésaurus de la désignation des œuvres architecturales et des espaces aménagés
broader: partie d'édifice de culture recherche sport ou loisir
created: 2011-09-01T00:00:00+02:00
definition: Partie d'un théâtre où sont placés les spectateurs.
status: 1
broad match: http://data.bnf.fr/ark:/12148/cb11938054b
broad match: http://vocab.getty.edu/aat/300004677

tank à ramer
type: Concept
modified: 2014-12-19T11:27:00+01:00
in scheme: Thésaurus de la désignation des œuvres architecturales et des espaces aménagés
broader: partie d'édifice de culture recherche sport ou loisir
created: 2011-09-01T00:00:00+02:00
definition: Installation d’intérieur destinée à l’entraînement de l’aviron. Elle est généralement composée d’un massif maçonné, flanqué de deux bassins latéraux, sur lequel sont fixés une rangée de postes de nage et leurs accastillages, permettant aux rameurs de reproduire le coup d’aviron dans des conditions idéales pour s’entraîner en cas d’intempéries, améliorer leur technique, se synchroniser, etc. Des miroirs sont généralement apposés aux murs latéraux et en face des rameurs.
status: 1

tribune du public
type: Concept
modified: 2014-10-17T16:46:58+02:00
in scheme: Thésaurus de la désignation des œuvres architecturales et des espaces aménagés
preferred label: grandstands @en-us
broader: partie d'édifice de culture recherche sport ou loisir
created: 2011-09-01T00:00:00+02:00
definition: Ouvrage ou partie d'un édifice, généralement à gradins, où le public prend place afin d'assister à une manifestation sportive ou culturelle.
status: 1

pharmacie
type: Concept
modified: 2015-01-02T12:34:11+01:00
in scheme: Thésaurus de la désignation des œuvres architecturales et des espaces aménagés
broader: partie d'édifice hospitalier d'assistance ou de protection sociale
created: 2011-09-01T00:00:00+02:00
scope note: Ne pas employer pour une officine commerciale.
definition: Partie d'édifice hospitalier abritant le service chargé de l'achat, de la transformation et de la conservation des médicaments qui sont fournis aux malades hospitalisés.
status: 1

salle d'opération
type: Concept
modified: 2014-10-14T15:37:13+02:00
in scheme: Thésaurus de la désignation des œuvres architecturales et des espaces aménagés
preferred label: operating rooms @en-us
broader: partie d'édifice hospitalier d'assistance ou de protection sociale
created: 2011-09-01T00:00:00+02:00
definition: Local destiné à l'exécution des grandes opérations chirurgicales, comportant en son centre une table articulée sur laquelle est installé l'opéré, et dont les dispositions permettent d'en assurer la stérilité, tout en y prodiguant un éclairage optimal : paroi ou couverture vitrée avant l'ère de l'électricité, puis éclairage à lumières mutilples.
status: 1

salle d'audience
type: Concept
modified: 2015-01-05T10:59:24+01:00
in scheme: Thésaurus de la désignation des œuvres architecturales et des espaces aménagés
preferred label: courtrooms @en-us
broader: partie d'édifice judiciaire pénitentiaire ou de police
alternative label: prétoire
alternative label: auditoire
created: 2011-09-01T00:00:00+02:00
definition: Pièce où l'on rend la justice.
status: 1

piscine de pèlerinage
type: Concept
modified: 2014-10-23T10:54:00+02:00
in scheme: Thésaurus de la désignation des œuvres architecturales et des espaces aménagés
broader: partie d'édifice religieux
created: 2011-09-01T00:00:00+02:00
scope note: Ne pas confondre avec piscine.
definition: Dans certains lieux de pèlerinage, bassin où les malades et les fidèles se plongent en signe de pénitence ou dans l'espoir d'une guérison.
status: 1

salle synodale
type: Concept
modified: 2014-10-23T10:55:44+02:00
in scheme: Thésaurus de la désignation des œuvres architecturales et des espaces aménagés
preferred label: sala del sinodo @it
preferred label: synodal hall @en-gb
broader: partie d'édifice religieux
created: 2011-09-01T00:00:00+02:00
definition: Partie d'édifice où se tient l'assemblée d'ecclésiastiques convoquée par l'évêque pour délibérer sur les affaires du diocèse ou de la province ecclésiastique.
status: 1

préau
type: Concept
modified: 2014-12-08T11:44:45+01:00
in scheme: Thésaurus de la désignation des œuvres architecturales et des espaces aménagés
broader: partie d'édifice scolaire
created: 2011-09-01T00:00:00+02:00
definition: Partie couverte d'une cour d'école.
status: 1

parvis
type: Concept
modified: 2015-01-07T12:14:21+01:00
in scheme: Thésaurus de la désignation des œuvres architecturales et des espaces aménagés
preferred label: sagrato @it
preferred label: parvises @en-us
broader: place
created: 2011-09-01T00:00:00+02:00
related: partie d'église
definition: À l'origine, parvis désigne seulement un espace libre aménagé devant la façade principale d'une église.
definition: Petite place ménagée devant l'entrée de certains édifices importants, en général délimitée par une barrière, un garde-corps ou un emmarchement.
TermeAssocie: partie d'église
status: 1

sacristie
type: Concept
modified: 2014-11-28T16:01:53+01:00
in scheme: Thésaurus de la désignation des œuvres architecturales et des espaces aménagés
preferred label: sagrestia @it
preferred label: sacristy @en-gb
preferred label: sacristies @en-us
broader: partie d'église
created: 2011-09-01T00:00:00+02:00
definition: Annexe d'une église abritant les meubles de rangement des objets, linges et vêtements liturgiques ou liés à l'exercice du culte. C'est aussi le lieu où le desservant se prépare pour l'office
status: 1

tour lanterne
type: Concept
modified: 2014-10-15T17:37:02+02:00
in scheme: Thésaurus de la désignation des œuvres architecturales et des espaces aménagés
preferred label: tiburio + lanterna @it
preferred label: crossing tower @en-gb
preferred label: crossing towers @en-us
broader: partie d'église
created: 2011-09-01T00:00:00+02:00
definition: Tour dans-œuvre percée de baies qui éclairent directement l'espace intérieur du bâtiment sur lequel elle est construite. Elle comprend parfois d'autres étages, notamment une chambre des cloches.
status: 1

transept
type: Concept
modified: 2014-10-15T17:37:36+02:00
in scheme: Thésaurus de la désignation des œuvres architecturales et des espaces aménagés
preferred label: transepts @en-us
preferred label: transetto @it
broader: partie d'église
created: 2011-09-01T00:00:00+02:00
definition: Corps transversal formant une croix avec le corps longitudinal de l'église. Il n'est pas toujours saillant.
status: 1

salle du trésor
type: Concept
modified: 2014-10-23T10:58:57+02:00
in scheme: Thésaurus de la désignation des œuvres architecturales et des espaces aménagés
preferred label: tresoro di una chiesa @it
preferred label: treasury @en-gb
preferred label: treasuries @en-us
broader: partie d'église
created: 2011-09-01T00:00:00+02:00
definition: Pièce où sont entreposés les biens les plus précieux d'une église ou d'un établissement conventuel.
status: 1

tribune d'orgue
type: Concept
modified: 2015-02-25T10:18:39+01:00
in scheme: Thésaurus de la désignation des œuvres architecturales et des espaces aménagés
preferred label: tribuna d'organo @it
preferred label: organ loft @en-gb
preferred label: organ lofts & choir lofts @en-us
broader: tribune
created: 2011-09-01T00:00:00+02:00
scope note: Voir aussi le Thesaurus des objets mobiliers.
definition: Tribune destinée à porter l'orgue.
status: 1

pavillon
type: Concept
modified: 2015-02-25T16:33:30+01:00
in scheme: Thésaurus de la désignation des œuvres architecturales et des espaces aménagés
preferred label: pavilions @en-us
broader: partie ou élément commun à tous les types d'architecture et aux espaces aménagés
created: 2011-09-01T00:00:00+02:00
scope note: Le pavillon est une forme architecturale, il ne présente pas de fonction particulière. Pour les édifices connus sous le nom de pavillon, réserver ce terme à la désignation complète de l’édifice.
related: pavillon de jardin
definition: Bâtiment ou corps de bâtiment caractérisé par un plan sensiblement carré. Un pavillon peut être isolé, hors-œuvre, demi-hors-œuvre, dans-œuvre, sur l'angle, dans l'angle.
TermeAssocie: pavillon de jardin
status: 1

piège à animaux
type: Concept
modified: 2014-10-16T11:37:42+02:00
in scheme: Thésaurus de la désignation des œuvres architecturales et des espaces aménagés
preferred label: traps (trapping equipment) @en-us
broader: partie ou élément commun à tous les types d'architecture et aux espaces aménagés
created: 2011-09-01T00:00:00+02:00
definition: Ouvrage (fosse, aménagement de palissades, etc.) destiné à capturer les animaux sauvages : ours, loup, sanglier, etc.
status: 1

séchoir
type: Concept
modified: 2015-02-26T11:47:34+01:00
in scheme: Thésaurus de la désignation des œuvres architecturales et des espaces aménagés
preferred label: drying sheds @en-us
narrower: séchoir à fromages
narrower: séchoir à chanvre
narrower: séchoir à châtaignes
narrower: séchoir à chicorée
narrower: séchoir à houblon
narrower: séchoir à maïs
narrower: séchoir à peaux
narrower: séchoir à tabac
broader: partie ou élément commun à tous les types d'architecture et aux espaces aménagés
created: 2011-09-01T00:00:00+02:00
related: pièce de séchage
definition: Bâtiment ou partie d'édifice destiné au séchage de produits agricoles.
TermeAssocie: pièce de séchage
status: 1

silo
type: Concept
modified: 2015-02-26T12:08:17+01:00
in scheme: Thésaurus de la désignation des œuvres architecturales et des espaces aménagés
preferred label: silos @en-us
broader: partie ou élément commun à tous les types d'architecture et aux espaces aménagés
alternative label: silo à grains
created: 2011-09-01T00:00:00+02:00
scope note: Ne pas confondre avec réservoir industriel.
definition: Cavité creusée dans le sol ou réservoir en métal ou en maçonnerie aménagé ou construit dans une exploitation agricole, une usine, un port, une gare, etc. dans lequel on stocke des matériaux ou des produits en vrac.
status: 1

tour
type: Concept
modified: 2015-02-26T12:18:46+01:00
in scheme: Thésaurus de la désignation des œuvres architecturales et des espaces aménagés
preferred label: towers @en-us
narrower: tourelle
broader: partie ou élément commun à tous les types d'architecture et aux espaces aménagés
created: 2011-09-01T00:00:00+02:00
scope note: La tour est une forme architecturale, elle ne présente pas de fonction particulière. Ne pas appeler tour un pavillon, ni un colombier en forme de tour.
related: tour de jardin
definition: Bâtiment ou corps de bâtiment caractérisé par son plan massé et son développement en hauteur. La tour isolée est un bâtiment ; la tour demi-hors-œuvre, hors-œuvre, sur l'angle, dans l'angle est un corps de bâtiment.
TermeAssocie: tour de jardin
status: 1

vaisseau
type: Concept
modified: 2015-02-26T12:24:37+01:00
in scheme: Thésaurus de la désignation des œuvres architecturales et des espaces aménagés
preferred label: aisles @en-us
broader: partie ou élément commun à tous les types d'architecture et aux espaces aménagés
created: 2011-09-01T00:00:00+02:00
definition: Espace intérieur caractérisé par son développement dans la plus grande partie de la hauteur d'un bâtiment ou sur la hauteur de plusieurs étages quand ce bâtiment en comporte.
status: 1

vestiaire
type: Concept
modified: 2015-02-26T12:31:22+01:00
in scheme: Thésaurus de la désignation des œuvres architecturales et des espaces aménagés
preferred label: cloakrooms & locker rooms @en-us
broader: partie ou élément commun à tous les types d'architecture et aux espaces aménagés
alternative label: salle des pendus
created: 2011-09-01T00:00:00+02:00
definition: Édifice ou partie d'édifice construit ou aménagé dans une usine, une entreprise, un lieu sportif ou culturel, etc., où l'on peut changer de tenue ou déposer ses affaires. Il peut comprendre des douches, etc.
status: 1

pièce de séchage
type: Concept
modified: 2015-04-08T11:36:21+02:00
in scheme: Thésaurus de la désignation des œuvres architecturales et des espaces aménagés
broader: parties industrielles
created: 2011-09-01T00:00:00+02:00
related: séchoir
definition: Pièce aménagée pour le séchage des produits : industrie céramique, industrie textile, tannerie, etc.
TermeAssocie: séchoir
status: 1

pièce de stockage du combustible
type: Concept
modified: 2015-04-30T17:05:47+02:00
in scheme: Thésaurus de la désignation des œuvres architecturales et des espaces aménagés
broader: parties industrielles
created: 2011-09-01T00:00:00+02:00
definition: Pièce réservée au stockage du combustible en attente de son utilisation.
status: 1

poste de chargement
type: Concept
modified: 2015-04-08T12:59:15+02:00
in scheme: Thésaurus de la désignation des œuvres architecturales et des espaces aménagés
broader: parties industrielles
created: 2011-09-01T00:00:00+02:00
scope note: Voir aussi le Thesaurus des objets mobiliers.
definition: Construction à palans, treuils, etc., où se fait le chargement des produits manufacturés pour leur expédition.
status: 1

puits d'aérage
type: Concept
modified: 2015-04-30T17:08:28+02:00
in scheme: Thésaurus de la désignation des œuvres architecturales et des espaces aménagés
broader: parties industrielles
created: 2011-09-01T00:00:00+02:00
definition: Sur un site minier, puits ou tunnel destiné à assurer la circulation de l'air dans le chantier d'exploitation.
status: 1

puits d'extraction
type: Concept
modified: 2015-04-08T15:34:58+02:00
in scheme: Thésaurus de la désignation des œuvres architecturales et des espaces aménagés
broader: parties industrielles
created: 2011-09-01T00:00:00+02:00
definition: Sur un site minier, puits qui sert à évacuer au jour le charbon ou le minerai, généralement équipé de cages ou de skips.
status: 1

puits de service
type: Concept
modified: 2015-04-08T15:41:55+02:00
in scheme: Thésaurus de la désignation des œuvres architecturales et des espaces aménagés
broader: parties industrielles
created: 2011-09-01T00:00:00+02:00
definition: Sur un site minier, puits exclusivement réservé à l'acheminement du personnel et du matériel de fond. Toujours équipé de cages, il sert aussi souvent comme puits de secours ou de retour d'air.
status: 1

puits de sondage
type: Concept
modified: 2013-04-23T00:00:00+02:00
in scheme: Thésaurus de la désignation des œuvres architecturales et des espaces aménagés
broader: parties industrielles
created: 2011-09-01T00:00:00+02:00
related: saline
definition: Dans une saline, trou foré qui permet d'injecter de l'eau douce dans un gisement de sel gemme, afin d'en pomper la saumure.
TermeAssocie: saline
status: 1

salle des machines
type: Concept
modified: 2015-04-09T16:23:05+02:00
in scheme: Thésaurus de la désignation des œuvres architecturales et des espaces aménagés
broader: parties industrielles
created: 2011-09-01T00:00:00+02:00
definition: Bâtiment ou local où se trouvent les moteurs fournissant l'énergie nécessaire au fonctionnement de l'usine : machines à vapeur, compresseurs, etc.
status: 1

terril
type: Concept
modified: 2015-04-09T16:09:13+02:00
in scheme: Thésaurus de la désignation des œuvres architecturales et des espaces aménagés
broader: parties industrielles
created: 2011-09-01T00:00:00+02:00
definition: Sur un site minier, dépôt de produits stériles ou de déblais constitué par la décharge des déchets.
status: 1

tour de réfrigération
type: Concept
modified: 2015-04-15T12:12:55+02:00
in scheme: Thésaurus de la désignation des œuvres architecturales et des espaces aménagés
broader: parties industrielles
created: 2011-09-01T00:00:00+02:00
definition: Ouvrage en maçonnerie servant à abaisser la température d'un liquide, d'un gaz dans l'industrie chimique, une centrale nucléaire, etc.
status: 1

transporteur automatique par câbles
type: Concept
modified: 2015-04-30T17:15:25+02:00
in scheme: Thésaurus de la désignation des œuvres architecturales et des espaces aménagés
broader: parties industrielles
created: 2011-09-01T00:00:00+02:00
definition: Installation sur pylones comportant un ou deux câbles auxquels sont suspendues les bennes de transport des produits (industrie extractive, cimenterie, usine de chaux, etc.). Elle comprend généralement des postes de chargement et de déchargement, un poste de commande, etc.
status: 1

passage
type: Concept
modified: 2015-01-07T13:16:59+01:00
in scheme: Thésaurus de la désignation des œuvres architecturales et des espaces aménagés
preferred label: alley @en-gb
narrower: passage couvert
broader: voie
created: 2011-09-01T00:00:00+02:00
definition: Voie publique ou privée, établie au travers d'un ou plusieurs bâtiments, et traversant un îlot complètement ou en partie. Il peut ne desservir qu'une parcelle enclavée.
status: 1
narrow match: http://data.bnf.fr/ark:/12148/cb12076352d

passerelle
type: Concept
modified: 2014-12-02T13:06:10+01:00
in scheme: Thésaurus de la désignation des œuvres architecturales et des espaces aménagés
preferred label: footbridges @en-us
broader: pont
created: 2011-09-01T00:00:00+02:00
definition: Pont réservé aux piétons, aux cyclistes et parfois aux animaux.
status: 1

pavement
type: Concept
modified: 2015-02-25T10:25:18+01:00
in scheme: Thésaurus de la désignation des œuvres architecturales et des espaces aménagés
preferred label: pavements (surface elements) @en-us
broader: revêtement de sol
created: 2011-09-01T00:00:00+02:00
definition: Voir aussi le Thesaurus des objets mobiliers.
definition: Aire de pierres, de briques, de carreaux en céramique, en béton, etc., posée sur une couche de support et d'isolement appelée forme.
status: 1

tribune
type: Concept
modified: 2015-02-25T10:17:47+01:00
in scheme: Thésaurus de la désignation des œuvres architecturales et des espaces aménagés
narrower: tribune d'orgue
broader: pièce
created: 2011-09-01T00:00:00+02:00
scope note: Ne pas confondre tribune découverte avec balcon, ni avec loggia. Ne pas confondre avec tribune du public. Voir aussi le Thesaurus des objets mobiliers.
definition: Pièce ou galerie placée à l'étage, ouvrant sur l'intérieur d'un vaisseau ou constituant par elle-même un demi-étage s'ouvrant sur l'intérieur d'une pièce.
status: 1
narrow match: http://vocab.getty.edu/aat/300082077

véranda
type: Concept
modified: 2015-02-26T11:30:49+01:00
in scheme: Thésaurus de la désignation des œuvres architecturales et des espaces aménagés
broader: pièce
alternative label: varangue
created: 2011-09-01T00:00:00+02:00
scope note: Ne pas confondre avec jardin d’hiver.
definition: Pièce ou galerie hors-œuvre en rez-de-chaussée, vitrée sur toutes ses faces.
status: 1

vestibule
type: Concept
modified: 2015-02-26T11:33:38+01:00
in scheme: Thésaurus de la désignation des œuvres architecturales et des espaces aménagés
preferred label: vestibules & entrance halls @en-us
broader: pièce
alternative label: hall
created: 2011-09-01T00:00:00+02:00
definition: Pièce d'entrée assurant la communication entre l'extérieur et les autres pièces.
status: 1

pièce d'affinage
type: Concept
modified: 2015-02-26T11:57:22+01:00
in scheme: Thésaurus de la désignation des œuvres architecturales et des espaces aménagés
broader: séchoir à fromages
created: 2011-09-01T00:00:00+02:00
definition: Pièce spécialement aménagée pour l'achèvement de la maturation des fromages.
status: 1

vertugadin
type: Concept
modified: 2014-09-30T15:06:15+02:00
in scheme: Thésaurus de la désignation des œuvres architecturales et des espaces aménagés
broader: pièce de gazon
created: 2011-09-01T00:00:00+02:00
definition: Pièce de gazon plantée sur une surface concave, cernée en totalité ou en partie par un glacis ou un talus, parfois bordée d'une palissade.
status: 1
broad match: http://data.bnf.fr/ark:/12148/cb11965436d
broad match: http://vocab.getty.edu/aat/300008889

platinerie
type: Concept
modified: 2013-04-23T00:00:00+02:00
in scheme: Thésaurus de la désignation des œuvres architecturales et des espaces aménagés
broader: usine de transformation des métaux
created: 2011-09-01T00:00:00+02:00
definition: Usine où se trouve un marteau mû au moyen d'une roue à cames, utilisé pour le martelage des métaux en vue d'obtenir des plaques, des tôles, etc.
status: 1

plâtrière
type: Concept
modified: 2015-02-03T11:48:45+01:00
in scheme: Thésaurus de la désignation des œuvres architecturales et des espaces aménagés
broader: usine de fabrication de matériaux de construction
created: 2011-09-01T00:00:00+02:00
definition: Usine où l'on fabrique le plâtre et comprenant généralement une excavation, un four industriel, un atelier de conditionnement, etc.
status: 1

pont canal
type: Concept
modified: 2014-12-02T13:07:17+01:00
in scheme: Thésaurus de la désignation des œuvres architecturales et des espaces aménagés
broader: pont
created: 2011-09-01T00:00:00+02:00
definition: Ouvrage de franchissement permettant le passage d'un canal.
status: 1

pont à plusieurs niveaux
type: Concept
modified: 2014-10-23T13:13:37+02:00
in scheme: Thésaurus de la désignation des œuvres architecturales et des espaces aménagés
broader: pont
created: 2011-09-01T00:00:00+02:00
definition: Ouvrage de franchissement portant à des niveaux superposés des voies de communication pouvant appartenir à des réseaux de communication différents (route/rail, etc.).
status: 1

pont mobile
type: Concept
modified: 2014-12-02T13:08:17+01:00
in scheme: Thésaurus de la désignation des œuvres architecturales et des espaces aménagés
preferred label: movable bridges @en-us
broader: pont
alternative label: pont basculant
alternative label: pont tournant
alternative label: pont transbordeur
created: 2011-09-01T00:00:00+02:00
scope note: Ne pas confondre le pont basculant avec le pont-bascule, ni le pont levant avec le pont-levis.
related: pont-levis
definition: Pont muni d'un système technique permettant soit à une plate-forme de glisser le long du tablier (pont transbordeur), soit à son tablier de s'effacer (pont basculant, pont oscillant, pont tournant, pont roulant, pont levant) afin de ne pas entraver la circulation des bateaux ou leur halage.
TermeAssocie: pont-levis
status: 1

tour porche
type: Concept
modified: 2015-02-25T13:48:27+01:00
in scheme: Thésaurus de la désignation des œuvres architecturales et des espaces aménagés
broader: porche
created: 2011-09-01T00:00:00+02:00
scope note: Ne pas confondre avec tour-porte.
definition: Tour formant avant-corps devant un bâtiment, religieux ou non, et dont le rez-de-chaussée est occupé par un porche.
status: 1

toit à porcs
type: Concept
modified: 2014-12-30T14:23:33+01:00
in scheme: Thésaurus de la désignation des œuvres architecturales et des espaces aménagés
broader: porcherie
alternative label: soue
created: 2011-09-01T00:00:00+02:00
definition: Abri de petite taille destiné à abriter un ou deux porcs. Il peut constituer une annexe d'une habitation rurale qui ne serait pas une ferme.
status: 1
broad match: http://data.bnf.fr/ark:/12148/cb11941344c
broad match: http://vocab.getty.edu/aat/300136805
broad match: Porcherie

portail
type: Concept
modified: 2015-02-24T16:53:32+01:00
in scheme: Thésaurus de la désignation des œuvres architecturales et des espaces aménagés
preferred label: portals @en-us
narrower: porte cochère
broader: porte
created: 2011-09-01T00:00:00+02:00
scope note: Ne pas appeler portail chacune des portes de cette composition. Voir aussi le Thesaurus des objets mobiliers.
definition: Composition monumentale à une ou plusieurs portes extérieures.
status: 1

porte cochère
type: Concept
modified: 2015-02-25T11:24:09+01:00
in scheme: Thésaurus de la désignation des œuvres architecturales et des espaces aménagés
preferred label: porte-cochères @en-us
narrower: porte charretière
broader: portail
created: 2011-09-01T00:00:00+02:00
definition: Porte à deux vantaux donnant passage aux voitures.
status: 1

porte charretière
type: Concept
modified: 2015-02-25T11:26:38+01:00
in scheme: Thésaurus de la désignation des œuvres architecturales et des espaces aménagés
broader: porte cochère
created: 2011-09-01T00:00:00+02:00
definition: Porte de ferme donnant principalement passage aux véhicules agricoles.
status: 1
broad match: http://vocab.getty.edu/aat/300004143
broad match: http://data.bnf.fr/ark:/12148/cb122738098

poste d'aiguillage
type: Concept
modified: 2014-12-02T14:47:37+01:00
in scheme: Thésaurus de la désignation des œuvres architecturales et des espaces aménagés
preferred label: railroad signal towers @en-us
broader: poste de commande
created: 2011-09-01T00:00:00+02:00
scope note: L'appareil de voie, comme son dispositif de commande, fait l’objet d’un dossier objet mobilier.
definition: Édifice ou édicule abritant, en les regroupant, les dispositifs (mécaniques, électromécaniques, électriques, etc.) permettant de commander des appareils de voie, appelés aiguillages dans le langage courant.
status: 1

sous-préfecture
type: Concept
modified: 2014-12-05T12:26:49+01:00
in scheme: Thésaurus de la désignation des œuvres architecturales et des espaces aménagés
broader: préfecture
created: 2011-09-01T00:00:00+02:00
definition: Édifice où sont installés les services du sous-préfet et parfois sa résidence.
status: 1

pressoir à cidre
type: Concept
modified: 2014-12-30T14:45:08+01:00
in scheme: Thésaurus de la désignation des œuvres architecturales et des espaces aménagés
preferred label: cider presses @en-us
broader: pressoir
created: 2011-09-01T00:00:00+02:00
definition: Pressoir à pommes en vue de la fabrication du cidre.
status: 1

pressoir à vin
type: Concept
modified: 2014-12-30T14:47:21+01:00
in scheme: Thésaurus de la désignation des œuvres architecturales et des espaces aménagés
preferred label: wine presses @en-us
broader: pressoir
created: 2011-09-01T00:00:00+02:00
definition: Pressoir servant à extraire du raisin le jus destiné à la fabrication du vin.
status: 1

puits de gaz naturel
type: Concept
modified: 2014-09-23T16:06:18+02:00
in scheme: Thésaurus de la désignation des œuvres architecturales et des espaces aménagés
broader: usine d'extraction
created: 2011-09-01T00:00:00+02:00
definition: Trou cylindrique vertical foré dans le sol pour l'extraction du gaz naturel, équipé d'un tube de production qui assure la communication directe avec le réservoir.
status: 1

saline
type: Concept
modified: 2015-01-21T16:00:51+01:00
in scheme: Thésaurus de la désignation des œuvres architecturales et des espaces aménagés
preferred label: brine fields @en-us
broader: usine d'extraction
created: 2011-09-01T00:00:00+02:00
related: puits de sondage
definition: Usine où l'on produit du sel à partir du sel gemme ou d'une saumure, comprenant généralement des installations d'évaporation à feu nu (poêles) ou de fusion (fours industriels, cuves de granulation, etc.).
TermeAssocie: puits de sondage
status: 1

technopole
type: Concept
modified: 2014-10-17T15:01:57+02:00
in scheme: Thésaurus de la désignation des œuvres architecturales et des espaces aménagés
preferred label: science park @en-gb
broader: quartier
created: 2011-09-01T00:00:00+02:00
definition: Complexe destiné aux entreprises de haute technologie, commerciales, industrielles ou de services, équipé des réseaux et infrastructures nécessaires, et incluant parfois des institutions d’enseignement et de recherche.
status: 1

village olympique
type: Concept
modified: 2014-10-17T15:02:45+02:00
in scheme: Thésaurus de la désignation des œuvres architecturales et des espaces aménagés
preferred label: villaggio olimpico @it
preferred label: olympic village @en-gb
preferred label: olympic villages @en-us
broader: quartier
created: 2011-09-01T00:00:00+02:00
definition: Quartier résidentiel construit pour abriter les sportifs et leurs entraîneurs lors de jeux olympiques. Ces équipements servent généralement par la suite de logements à d'autres habitants.
status: 1

raffinerie de pétrole
type: Concept
modified: 2015-02-06T16:37:57+01:00
in scheme: Thésaurus de la désignation des œuvres architecturales et des espaces aménagés
broader: usine de produits chimiques
created: 2011-09-01T00:00:00+02:00
definition: Usine où s'effectue le raffinage du pétrole brut en vue d'en obtenir des produits commerciaux, tels qu'essences, gazole, lubrifiants, etc. Elle comprend généralement un laboratoire, un réservoir industriel, une chaufferie, une station d'épuration, etc.
status: 1

raffinerie de sucre
type: Concept
modified: 2015-04-29T15:17:52+02:00
in scheme: Thésaurus de la désignation des œuvres architecturales et des espaces aménagés
broader: sucrerie
created: 2011-09-01T00:00:00+02:00
definition: Usine où l'on raffine le sucre brut en le refondant, le clarifiant, le décolorant et le recristallisant en vue de sa commercialisation. Elle comprend généralement un entrepôt industriel, un magasin industriel, etc.
status: 1

sucrerie
type: Concept
modified: 2015-04-29T15:15:06+02:00
in scheme: Thésaurus de la désignation des œuvres architecturales et des espaces aménagés
narrower: raffinerie de sucre
broader: usine de produits agro-alimentaires
created: 2011-09-01T00:00:00+02:00
definition: Usine où l'on fabrique du sucre de betterave ou de canne. Elle est équipée de diffuseurs, de filtres-presses, de chaudières, de malaxeurs cristalliseurs, etc. Elle comprend généralement un pont-bascule, un hangar, un four à chaux, etc.
status: 1

râperie
type: Concept
modified: 2015-02-04T16:23:22+01:00
in scheme: Thésaurus de la désignation des œuvres architecturales et des espaces aménagés
broader: usine de préparation d'un produit agroalimentaire
created: 2011-09-01T00:00:00+02:00
definition: Usine où l'on râpe les betteraves à sucre en fines lamelles dites cossettes et où l'on prépare le jus sucré extrait de ces cossettes. Elle comprend généralement une aire des matières premières, un pont-bascule, une aire de lavage, etc.
status: 1

terrasse en terre-plein
type: Concept
modified: 2014-12-31T11:27:06+01:00
in scheme: Thésaurus de la désignation des œuvres architecturales et des espaces aménagés
preferred label: terraces @en-us
broader: relief artificiel de jardin
created: 2011-09-01T00:00:00+02:00
definition: Terre-plein d'une levée de terre maçonnée ou talutée, mettant de niveau un terrain en pente.
status: 1
broad match: http://data.bnf.fr/ark:/12148/cb119787841

vallon artificiel
type: Concept
modified: 2014-10-22T12:18:02+02:00
in scheme: Thésaurus de la désignation des œuvres architecturales et des espaces aménagés
broader: relief artificiel de jardin
created: 2011-09-01T00:00:00+02:00
definition: Vallon créé artificiellement pour l'ornementation d'un jardin.
status: 1

remise à bateau
type: Concept
modified: 2014-12-31T15:58:20+01:00
in scheme: Thésaurus de la désignation des œuvres architecturales et des espaces aménagés
preferred label: boathouses @en-us
broader: remise
created: 2011-09-01T00:00:00+02:00
definition: Local où l'on abrite des bateaux.
status: 1

réseau de transport par câble
type: Concept
modified: 2014-10-17T10:09:28+02:00
in scheme: Thésaurus de la désignation des œuvres architecturales et des espaces aménagés
broader: réseau de transport
created: 2011-09-01T00:00:00+02:00
related: remontée mécanique
definition: Réseau d'installations nécessaires au transport par câble des biens ou des personnes.
TermeAssocie: remontée mécanique
status: 1

téléphérique
type: Concept
modified: 2014-12-02T15:00:04+01:00
in scheme: Thésaurus de la désignation des œuvres architecturales et des espaces aménagés
broader: remontée mécanique
alternative label: téléférique
created: 2011-09-01T00:00:00+02:00
definition: Infrastructure comportant plusieurs câbles (porteur ou tracteur) pour le transport de voyageurs dans une cabine suspendue. Ces câbles sont tendus entre deux gares et peuvent être soutenus en ligne par des pylônes.
status: 1

réseau d'adduction des eaux
type: Concept
modified: 2014-10-17T10:17:00+02:00
in scheme: Thésaurus de la désignation des œuvres architecturales et des espaces aménagés
preferred label: Water supply systems @en-us
broader: réseau hydraulique
alternative label: système d'adduction des eaux
created: 2011-09-01T00:00:00+02:00
definition: Réseau d'installations nécessaires à la distribution de l'eau. Il comprend des stations de pompage, des conduites, etc.
status: 1

réseau d'air comprimé
type: Concept
modified: 2014-10-17T09:15:56+02:00
in scheme: Thésaurus de la désignation des œuvres architecturales et des espaces aménagés
preferred label: compressed air utilities @en-us
broader: réseau d'équipement urbain
created: 2011-09-01T00:00:00+02:00
definition: Réseau d'installations nécessaires à la distribution d'air comprimé. Il comprend notamment des canalisations, des stations d'air comprimé, etc.
status: 1

réseau d'équipement urbain
type: Concept
modified: 2014-09-24T10:33:30+02:00
in scheme: Thésaurus de la désignation des œuvres architecturales et des espaces aménagés
preferred label: utilities @en-us
narrower: réseau d'air comprimé
narrower: réseau d'éclairage urbain
narrower: réseau de chauffage urbain
narrower: réseau de distribution électrique
narrower: réseau du gaz
broader: réseau du génie civil
created: 2011-09-01T00:00:00+02:00
related: voie
definition: Réseau d'équipements permettant la distribution d'énergies, d'eau, etc., ou leur évacuation, sur une même unité territoriale.
TermeAssocie: voie
status: 1
broad match: http://data.bnf.fr/ark:/12148/cb124980049

réseau d'éclairage urbain
type: Concept
modified: 2014-10-17T09:17:05+02:00
in scheme: Thésaurus de la désignation des œuvres architecturales et des espaces aménagés
preferred label: street lighting @en-us
broader: réseau d'équipement urbain
alternative label: éclairage urbain
created: 2011-09-01T00:00:00+02:00
definition: Réseau d'équipements permettant l'éclairage des espaces publics au moyen de lampadaires, de candélabres, etc.
status: 1

réseau d'égout
type: Concept
modified: 2014-10-17T10:16:06+02:00
in scheme: Thésaurus de la désignation des œuvres architecturales et des espaces aménagés
preferred label: sewers (drainage structures) @en-us
broader: réseau hydraulique
alternative label: réseau unitaire
created: 2011-09-01T00:00:00+02:00
definition: Réseau de conduites, généralement souterraines, destiné à collecter et à évacuer les eaux usées et les eaux de pluie, séparément ou ensemble.
status: 1

réseau de chauffage urbain
type: Concept
modified: 2014-10-17T09:18:26+02:00
in scheme: Thésaurus de la désignation des œuvres architecturales et des espaces aménagés
preferred label: heating systems @en-us
broader: réseau d'équipement urbain
created: 2011-09-01T00:00:00+02:00
definition: Réseau d'équipements destinés au chauffage des habitations, des bureaux ou de tous autres locaux, à partir d’une centrale de chauffe commune à un quartier ou à un aménagement urbain, par le biais de canalisations d’eau chaude ou de vapeur.
status: 1

réseau de distribution électrique
type: Concept
modified: 2014-10-17T09:19:16+02:00
in scheme: Thésaurus de la désignation des œuvres architecturales et des espaces aménagés
preferred label: electric utilities @en-us
broader: réseau d'équipement urbain
created: 2011-09-01T00:00:00+02:00
definition: Réseau d'équipements permettant la distribution de l'électricité aux particuliers, aux services publics et aux entreprises. Il comprend notamment des centrales électriques, des transformateurs, etc.
status: 1

réseau du gaz
type: Concept
modified: 2014-10-17T09:21:02+02:00
in scheme: Thésaurus de la désignation des œuvres architecturales et des espaces aménagés
broader: réseau d'équipement urbain
created: 2011-09-01T00:00:00+02:00
definition: Réseau d'équipements permettant la distribution du gaz aux particuliers, aux services publics et aux entreprises. Il comprend notamment des canalisations enterrées reliées à une usine à gaz, à un gazomètre, etc.
status: 1

réseau de communication
type: Concept
modified: 2014-10-17T10:00:13+02:00
in scheme: Thésaurus de la désignation des œuvres architecturales et des espaces aménagés
preferred label: telecommunication systems @en-us
narrower: réseau téléphonique
narrower: réseau télégraphique
broader: réseau du génie civil
created: 2011-09-01T00:00:00+02:00
definition: Réseau d’installations permettant l'échange d'informations sous forme de signaux optiques, électriques ou électromagnétiques.
status: 1
broad match: http://data.bnf.fr/ark:/12148/cb124980049

réseau télégraphique
type: Concept
modified: 2014-10-17T10:03:17+02:00
in scheme: Thésaurus de la désignation des œuvres architecturales et des espaces aménagés
preferred label: telegraphs @en-us
broader: réseau de communication
created: 2011-09-01T00:00:00+02:00
related: sémaphore
related: station de télégraphe
definition: Réseau d'installations nécessaires à la transmission de messages sur de grandes distances, à l'aide de codes pour une transmission rapide et fiable.
TermeAssocie: sémaphore
TermeAssocie: station de télégraphe
status: 1

réseau de navigation fluviale
type: Concept
modified: 2014-10-17T10:05:24+02:00
in scheme: Thésaurus de la désignation des œuvres architecturales et des espaces aménagés
broader: réseau de transport
created: 2011-09-01T00:00:00+02:00
related: voie navigable
definition: Réseau de voies navigables permettant le déplacement des personnes et des biens par bateau.
TermeAssocie: voie navigable
status: 1

réseau de transport
type: Concept
modified: 2014-10-17T10:11:14+02:00
in scheme: Thésaurus de la désignation des œuvres architecturales et des espaces aménagés
preferred label: transportation infrastructure @en-us
narrower: réseau hydraulique
narrower: réseau ferré
narrower: réseau de transport par câble
narrower: réseau de navigation fluviale
narrower: réseau de transport aérien
narrower: réseau routier
broader: réseau du génie civil
created: 2011-09-01T00:00:00+02:00
definition: Réseau d'équipements destinés au déplacement des personnes et des biens par tous moyens.
status: 1

réseau de tramway
type: Concept
modified: 2014-10-17T10:13:52+02:00
in scheme: Thésaurus de la désignation des œuvres architecturales et des espaces aménagés
preferred label: streetcar systems @en-us
broader: réseau ferré
created: 2011-09-01T00:00:00+02:00
definition: Réseau ferré urbain, en site propre ou non, destiné au transport des personnes, aménagé avec des rails posés sans saillie sur le profil de la rue. Il est constitué de lignes, stations, dépôts, etc.
status: 1

réseau de transport aérien
type: Concept
modified: 2014-10-17T10:08:05+02:00
in scheme: Thésaurus de la désignation des œuvres architecturales et des espaces aménagés
broader: réseau de transport
created: 2011-09-01T00:00:00+02:00
definition: Réseau d'équipements destinés au déplacement des personnes et des biens par aéronef, composé d’aéroports, d’aérodromes, etc.
status: 1

réseau routier
type: Concept
modified: 2014-10-17T10:12:45+02:00
in scheme: Thésaurus de la désignation des œuvres architecturales et des espaces aménagés
narrower: réseau de trolleybus
broader: réseau de transport
created: 2011-09-01T00:00:00+02:00
definition: Réseau d'équipements permettant le déplacement de biens et de personnes par voie terrestre.
status: 1

réseau de trolleybus
type: Concept
modified: 2014-10-17T10:18:12+02:00
in scheme: Thésaurus de la désignation des œuvres architecturales et des espaces aménagés
preferred label: trolleybus systems @en-us
broader: réseau routier
created: 2011-09-01T00:00:00+02:00
definition: Réseau destiné au transport en commun des personnes, sur pneumatiques : les véhicules parcourent la voirie et tirent leur énergie par contact d’une perche sur une ligne électrique aérienne.
status: 1

réseau métropolitain
type: Concept
modified: 2014-10-17T10:14:46+02:00
in scheme: Thésaurus de la désignation des œuvres architecturales et des espaces aménagés
broader: réseau ferré
alternative label: métro
created: 2011-09-01T00:00:00+02:00
definition: Réseau ferré urbain à traction électrique, destiné au transport des personnes, partiellement ou totalement souterrain, qui dessert les différents quartiers d'une grande ville et de sa banlieue. Il est constitué de lignes, stations, dépôts, etc.
status: 1

robinetterie
type: Concept
modified: 2014-12-15T11:56:04+01:00
in scheme: Thésaurus de la désignation des œuvres architecturales et des espaces aménagés
broader: usine de petite métallurgie
created: 2011-09-01T00:00:00+02:00
definition: Usine où l'on fabrique des robinets, comprenant généralement un magasin industriel, une aire des matières premières, des machines de mécano-soudure, etc.
status: 1

route
type: Concept
modified: 2015-01-07T13:25:27+01:00
in scheme: Thésaurus de la désignation des œuvres architecturales et des espaces aménagés
preferred label: road 1 @en-gb
preferred label: primary roads @en-us
broader: voie
created: 2011-09-01T00:00:00+02:00
definition: Voie aménagée pour la circulation des véhicules, reliant des agglomérations.
status: 1

rue
type: Concept
modified: 2015-01-08T10:00:44+01:00
in scheme: Thésaurus de la désignation des œuvres architecturales et des espaces aménagés
preferred label: viale @it
preferred label: street @en-gb
preferred label: streets @en-us
broader: voie
alternative label: rue piétonne
alternative label: ruelle
alternative label: rue à cours d'eau axial
alternative label: rue couverte
alternative label: rue intérieure
created: 2011-09-01T00:00:00+02:00
scope note: Il en existe parfois à l’intérieur d'un édifice.
definition: Voie dans une agglomération, bordée d'édifices ou de clôtures.
status: 1

salle de concert
type: Concept
modified: 2014-12-19T11:16:17+01:00
in scheme: Thésaurus de la désignation des œuvres architecturales et des espaces aménagés
preferred label: concert halls @en-us
broader: salle de spectacle
created: 2011-09-01T00:00:00+02:00
definition: Salle de spectacle destinée aux concerts et aux récitals de musique.
status: 1

théâtre
type: Concept
modified: 2014-12-19T11:17:04+01:00
in scheme: Thésaurus de la désignation des œuvres architecturales et des espaces aménagés
preferred label: theaters @en-us
broader: salle de spectacle
created: 2011-09-01T00:00:00+02:00
scope note: Ne pas confondre avec théâtre de jardin, ni avec théâtre de verdure.
related: théâtre de plein air
definition: Édifice destiné aux représentations dramatiques.
TermeAssocie: théâtre de plein air
status: 1

savonnerie
type: Concept
modified: 2015-04-29T16:52:34+02:00
in scheme: Thésaurus de la désignation des œuvres architecturales et des espaces aménagés
broader: usine de traitement des corps gras
created: 2011-09-01T00:00:00+02:00
definition: Usine où l'on fabrique du savon sous différentes formes (solide, liquide, paillettes, etc.) par différents procédés de saponification, d'épuration, de liquidation, d'hydrolyse, etc. Elle comprend généralement un entrepôt industriel, un transformateur, etc.
status: 1

usine de traitement des corps gras
type: Concept
modified: 2015-02-12T12:49:10+01:00
in scheme: Thésaurus de la désignation des œuvres architecturales et des espaces aménagés
narrower: savonnerie
narrower: stéarinerie
narrower: usine de détergents
broader: usine de produits chimiques
created: 2011-09-01T00:00:00+02:00
definition: Usine où l'on fabrique des acides gras, des alcools gras, des glycérines, des agents de surface organique, etc. Elle comprend généralement un bureau, une aire des matières premières, un réservoir industriel, etc.
status: 1

scierie
type: Concept
modified: 2015-03-11T12:37:27+01:00
in scheme: Thésaurus de la désignation des œuvres architecturales et des espaces aménagés
broader: usine liée au travail du bois
created: 2011-09-01T00:00:00+02:00
scope note: Ne pas confondre avec usine de taille de matériaux de construction.
definition: Usine où l'on débite les bois en grumes à l'aide de scies à ruban. Elle comprend généralement une aire des matières premières, un pont roulant, un hangar, etc.
status: 1

séchoir à chanvre
type: Concept
modified: 2014-10-16T11:52:55+02:00
in scheme: Thésaurus de la désignation des œuvres architecturales et des espaces aménagés
broader: séchoir
created: 2011-09-01T00:00:00+02:00
scope note: Ne pas confondre avec four à chanvre.
definition: Édifice ou partie d'édifice destiné au séchage des tiges de chanvre après le rouissage et avant le broyage-teillage.
status: 1

séchoir à châtaignes
type: Concept
modified: 2015-02-26T11:50:25+01:00
in scheme: Thésaurus de la désignation des œuvres architecturales et des espaces aménagés
broader: séchoir
created: 2011-09-01T00:00:00+02:00
definition: Édifice ou partie d'édifice destiné au séchage des châtaignes, afin de les débarrasser de leur eau. Le séchage se fait sur une claire-voie mobile, placée à environ deux mètres du sol, au-dessus d'un foyer établi au milieu de l'édifice.
status: 1

séchoir à chicorée
type: Concept
modified: 2015-02-26T11:51:45+01:00
in scheme: Thésaurus de la désignation des œuvres architecturales et des espaces aménagés
broader: séchoir
created: 2011-09-01T00:00:00+02:00
definition: Édifice ou partie d'édifice destiné au séchage des racines de chicorée avant leur torréfaction.
status: 1
broad match: http://vocab.getty.edu/aat/300004922

séchoir à houblon
type: Concept
modified: 2015-02-26T12:00:22+01:00
in scheme: Thésaurus de la désignation des œuvres architecturales et des espaces aménagés
preferred label: hop barns @en-us
broader: séchoir
created: 2011-09-01T00:00:00+02:00
definition: Édifice ou partie d'édifice agricole bien aéré, où les cônes de houblon sont déposés sur un plancher sec et uni afin d'être séchés.
status: 1

séchoir à maïs
type: Concept
modified: 2015-02-26T12:01:16+01:00
in scheme: Thésaurus de la désignation des œuvres architecturales et des espaces aménagés
broader: séchoir
created: 2011-09-01T00:00:00+02:00
definition: Partie d'édifice ou édicule destiné au séchage des épis de maïs.
status: 1

séchoir à peaux
type: Concept
modified: 2015-02-26T12:04:16+01:00
in scheme: Thésaurus de la désignation des œuvres architecturales et des espaces aménagés
broader: séchoir
created: 2011-09-01T00:00:00+02:00
definition: Partie d'édifice destinée au séchage des peaux. Celles-ci sont étendues horizontalement au-dessus du sol ou du plancher dans un endroit bien aéré et à l'ombre.
status: 1

séchoir à tabac
type: Concept
modified: 2015-02-26T12:06:14+01:00
in scheme: Thésaurus de la désignation des œuvres architecturales et des espaces aménagés
broader: séchoir
created: 2011-09-01T00:00:00+02:00
definition: Édifice ou partie d'édifice affecté au séchage des feuilles de tabac. Ce séchage se fait à l'air libre ou au moyen d'appareils permettant d'éliminer l'humidité et la poussière contenues dans le tabac.
status: 1

sentier
type: Concept
modified: 2015-01-08T10:07:39+01:00
in scheme: Thésaurus de la désignation des œuvres architecturales et des espaces aménagés
preferred label: path @en-gb
preferred label: Paths @en-us
broader: voie
created: 2011-09-01T00:00:00+02:00
definition: Chemin étroit et non revêtu, utilisé le plus souvent par les piétons ou les animaux.
status: 1

siège de parti politique
type: Concept
modified: 2014-10-17T15:34:49+02:00
in scheme: Thésaurus de la désignation des œuvres architecturales et des espaces aménagés
broader: siège d'association ou d'organisation
created: 2011-09-01T00:00:00+02:00
definition: Édifice abritant les activités et les services centraux d'un parti politique.
status: 1

siège d'organisation internationale
type: Concept
modified: 2014-10-17T15:34:11+02:00
in scheme: Thésaurus de la désignation des œuvres architecturales et des espaces aménagés
preferred label: international organizations buildings @en-us
broader: siège d'association ou d'organisation
created: 2011-09-01T00:00:00+02:00
definition: Édifice abritant les activités et les services centraux d'une organisation internationale.
status: 1

temple maçonnique
type: Concept
modified: 2014-12-12T11:04:07+01:00
in scheme: Thésaurus de la désignation des œuvres architecturales et des espaces aménagés
preferred label: masonic buildings @en-us
broader: siège d'association ou d'organisation
alternative label: loge maçonnique
created: 2011-09-01T00:00:00+02:00
definition: Édifice où se réunissent les membres d'une loge maçonnique.
status: 1

station balnéaire
type: Concept
modified: 2015-01-07T11:33:57+01:00
in scheme: Thésaurus de la désignation des œuvres architecturales et des espaces aménagés
preferred label: seaside resorts @en-us
broader: station de villégiature
created: 2011-09-01T00:00:00+02:00
definition: Station de villégiature située en bord de mer ou de lac.
status: 1

station d'air comprimé
type: Concept
modified: 2015-02-19T17:09:59+01:00
in scheme: Thésaurus de la désignation des œuvres architecturales et des espaces aménagés
broader: usine génératrice d'énergie
created: 2011-09-01T00:00:00+02:00
definition: Centrale énergétique produisant de l'air comprimé destiné à divers usages : artisanat, industrie et utilisation urbaine, tel le métropolitain.
status: 1

station d'incinération des déchets
type: Concept
modified: 2014-10-16T14:15:24+02:00
in scheme: Thésaurus de la désignation des œuvres architecturales et des espaces aménagés
preferred label: incinerators @en-us
broader: station de traitement des déchets
alternative label: usine d'incinération des déchets
created: 2011-09-01T00:00:00+02:00
definition: Établissement où l'on brûle les déchets ; il peut aussi comporter des installations permettant de récupérer les produits de la combustion.
status: 1

station de sports d'hiver
type: Concept
modified: 2015-01-07T11:36:58+01:00
in scheme: Thésaurus de la désignation des œuvres architecturales et des espaces aménagés
preferred label: winter resorts @en-us
broader: station de villégiature
created: 2011-09-01T00:00:00+02:00
definition: Station de villégiature dédiée aux sports de neige.
status: 1

stéarinerie
type: Concept
modified: 2013-04-23T00:00:00+02:00
in scheme: Thésaurus de la désignation des œuvres architecturales et des espaces aménagés
narrower: usine de bougies
broader: usine de traitement des corps gras
created: 2011-09-01T00:00:00+02:00
definition: Usine où l'on fabrique, par extraction de graisses animales et végétales, la stéarine destinée à la fabrication des bougies, des cierges, etc. Elle comprend généralement un bureau, une cheminée d'usine, etc.
status: 1

usine de bougies
type: Concept
modified: 2015-02-18T11:59:50+01:00
in scheme: Thésaurus de la désignation des œuvres architecturales et des espaces aménagés
broader: stéarinerie
created: 2011-09-01T00:00:00+02:00
definition: Usine où l'on fabrique des chandelles, des cierges, des bougies suivant différents procédés (à « la jetée », à « la trempe », etc.). Elle comprend généralement un bureau, une chaufferie, un magasin industriel, etc.
status: 1

théâtre de verdure
type: Concept
modified: 2014-12-30T15:46:21+01:00
in scheme: Thésaurus de la désignation des œuvres architecturales et des espaces aménagés
broader: théâtre de jardin
created: 2011-09-01T00:00:00+02:00
definition: Théâtre de jardin dont la structure est constituée de végétaux de pleine terre.
status: 1

tissage
type: Concept
modified: 2015-03-18T14:50:31+01:00
in scheme: Thésaurus de la désignation des œuvres architecturales et des espaces aménagés
narrower: usine de passementerie
narrower: usine de sparterie
broader: usine textile
created: 2011-09-01T00:00:00+02:00
definition: Usine où l'on effectue, sur des métiers à tisser automatiques (Jacquard, à technique jet d'eau ou d'air sous pression, circulaires), les différentes opérations destinées à produire des étoffes, tissus, tapis, etc. Elle comprend généralement une chaufferie, une salle des machines, un magasin industriel, etc.
status: 1

usine de passementerie
type: Concept
modified: 2015-03-18T15:10:47+01:00
in scheme: Thésaurus de la désignation des œuvres architecturales et des espaces aménagés
broader: tissage
created: 2011-09-01T00:00:00+02:00
definition: Usine où l'on fabrique des rubans, tresses, cordons, torsades, lacets, galons, etc. utilisés comme parure de vêtements ou de tentures d'ameublement. Elle fonctionne généralement avec des métiers à tisser à main, à ratière, à crochets, etc.
status: 1

usine de sparterie
type: Concept
modified: 2015-03-18T15:19:44+01:00
in scheme: Thésaurus de la désignation des œuvres architecturales et des espaces aménagés
broader: tissage
created: 2011-09-01T00:00:00+02:00
definition: Usine où l'on fabrique des tapis, nattes, chapeaux, etc., en fibres végétales tressées (alfa, sisal, crin).
status: 1

tonnellerie
type: Concept
modified: 2015-03-11T12:51:29+01:00
in scheme: Thésaurus de la désignation des œuvres architecturales et des espaces aménagés
broader: usine liée au travail du bois
created: 2011-09-01T00:00:00+02:00
definition: Usine où l'on fabrique des tonneaux, foudres, cuves, futailles, barils, etc., suivant différentes opérations (préparation des douelles, mise au gabarit, chauffe, montage des fonds, etc.). Elle comprend généralement une aire des matières premières, un laboratoire, un atelier de conditionnement, un magasin industriel, etc.
status: 1

tourelle
type: Concept
modified: 2015-02-26T12:21:03+01:00
in scheme: Thésaurus de la désignation des œuvres architecturales et des espaces aménagés
preferred label: turrets @en-us
broader: tour
created: 2011-09-01T00:00:00+02:00
scope note: Ne pas confondre avec échauguette.
definition: Tour peu développée en plan et qui, de ce fait, n'a pas l'importance d'un corps de bâtiment : la tourelle a le plan massé et l'élancement de la tour ; elle se développe sur plusieurs étages ou même sur toute la hauteur du bâtiment dont elle fait partie. Elle peut être en surplomb.
status: 1

tréfilerie
type: Concept
modified: 2015-03-17T15:22:56+01:00
in scheme: Thésaurus de la désignation des œuvres architecturales et des espaces aménagés
broader: usine de transformation des métaux
created: 2011-09-01T00:00:00+02:00
definition: Usine où s'effectue le tréfilage des métaux, en vue de la fabrication de fils. Elle comprend généralement une ou plusieurs filières de profil déterminé.
status: 1

trompe d'architecture
type: Concept
modified: 2015-02-24T17:26:10+01:00
in scheme: Thésaurus de la désignation des œuvres architecturales et des espaces aménagés
preferred label: squinches & trompes @en-us
broader: voûte
created: 2011-09-01T00:00:00+02:00
definition: Petite voûte formant support sous un ouvrage ou sous un pan de mur en surplomb et permettant un changement de plan à un niveau quelconque de la construction. Toute voûte ayant fonction de support plus que de couvrement est une trompe.
status: 1

trottoir
type: Concept
modified: 2015-01-08T10:10:44+01:00
in scheme: Thésaurus de la désignation des œuvres architecturales et des espaces aménagés
preferred label: pavement @en-gb
preferred label: sidewalks @en-us
broader: voie
created: 2011-09-01T00:00:00+02:00
definition: Partie latérale surélevée d'une voie ou d'une place, réservée aux piétons.
status: 1

tuilerie
type: Concept
modified: 2015-01-27T15:18:51+01:00
in scheme: Thésaurus de la désignation des œuvres architecturales et des espaces aménagés
broader: usine de céramique
created: 2011-09-01T00:00:00+02:00
related: usine de fabrication de matériaux de construction
definition: Usine où l'on fabrique des tuiles et comprenant généralement une excavation, une pièce de séchage, un four industriel, un entrepôt industriel, etc.
TermeAssocie: usine de fabrication de matériaux de construction
status: 1

usine métallurgique
type: Concept
modified: 2015-03-13T12:36:57+01:00
in scheme: Thésaurus de la désignation des œuvres architecturales et des espaces aménagés
narrower: usine de fabrication des métaux
narrower: usine de transformation des métaux
narrower: usine de traitement de surface des métaux
narrower: usine de traitement thermique des métaux
broader: usine
created: 2011-09-01T00:00:00+02:00
definition: Usine où l'on produit et travaille les métaux ferreux et non ferreux.
status: 1

usine de construction mécanique
type: Concept
modified: 2015-01-28T15:40:19+01:00
in scheme: Thésaurus de la désignation des œuvres architecturales et des espaces aménagés
narrower: usine de construction navale
narrower: usine d'appareils de levage et de manutention
narrower: usine d'armes
narrower: usine de construction aéronautique
narrower: usine de construction automobile
narrower: usine de construction métallique
narrower: usine de cycles
narrower: usine de matériel agricole
narrower: usine de matériel d'équipement industriel
narrower: usine de matériel ferroviaire
broader: usine
created: 2011-09-01T00:00:00+02:00
definition: Usine où l'on fabrique divers matériels d'équipement industriel, agricole, de transport, etc.
status: 1

usine de mécanique de précision
type: Concept
modified: 2015-02-03T12:34:29+01:00
in scheme: Thésaurus de la désignation des œuvres architecturales et des espaces aménagés
narrower: usine d'horlogerie
narrower: usine d'instruments de mesure
narrower: usine d'instruments de musique
narrower: usine de matériel optique
narrower: usine de matériel de bureau
narrower: usine de matériel médicochirurgical
narrower: usine de roulements
broader: usine
created: 2011-09-01T00:00:00+02:00
definition: Usine où l'on fabrique des appareils de précision, de mesure, d'optique, d'équipement de bureau, etc.
status: 1

usine de construction électronique
type: Concept
modified: 2015-04-28T15:14:23+02:00
in scheme: Thésaurus de la désignation des œuvres architecturales et des espaces aménagés
narrower: usine de composants électroniques
narrower: usine de matériel électroacoustique
narrower: usine de matériel informatique
narrower: usine de matériel de télécommunication
broader: usine
created: 2011-09-01T00:00:00+02:00
definition: Usine où l'on fabrique divers matériels électroniques, électroacoustiques, informatiques et de télécommunication.
status: 1

usine à gaz
type: Concept
modified: 2015-03-11T11:10:31+01:00
in scheme: Thésaurus de la désignation des œuvres architecturales et des espaces aménagés
broader: usine génératrice d'énergie
created: 2011-09-01T00:00:00+02:00
definition: Usine énergétique où l'on produit ou traite des gaz en vue de leur utilisation domestique ou industrielle.
status: 1

usine à glace
type: Concept
modified: 2015-02-06T12:04:38+01:00
in scheme: Thésaurus de la désignation des œuvres architecturales et des espaces aménagés
broader: usine frigorifique
created: 2011-09-01T00:00:00+02:00
definition: Usine où l'on fabrique de la glace hydrique alimentaire (glaçons, blocs de glace, glace en paillettes, etc.). Elle comprend généralement des chambres de congélation, un entrepôt industriel, etc.
status: 1

usine frigorifique
type: Concept
modified: 2015-02-06T11:53:06+01:00
in scheme: Thésaurus de la désignation des œuvres architecturales et des espaces aménagés
narrower: usine à glace
broader: usine de produits agro-alimentaires
created: 2011-09-01T00:00:00+02:00
scope note: Ne pas confondre avec conserverie.
definition: Usine qui produit du froid. Elle comprend généralement un entrepôt industriel, une salle des machines, etc.
status: 1

usine à papier
type: Concept
modified: 2015-04-28T16:13:51+02:00
in scheme: Thésaurus de la désignation des œuvres architecturales et des espaces aménagés
broader: usine de papeterie
created: 2011-09-01T00:00:00+02:00
status: 1

usine d'acide sulfurique
type: Concept
modified: 2015-02-09T11:44:50+01:00
in scheme: Thésaurus de la désignation des œuvres architecturales et des espaces aménagés
broader: usine de produits chimiques
created: 2011-09-01T00:00:00+02:00
definition: Usine où l'on produit de l'acide sulfurique soit par le procédé des chambres à plomb, soit par le procédé de contact avec catalyseur.
status: 1

usine d'agglomérés
type: Concept
modified: 2015-02-03T11:57:42+01:00
in scheme: Thésaurus de la désignation des œuvres architecturales et des espaces aménagés
broader: usine de fabrication de matériaux de construction
created: 2011-09-01T00:00:00+02:00
definition: Usine où l'on fabrique des matériaux de construction (parpaings, etc.) et des éléments pour les travaux publics (poteaux, buses, etc.) obtenus à partir de matières diverses agrégées avec un liant, puis comprimées. Elle comprend généralement une aire des matièrespremières , un bureau, une aire des produits manufacturés, etc.
status: 1

usine d'allumettes
type: Concept
modified: 2015-02-11T16:25:55+01:00
in scheme: Thésaurus de la désignation des œuvres architecturales et des espaces aménagés
broader: usine de produits explosifs
created: 2011-09-01T00:00:00+02:00
definition: Usine où l'on fabrique des allumettes de ménage ou de sûreté et comprenant généralement un entrepôt industriel, une pièce deséchage , un atelier de conditionnement, etc.
status: 1

usine de produits explosifs
type: Concept
modified: 2015-02-11T16:14:47+01:00
in scheme: Thésaurus de la désignation des œuvres architecturales et des espaces aménagés
narrower: usine d'allumettes
broader: usine de produits chimiques
alternative label: usine d'explosifs
created: 2011-09-01T00:00:00+02:00
definition: Usine où l'on fabrique des cartouches, des mèches, de la dynamite et des articles de pyrotechnie. Elle comprend généralement une poudrière, un laboratoire, un entrepôt industriel, etc.
status: 1

usine d'appareils de levage et de manutention
type: Concept
modified: 2015-01-28T15:52:11+01:00
in scheme: Thésaurus de la désignation des œuvres architecturales et des espaces aménagés
broader: usine de construction mécanique
created: 2011-09-01T00:00:00+02:00
definition: Usine où l'on fabrique des appareils de levage et de manutention tels que monte-charges, grues, palans, ponts roulants, etc. Elle fonctionne généralement avec des presses, des cisailles, des perceuses, etc.
status: 1

usine de blanchiment
type: Concept
modified: 2015-03-19T10:42:45+01:00
in scheme: Thésaurus de la désignation des œuvres architecturales et des espaces aménagés
broader: usine d'apprêt des étoffes
created: 2011-09-01T00:00:00+02:00
definition: Usine où l'on blanchit les étoffes et les fibres textiles selon des procédés qui varient en fonction de la nature des produits traités. Elle comprend généralement une chaufferie, une pièce de séchage, etc.
status: 1

usine de feutre
type: Concept
modified: 2015-04-30T15:35:56+02:00
in scheme: Thésaurus de la désignation des œuvres architecturales et des espaces aménagés
broader: usine d'apprêt des étoffes
created: 2011-09-01T00:00:00+02:00
definition: Usine où l'on fabrique du feutre destiné à la chapellerie, l'ameublement, la papeterie, l'imprimerie, la blanchisserie, la confection (semelles), etc. Elle comprend généralement un laboratoire, un entrepôt industriel, etc.
status: 1

usine de moirage
type: Concept
modified: 2013-04-23T00:00:00+02:00
in scheme: Thésaurus de la désignation des œuvres architecturales et des espaces aménagés
broader: usine d'apprêt des étoffes
created: 2011-09-01T00:00:00+02:00
definition: Usine où l'on apprête les étoffes avec de gros cylindres creux chauffés qui écrasent leur grain et qui leur donnent une apparence ondée et chatoyante.
status: 1

usine d'armes
type: Concept
modified: 2015-01-29T14:31:19+01:00
in scheme: Thésaurus de la désignation des œuvres architecturales et des espaces aménagés
broader: usine de construction mécanique
created: 2011-09-01T00:00:00+02:00
scope note: Employer tant pour les fabricants d'éléments que pour les usines d'assemblage ou de montage.
definition: Usine où l'on fabrique des armes de chasse ou de guerre.
status: 1

usine d'articles en caoutchouc
type: Concept
modified: 2015-02-09T15:40:56+01:00
in scheme: Thésaurus de la désignation des œuvres architecturales et des espaces aménagés
broader: usine de caoutchouc
created: 2011-09-01T00:00:00+02:00
definition: Usine où l'on fabrique des tubes, des plaques, des courroies, des bandes transporteuses, des revêtements de sol, des articles pour chaussures ainsi que des tissus enduits de caoutchouc. Elle comprend généralement un entrepôt industriel, un magasin industriel, une chaufferie, etc.
status: 1

usine de caoutchouc
type: Concept
modified: 2015-02-09T12:42:41+01:00
in scheme: Thésaurus de la désignation des œuvres architecturales et des espaces aménagés
narrower: usine d'articles en caoutchouc
narrower: usine de pneumatiques
broader: usine de produits chimiques
created: 2011-09-01T00:00:00+02:00
definition: Usine où l'on produit du caoutchouc à partir du latex de diverses plantes, ou artificiellement à partir d'hydrocarbure non saturé.
status: 1

usine d'articles en matière plastique
type: Concept
modified: 2015-04-29T16:15:41+02:00
in scheme: Thésaurus de la désignation des œuvres architecturales et des espaces aménagés
broader: usine de matières plastiques
created: 2011-09-01T00:00:00+02:00
definition: Usine où l'on fabrique de la quincaillerie, des articles d'hygiène, de bureau, de sport, d'ameublement, etc., en matière plastique. Elle comprend généralement un bureau, un entrepôt industriel, un magasin industriel, un atelier de réparation, etc.
status: 1

usine de matières plastiques
type: Concept
modified: 2015-04-29T16:12:03+02:00
in scheme: Thésaurus de la désignation des œuvres architecturales et des espaces aménagés
narrower: usine d'articles en matière plastique
narrower: usine d'éléments en matière plastique pour le bâtiment
narrower: usine d'emballages en matière plastique
narrower: usine d'ouvrages en matière plastique
narrower: usine de pièces détachées en matière plastique
broader: usine de produits chimiques
created: 2011-09-01T00:00:00+02:00
definition: Usine de matières plastiques thermodurcissables et thermoplastiques, telles que phénoplastes, aminoplastes, polyéthylène, polypropylène, polystyrène, polychlorure de vinyle, etc. Elle comprend généralement une chaufferie, un transformateur, un entrepôt industriel , etc.
status: 1

usine d'ébénisterie
type: Concept
modified: 2015-04-29T16:56:28+02:00
in scheme: Thésaurus de la désignation des œuvres architecturales et des espaces aménagés
broader: usine liée au travail du bois
created: 2011-09-01T00:00:00+02:00
definition: Usine où l'on fabrique du mobilier en bois sur lequel on plaque des bois précieux (ébène, acajou, palissandre, etc.), du cuivre, de l'étain, etc. Elle comprend généralement un bureau, un entrepôt industriel, un magasin industriel, etc.
status: 1

usine d'éléments en matière plastique pour le bâtiment
type: Concept
modified: 2015-04-29T16:18:43+02:00
in scheme: Thésaurus de la désignation des œuvres architecturales et des espaces aménagés
broader: usine de matières plastiques
created: 2011-09-01T00:00:00+02:00
definition: Usine où l'on fabrique des éléments en matière plastique tels que huisseries, éléments de toiture, d'isolation, de gouttière, revêtements de sol, canalisations, sanitaires, etc. Elle comprend généralement un bureau, un entrepôt industriel, une pièce de séchage, etc.
status: 1

usine d'éléments préfabriqués
type: Concept
modified: 2015-04-28T15:36:00+02:00
in scheme: Thésaurus de la désignation des œuvres architecturales et des espaces aménagés
broader: usine de fabrication de matériaux de construction
created: 2011-09-01T00:00:00+02:00
definition: Usine où l'on fabrique des panneaux dont l'assemblage forme un mur, une construction, etc. Elle comprend généralement une aire des produits manufacturés , un magasin industriel, un hangar, etc.
status: 1

usine d'emballage et conditionnement
type: Concept
modified: 2015-01-27T11:03:45+01:00
in scheme: Thésaurus de la désignation des œuvres architecturales et des espaces aménagés
broader: usine de papeterie
created: 2011-09-01T00:00:00+02:00
definition: Usine où l'on fabrique cartons, enveloppes et papiers d'emballage divers. Elle comprend généralement un bureau, un atelier de conditionnement , un magasin industriel, etc.
status: 1

usine d'emballages en matière plastique
type: Concept
modified: 2015-02-11T14:32:56+01:00
in scheme: Thésaurus de la désignation des œuvres architecturales et des espaces aménagés
broader: usine de matières plastiques
created: 2011-09-01T00:00:00+02:00
definition: Usine où l'on fabrique sacs, pots, bidons, bacs, emballages alvéolés en matière plastique, etc. Elle comprend généralement une aire des matières premières , un entrepôt industriel, un magasin industriel, etc.
status: 1

usine d'encres
type: Concept
modified: 2015-02-10T12:51:53+01:00
in scheme: Thésaurus de la désignation des œuvres architecturales et des espaces aménagés
broader: usine de matières colorantes synthétiques
created: 2011-09-01T00:00:00+02:00
definition: Usine où l'on fabrique des préparations à base de pigments, de liants et d'additifs, utilisées pour reproduire textes et dessins sur différents supports (papier, carton, plastique, etc.). Elle fonctionne avec des mélangeurs, des broyeurs et comprend généralement un atelier de conditionnement, un magasin industriel, etc.
status: 1

usine de matières colorantes synthétiques
type: Concept
modified: 2015-02-10T12:45:13+01:00
in scheme: Thésaurus de la désignation des œuvres architecturales et des espaces aménagés
narrower: usine d'encres
narrower: usine de peintures et vernis
broader: usine de produits chimiques
created: 2011-09-01T00:00:00+02:00
definition: Usine où l'on fabrique des colorants, des pigments organiques, des préparations, etc. Elle comprend généralement un laboratoire, un atelier des mélanges, une pièce de séchage, etc.
status: 1

usine d'engrais
type: Concept
modified: 2015-02-09T12:11:36+01:00
in scheme: Thésaurus de la désignation des œuvres architecturales et des espaces aménagés
broader: usine de produits chimiques
created: 2011-09-01T00:00:00+02:00
definition: Usine où l'on fabrique des engrais composés tels que les engrais azotés, les engrais phosphatés et les engrais potassiques. Elle comprend généralement un bassin de décantation, un hangar, un entrepôt industriel, un réservoir industriel, etc.
status: 1

usine de préparation de produit minéral
type: Concept
modified: 2015-01-21T16:44:30+01:00
in scheme: Thésaurus de la désignation des œuvres architecturales et des espaces aménagés
broader: usine d'extraction
created: 2011-09-01T00:00:00+02:00
definition: Usine où l'on fait subir aux produits minéraux bruts extraits (houille, minerais métalliques, uranium, kaolin, etc.) différents traitements (concassage, lavage, criblage, concentration) en vue de leur commercialisation. Elle comprend généralement une aire des matièrespremières , un poste de chargement, un bassin de décantation, un four industriel, etc.
status: 1

usine de taille de matériaux de construction
type: Concept
modified: 2015-01-21T16:43:19+01:00
in scheme: Thésaurus de la désignation des œuvres architecturales et des espaces aménagés
broader: usine d'extraction
created: 2011-09-01T00:00:00+02:00
scope note: Ne pas confondre avec scierie.
definition: Usine où l'on taille les matériaux de construction (pierre, marbre, ardoise, etc.) et comprenant généralement un pont-roulant, une aire des matières premières , une aire des produits manufacturés, etc.
status: 1

usine de taille de pierre pour la joaillerie et l'industrie
type: Concept
modified: 2015-01-21T17:04:27+01:00
in scheme: Thésaurus de la désignation des œuvres architecturales et des espaces aménagés
broader: usine d'extraction
created: 2011-09-01T00:00:00+02:00
definition: Usine où l'on taille la pierre précieuse (fine, fausse ou synthétique) utilisée en joaillerie et en horlogerie (contre-pivots) ainsi qu'à d'autres fins industrielles : diamants pour trépans, scies, etc.
status: 1

usine de boutons
type: Concept
modified: 2014-11-17T14:51:33+01:00
in scheme: Thésaurus de la désignation des œuvres architecturales et des espaces aménagés
broader: usine d'habillement
created: 2011-09-01T00:00:00+02:00
definition: Usine où l'on fabrique des boutons en nacre, corozo, os, buis, aluminium, matières plastiques, etc. Elle fonctionne avec des machines à découper, à percer, à marquer, à graver, et comprend généralement un atelier de conditionnement, un magasin industriel, etc.
status: 1

usine de chapellerie
type: Concept
modified: 2015-01-22T11:45:40+01:00
in scheme: Thésaurus de la désignation des œuvres architecturales et des espaces aménagés
broader: usine d'habillement
created: 2011-09-01T00:00:00+02:00
definition: La fabrication des chapeaux de paille est réalisée dans une usine de sparterie. Ne pas confondre avec usine de feutre.
definition: Usine où l'on fabrique chapeaux, bérets, casquettes, etc., en feutres ou tissus. Elle comprend généralement une pièce de séchage, un magasin industriel, etc.
status: 1

usine de chaussures
type: Concept
modified: 2015-04-28T14:31:56+02:00
in scheme: Thésaurus de la désignation des œuvres architecturales et des espaces aménagés
broader: usine d'habillement
created: 2011-09-01T00:00:00+02:00
definition: Usine où l'on fabrique des chaussures. Elle fonctionne avec des machines à couper, à plier, à piquer, à coller, à mouler par compression et comprend généralement un entrepôt industriel, un bureau d'études, un atelier de conditionnement, etc.
status: 1

usine de confection
type: Concept
modified: 2015-01-23T11:17:09+01:00
in scheme: Thésaurus de la désignation des œuvres architecturales et des espaces aménagés
broader: usine d'habillement
created: 2011-09-01T00:00:00+02:00
definition: Usine où l'on fabrique en série des vêtements, exécutés dans les tailles normalisées sans essayage et destinés au prêt-à-porter. Elle fonctionne avec des machines à couper, à coudre, à piquer les cols, à boutonnières, à repasser et comprend généralement un bureau, un magasin industriel, etc.
status: 1

usine de parapluies et cannes
type: Concept
modified: 2014-11-17T14:31:32+01:00
in scheme: Thésaurus de la désignation des œuvres architecturales et des espaces aménagés
broader: usine d'habillement
created: 2011-09-01T00:00:00+02:00
definition: Usine où l'on fabrique et monte les différents éléments qui composent les parapluies, les ombrelles, les parasols, les cannes, etc. Elle comprend généralement un bureau, un magasin industriel, etc.
status: 1

usine d'horlogerie
type: Concept
modified: 2015-02-03T12:48:15+01:00
in scheme: Thésaurus de la désignation des œuvres architecturales et des espaces aménagés
broader: usine de mécanique de précision
created: 2011-09-01T00:00:00+02:00
definition: Usine où l'on fabrique des montres, des pendules, des horloges, des cadrans, etc., comprenant généralement un bureau d'études, un magasin industriel, un atelier de conditionnement, etc.
status: 1

usine d'impression sur étoffes
type: Concept
modified: 2015-04-30T15:42:53+02:00
in scheme: Thésaurus de la désignation des œuvres architecturales et des espaces aménagés
broader: usine textile
created: 2011-09-01T00:00:00+02:00
definition: Usine où l'on procède à l'application de motifs décoratifs sur les étoffes, par impression à la planche, au rouleau (cylindre), sérigraphique, etc. Elle comprend généralement un laboratoire, un bureau, un magasin industriel, etc.
status: 1

usine de papiers peints
type: Concept
modified: 2015-01-23T12:29:42+01:00
in scheme: Thésaurus de la désignation des œuvres architecturales et des espaces aménagés
broader: usine d'impression sur papier
created: 2011-09-01T00:00:00+02:00
definition: Usine où l'on fabrique des papiers peints suivant différentes techniques d'impression (machines à cylindres ou rouleaux gravés en creux, en relief, etc.). Elle comprend généralement une chaufferie, une pièce de séchage, un magasin industriel, etc.
status: 1

usine d'instruments de mesure
type: Concept
modified: 2015-04-28T15:43:03+02:00
in scheme: Thésaurus de la désignation des œuvres architecturales et des espaces aménagés
broader: usine de mécanique de précision
created: 2011-09-01T00:00:00+02:00
definition: Usine où l'on fabrique balances, bascules, compteurs, niveaux, régulateurs, etc. et comprenant généralement un bureau d'études, un magasin industriel, etc.
status: 1

usine d'instruments de musique
type: Concept
modified: 2015-02-03T13:04:23+01:00
in scheme: Thésaurus de la désignation des œuvres architecturales et des espaces aménagés
broader: usine de mécanique de précision
created: 2011-09-01T00:00:00+02:00
definition: Usine où l'on fabrique des instruments à cordes, à vent, à membranes, etc. et comprenant généralement un bureau d'études, un entrepôt industriel, un magasin industriel, un laboratoire, etc.
status: 1

usine d'ouate
type: Concept
modified: 2015-03-23T12:01:36+01:00
in scheme: Thésaurus de la désignation des œuvres architecturales et des espaces aménagés
broader: usine de produit textile non tissé
created: 2011-09-01T00:00:00+02:00
definition: Usine où l'on prépare la laine, la soie, la filasse ou le coton pour servir de doublure de vêtements et d'objets de literie, ou pour servir à des produits d'hygiène (coton, couches, etc.), à des pansements, etc. Elle comprend généralement un entrepôt industriel, un magasin industriel.
status: 1

usine de produit textile non tissé
type: Concept
modified: 2015-04-30T15:51:27+02:00
in scheme: Thésaurus de la désignation des œuvres architecturales et des espaces aménagés
narrower: usine d'ouate
broader: usine textile
created: 2011-09-01T00:00:00+02:00
scope note: Cette production n'intègre pas le feutre car cette étoffe est à la fois tissée et non tissée.
definition: Usine où l'on fabrique des textiles non tissés (voile ou nappe de fibres liées par friction, cohésion, adhésion, etc.) pour la confection de vêtements, alèses, draps jetables, etc. Elle comprend généralement un entrepôt industriel, un magasin industriel, etc.
status: 1

usine d'ouvrages en amiante
type: Concept
modified: 2013-04-23T00:00:00+02:00
in scheme: Thésaurus de la désignation des œuvres architecturales et des espaces aménagés
broader: usine de produits chimiques
created: 2011-09-01T00:00:00+02:00
definition: Usine où l'on fabrique des produits à base d'amiante (garnitures de frein, embrayages, joints de culasse, etc.). Elle comprend généralement un bureau, un entrepôt industriel, un magasin industriel, etc.
status: 1

usine d'ouvrages en matière plastique
type: Concept
modified: 2015-04-29T16:22:59+02:00
in scheme: Thésaurus de la désignation des œuvres architecturales et des espaces aménagés
broader: usine de matières plastiques
created: 2011-09-01T00:00:00+02:00
definition: Usine où l'on fabrique des plaques, des tubes, des panneaux, etc. en matière plastique. Elle comprend généralement un bureau, un entrepôt industriel, un magasin industriel, etc.
status: 1

usine de bimbeloterie
type: Concept
modified: 2015-03-11T13:18:44+01:00
in scheme: Thésaurus de la désignation des œuvres architecturales et des espaces aménagés
broader: usine liée au travail du bois
created: 2011-09-01T00:00:00+02:00
definition: Usine de jouets d'enfants, ou de petits articles qui servent aux usages domestiques. Elle comprend généralement un bureau d'études, un atelier de conditionnement, un magasin industriel, etc.
status: 1

usine de boissellerie
type: Concept
modified: 2015-03-12T14:47:20+01:00
in scheme: Thésaurus de la désignation des œuvres architecturales et des espaces aménagés
broader: usine liée au travail du bois
created: 2011-09-01T00:00:00+02:00
definition: Usine où l'on fabrique des mesures de capacité, des cribles, des soufflets, des tamis, des seaux ainsi que des bobines textiles, des manches, des pièces tournées, etc.
status: 1

usine de boissons non alcoolisées
type: Concept
modified: 2015-04-29T15:21:55+02:00
in scheme: Thésaurus de la désignation des œuvres architecturales et des espaces aménagés
broader: usine de produits agro-alimentaires
created: 2011-09-01T00:00:00+02:00
definition: Usine où l'on fabrique des jus de fruits ou de légumes, des limonades, des sodas, des eaux gazeuses, etc. Elle comprend généralement un atelier de conditionnement, un magasin industriel, une chambre froide, etc.
status: 1

usine de bonneterie
type: Concept
modified: 2015-03-19T12:36:06+01:00
in scheme: Thésaurus de la désignation des œuvres architecturales et des espaces aménagés
broader: usine textile
created: 2011-09-01T00:00:00+02:00
definition: Usine où l'on fabrique des tissus à maille (bas, chaussettes, lingerie, sous-vêtements, etc.) sur des tricoteuses rectilignes, circulaires, etc. Elle comprend généralement un bureau, un magasin industriel.
status: 1

usine de bouchons
type: Concept
modified: 2015-04-29T17:25:02+02:00
in scheme: Thésaurus de la désignation des œuvres architecturales et des espaces aménagés
broader: usine de transformation du liège
created: 2011-09-01T00:00:00+02:00
definition: Usine où l'on fabrique divers bouchons (cylindriques, coniques, à tête de bois ou de plastique, perforés, etc.), en liège naturel ou colmaté, à l'aide d'emporte-pièces. Elle comprend généralement un entrepôt industriel, un atelier de conditionnement, un magasin industriel , etc.
status: 1

usine de transformation du liège
type: Concept
modified: 2015-04-29T17:21:27+02:00
in scheme: Thésaurus de la désignation des œuvres architecturales et des espaces aménagés
narrower: usine de bouchons
broader: usine liée au travail du bois
created: 2011-09-01T00:00:00+02:00
definition: Usine où l'on traite le liège, à l'aide de refendeuses, de presses à polymérisation, etc., pour en obtenir divers produits tels qu'isolants, flotteurs, semelles, agglomérés, etc. Elle comprend généralement un hangar, un magasin industriel, un pont-bascule.
status: 1

usine de boyauderie
type: Concept
modified: 2015-04-28T16:41:10+02:00
in scheme: Thésaurus de la désignation des œuvres architecturales et des espaces aménagés
broader: usine de peausserie
created: 2011-09-01T00:00:00+02:00
definition: Usine où l'on prépare et traite les boyaux des animaux de boucherie pour les approprier à divers usages : charcuterie, cordes pour raquettes de sport, pour instruments de musique, etc.
status: 1

usine de broderie mécanique
type: Concept
modified: 2015-03-19T12:55:41+01:00
in scheme: Thésaurus de la désignation des œuvres architecturales et des espaces aménagés
broader: usine textile
created: 2011-09-01T00:00:00+02:00
definition: Usine où l'on exécute des broderies sur des métiers à broder à bras, à fil continu à pantographe, à fil continu à Jacquard, automatisés, etc. Elle comprend généralement un bureau, un entrepôt industriel, etc.
status: 1

usine de pneumatiques
type: Concept
modified: 2015-02-09T16:20:05+01:00
in scheme: Thésaurus de la désignation des œuvres architecturales et des espaces aménagés
broader: usine de caoutchouc
created: 2011-09-01T00:00:00+02:00
definition: Usine où l'on fabrique des pneumatiques pour différents types de véhicules (automobile, bicyclette, motocycle, etc.) et différents matériels de transport (métro, brouette, etc.). Elle comprend généralement un bureau d'études, un laboratoire, un réservoir industriel, des pistes d'essai, etc.
status: 1

usine de cellulose
type: Concept
modified: 2015-04-28T16:27:10+02:00
in scheme: Thésaurus de la désignation des œuvres architecturales et des espaces aménagés
broader: usine de pâte à papier
created: 2011-09-01T00:00:00+02:00
definition: Usine où l'on fabrique de la pâte à papier à partir de rondins de bois. Elle fonctionne avec des lessiveurs, des chaudières de cuisson, des tambours barboteurs, des épurateurs et comprend généralement une aire des matières premières, un entrepôt industriel, un poste de chargement, etc.
status: 1

usine de pâte à papier
type: Concept
modified: 2015-04-28T16:19:18+02:00
in scheme: Thésaurus de la désignation des œuvres architecturales et des espaces aménagés
narrower: usine de cellulose
broader: usine de papeterie
created: 2011-09-01T00:00:00+02:00
definition: Usine où l'on produit la matière fibreuse destinée à la fabrication du papier suivant différentes opérations (défibrage, défilage ou passage dans des pulpeurs, lessivage, épuration, raffinage, mélange, etc.). Elle comprend généralement un entrepôt industriel, une aire des matières premières, etc.
status: 1

usine de grès
type: Concept
modified: 2015-01-27T15:25:02+01:00
in scheme: Thésaurus de la désignation des œuvres architecturales et des espaces aménagés
broader: usine de céramique
created: 2011-09-01T00:00:00+02:00
definition: Usine où l'on fabrique des objets domestiques en grès ainsi que des grès pour le bâtiment tels que tuyaux d'assainissement, pavés de dallage, grès de chimie, etc. Elle comprend généralement une pièce de séchage, un four industriel, une aire des produits manufacturés, etc.
status: 1

usine de porcelaine
type: Concept
modified: 2015-01-27T15:48:43+01:00
in scheme: Thésaurus de la désignation des œuvres architecturales et des espaces aménagés
broader: usine de céramique
created: 2011-09-01T00:00:00+02:00
definition: Usine où l'on fabrique divers objets utilitaires ou décoratifs en porcelaine (porcelaines dure ou tendre, biscuits, etc.). Elle comprend généralement une pièce de séchage, un four industriel, un magasin industriel, etc.
status: 1

usine de poterie
type: Concept
modified: 2015-01-27T16:00:57+01:00
in scheme: Thésaurus de la désignation des œuvres architecturales et des espaces aménagés
broader: usine de céramique
created: 2011-09-01T00:00:00+02:00
definition: Usine où l'on fabrique divers objets et récipients en céramique non vitrifiée (vernissée ou mate). Elle comprend généralement un four industriel , un bassin de décantation, une pièce de séchage, une aire des produits manufacturés, etc.
status: 1

usine de chaudronnerie
type: Concept
modified: 2014-12-15T12:34:33+01:00
in scheme: Thésaurus de la désignation des œuvres architecturales et des espaces aménagés
broader: usine de petite métallurgie
created: 2011-09-01T00:00:00+02:00
definition: Usine où l'on fabrique des chaudières, gazomètres, alambics, pulvérisateurs, tôles planées en cuivre, en fer, etc. Elle comprend généralement des machines de façonnage des métaux en feuilles, un magasin industriel, une aire des matières premières, etc.
status: 1

usine de colles
type: Concept
modified: 2015-02-09T16:31:06+01:00
in scheme: Thésaurus de la désignation des œuvres architecturales et des espaces aménagés
broader: usine de produits chimiques
created: 2011-09-01T00:00:00+02:00
definition: Usine où l'on fabrique des colles, des mastics, des silicones, etc. et comprenant généralement un atelier de conditionnement, un réservoir industriel, un magasin industriel, etc.
status: 1

usine de composants électroniques
type: Concept
modified: 2015-01-28T14:56:21+01:00
in scheme: Thésaurus de la désignation des œuvres architecturales et des espaces aménagés
broader: usine de construction électronique
created: 2011-09-01T00:00:00+02:00
definition: Usine où l'on fabrique des éléments entrant dans la composition d'un circuit électronique, d'un circuit intégré, d'un circuit imprimé, etc.
status: 1

usine de construction aéronautique
type: Concept
modified: 2015-01-29T15:01:31+01:00
in scheme: Thésaurus de la désignation des œuvres architecturales et des espaces aménagés
broader: usine de construction mécanique
created: 2011-09-01T00:00:00+02:00
definition: Usine où l'on construit (en totalité ou sous forme d'éléments), monte ou assemble des aéronefs. Elle comprend généralement un bureau d'études, un laboratoire, etc.
status: 1

usine de construction automobile
type: Concept
modified: 2015-04-28T15:23:56+02:00
in scheme: Thésaurus de la désignation des œuvres architecturales et des espaces aménagés
broader: usine de construction mécanique
created: 2011-09-01T00:00:00+02:00
definition: Usine où l'on construit (en totalité ou sous forme d'éléments), monte ou assemble des véhicules automobiles. Elle comprend généralement un bureau d'études, un laboratoire, des chaînes de montage, une aire des produits manufacturés, etc.
status: 1

usine de matériel électrique industriel
type: Concept
modified: 2015-04-28T15:00:07+02:00
in scheme: Thésaurus de la désignation des œuvres architecturales et des espaces aménagés
broader: usine de construction électrique
created: 2011-09-01T00:00:00+02:00
definition: Usine où l'on fabrique des moteurs, des générateurs, des transformateurs électriques, etc. et comprenant généralement un bureau, un laboratoire, un magasin industriel, etc.
status: 1

usine de matériel électroménager
type: Concept
modified: 2015-04-28T15:04:28+02:00
in scheme: Thésaurus de la désignation des œuvres architecturales et des espaces aménagés
broader: usine de construction électrique
created: 2011-09-01T00:00:00+02:00
definition: Usine où l'on fabrique du matériel à usage domestique tel que réfrigérateurs, fers à repasser, sèche-cheveux, etc. Elle comprend généralement un bureau, un entrepôt industriel, un magasin industriel, etc.
status: 1

usine de matériel radioélectrique
type: Concept
modified: 2015-01-28T12:27:12+01:00
in scheme: Thésaurus de la désignation des œuvres architecturales et des espaces aménagés
broader: usine de construction électrique
created: 2011-09-01T00:00:00+02:00
definition: Usine où l'on fabrique du matériel pour la navigation, la communication, les orgues, etc. Elle comprend généralement un bureau d'études, un laboratoire, un poste de chargement, etc.
status: 1

usine de petit matériel électrique
type: Concept
modified: 2015-04-28T15:11:05+02:00
in scheme: Thésaurus de la désignation des œuvres architecturales et des espaces aménagés
broader: usine de construction électrique
created: 2011-09-01T00:00:00+02:00
definition: Usine où l'on fabrique des accumulateurs, piles, lampes, ampoules, etc. et comprenant généralement un bureau, un laboratoire, un magasin industriel, une aire des matières premières, etc.
status: 1

usine de matériel électroacoustique
type: Concept
modified: 2015-01-28T15:12:30+01:00
in scheme: Thésaurus de la désignation des œuvres architecturales et des espaces aménagés
broader: usine de construction électronique
created: 2011-09-01T00:00:00+02:00
definition: Usine où l'on fabrique des récepteurs de télévision et du matériel haute-fidélité, et comprenant généralement un bureau, un laboratoire, un magasin industriel, etc.
status: 1

usine de matériel informatique
type: Concept
modified: 2014-11-17T14:15:05+01:00
in scheme: Thésaurus de la désignation des œuvres architecturales et des espaces aménagés
broader: usine de construction électronique
created: 2011-09-01T00:00:00+02:00
definition: Usine où l'on fabrique divers matériels informatiques : ordinateurs, logiciels, lecteurs CD/DVD, imprimantes, etc. Elle se compose généralement d'un bureau, d'un laboratoire, d'un atelier de conditionnement, d'un magasin industriel, etc.
status: 1

usine de matériel de télécommunication
type: Concept
modified: 2015-04-28T15:21:06+02:00
in scheme: Thésaurus de la désignation des œuvres architecturales et des espaces aménagés
broader: usine de construction électronique
created: 2011-09-01T00:00:00+02:00
definition: Usine où l'on fabrique du matériel de radiocommunication, télégraphie, téléphonie, etc. Elle comprend généralement un bureau d'études , un laboratoire, un atelier de conditionnement, etc.
status: 1

usine de construction métallique
type: Concept
modified: 2015-01-29T16:00:39+01:00
in scheme: Thésaurus de la désignation des œuvres architecturales et des espaces aménagés
broader: usine de construction mécanique
created: 2011-09-01T00:00:00+02:00
definition: Usine où l'on fabrique des poutres, planchers, portails, grilles et mobilier métalliques. Elle comprend généralement un bureau d'études, un entrepôt industriel, un magasin industriel, etc.
status: 1

usine de cycles
type: Concept
modified: 2015-01-29T16:33:57+01:00
in scheme: Thésaurus de la désignation des œuvres architecturales et des espaces aménagés
broader: usine de construction mécanique
created: 2011-09-01T00:00:00+02:00
definition: Usine où l'on fabrique des cycles et des motocycles.
status: 1

usine de matériel agricole
type: Concept
modified: 2015-01-29T16:51:15+01:00
in scheme: Thésaurus de la désignation des œuvres architecturales et des espaces aménagés
broader: usine de construction mécanique
created: 2011-09-01T00:00:00+02:00
definition: Usine où l'on fabrique des tracteurs, moissonneuses, etc., comprenant généralement un bureau d'études, une chaîne de fabrication, une aire des produits manufacturés, etc.
status: 1

usine de matériel d'équipement industriel
type: Concept
modified: 2015-01-30T16:10:04+01:00
in scheme: Thésaurus de la désignation des œuvres architecturales et des espaces aménagés
broader: usine de construction mécanique
created: 2011-09-01T00:00:00+02:00
definition: Usine où l'on fabrique des pompes, moteurs, engrenages, machines-outils, etc. Elle comprend généralement un entrepôt industriel, un magasin industriel, une aire des produits manufacturés, etc.
status: 1

usine de matériel ferroviaire
type: Concept
modified: 2015-04-28T15:26:25+02:00
in scheme: Thésaurus de la désignation des œuvres architecturales et des espaces aménagés
broader: usine de construction mécanique
created: 2011-09-01T00:00:00+02:00
definition: Usine où l'on construit du matériel roulant, locomotives, wagons, autorails, etc. Elle comprend généralement un pont roulant, des voies ferrées , etc.
status: 1

usine de contre-plaqué
type: Concept
modified: 2015-03-12T15:31:43+01:00
in scheme: Thésaurus de la désignation des œuvres architecturales et des espaces aménagés
broader: usine liée au travail du bois
created: 2011-09-01T00:00:00+02:00
definition: Usine où l'on fabrique du contreplaqué, ou panneau constitué par un nombre impair de couches de bois (plis) disposées de façon à croiser leur fil et collées sous pression. Elle fonctionne avec des machines de tranchage et de déroulage, des massicots, des dresseuses, des encolleuses, des presses hydrauliques ou à plateaux chauffants, et comprend généralement une aire des matières premières, une chaufferie, etc.
status: 1

usine de décolletage
type: Concept
modified: 2014-12-15T12:53:43+01:00
in scheme: Thésaurus de la désignation des œuvres architecturales et des espaces aménagés
broader: usine de petite métallurgie
created: 2011-09-01T00:00:00+02:00
definition: Usine où l'on fabrique des petites pièces de visserie, de boulonnerie (boulons, écrous, goupilles, goujons, etc.) ou des pièces d'usinage plus complexe, telles que poulie de frein, volant d'embrayage automobile, etc. Elle fonctionne généralement avec des machines à usiner (type tour parallèle) semi-automatiques ou automatiques, et comprend souvent un magasin industriel, etc.
status: 1

usine de délainage
type: Concept
modified: 2014-12-08T15:51:27+01:00
in scheme: Thésaurus de la désignation des œuvres architecturales et des espaces aménagés
broader: usine de peausserie
created: 2011-09-01T00:00:00+02:00
definition: Usine où l'on enlève, à l'aide de délaineuses, la laine des peaux de mouton.
status: 1

usine de dentelle mécanique
type: Concept
modified: 2015-04-30T15:47:11+02:00
in scheme: Thésaurus de la désignation des œuvres architecturales et des espaces aménagés
broader: usine textile
created: 2011-09-01T00:00:00+02:00
definition: Usine où l'on exécute de la dentelle sur des métiers Leavers, Bobin, etc. Elle comprend généralement un bureau, un atelier de conditionnement, un magasin industriel, etc
status: 1

usine de détergents
type: Concept
modified: 2015-02-18T12:33:31+01:00
in scheme: Thésaurus de la désignation des œuvres architecturales et des espaces aménagés
broader: usine de traitement des corps gras
created: 2011-09-01T00:00:00+02:00
definition: Usine où l'on fabrique, à partir de corps gras ou d'hydrocarbures, des produits de nettoyage tels que lessives, produits pour la vaisselle, nettoyants ménagers, etc. Elle comprend généralement une chaufferie, un entrepôt industriel, un atelier de conditionnement, etc.
status: 1

usine électrométallurgique
type: Concept
modified: 2015-03-16T11:09:22+01:00
in scheme: Thésaurus de la désignation des œuvres architecturales et des espaces aménagés
broader: usine de fabrication des métaux
created: 2011-09-01T00:00:00+02:00
definition: Usine où l'on réduit et affine le métal par le passage du courant électrique. Elle comprend généralement un four industriel et fonctionne avec des cuves à anodes, etc.
status: 1

usine de fabrication et distillation des goudrons
type: Concept
modified: 2015-04-29T15:54:03+02:00
in scheme: Thésaurus de la désignation des œuvres architecturales et des espaces aménagés
broader: usine de produits chimiques
created: 2011-09-01T00:00:00+02:00
definition: Usine où l'on fabrique des goudrons de houille, des goudrons de bois, etc. et comprenant généralement des réservoirs industriels, des distillateurs, un laboratoire, etc.
status: 1

usine de façonnage du papier
type: Concept
modified: 2013-04-23T00:00:00+02:00
in scheme: Thésaurus de la désignation des œuvres architecturales et des espaces aménagés
broader: usine de papeterie
created: 2011-09-01T00:00:00+02:00
definition: Usine où l'on assemble et façonne du papier pour en faire des cahiers, des livres, des registres, etc. Elle fonctionne avec des assembleuses, des compteuses de feuilles, des plieuses, des relieurs, des plastifieuses et comprend généralement un bureau, un magasin industriel, etc.
status: 1

usine de ferblanterie
type: Concept
modified: 2015-04-29T14:31:18+02:00
in scheme: Thésaurus de la désignation des œuvres architecturales et des espaces aménagés
broader: usine de petite métallurgie
created: 2011-09-01T00:00:00+02:00
definition: Usine où l'on travaille le fer blanc, le cuivre, le zinc, la tôle, etc., en feuilles, pour produire des récipients, des boîtes de conserve, des articles de bazar, des ustensiles de cuisine, des jouets, etc. Elle comprend généralement un entrepôt industriel, un magasin industriel, etc.
status: 1

usine de fibre de bois
type: Concept
modified: 2015-04-29T16:59:53+02:00
in scheme: Thésaurus de la désignation des œuvres architecturales et des espaces aménagés
broader: usine liée au travail du bois
created: 2011-09-01T00:00:00+02:00
definition: Usine où l'on découpe le bois en lanières minces sur des défibreuses afin de les utiliser pour l'emballage, le calorifugeage, l'armature de certains agglomérés, etc. Elle comprend généralement un hangar, un entrepôt industriel, etc.
status: 1
broad match: http://data.bnf.fr/ark:/12148/cb119618654

usine de fibre de verre
type: Concept
modified: 2015-03-23T15:48:19+01:00
in scheme: Thésaurus de la désignation des œuvres architecturales et des espaces aménagés
broader: verrerie
created: 2011-09-01T00:00:00+02:00
definition: Usine où l'on fabrique de la fibre de verre utilisée en optique, pour l’isolation, etc. Elle fonctionne généralement avec un four industriel, des machines de filage par étirement, d'ensimage, etc.
status: 1

usine de fibres artificielles et synthétiques
type: Concept
modified: 2015-02-10T12:25:38+01:00
in scheme: Thésaurus de la désignation des œuvres architecturales et des espaces aménagés
broader: usine de produits chimiques
created: 2011-09-01T00:00:00+02:00
definition: Usine où l'on fabrique des fibres textiles artificielles, telles que rayonne, fibranne, nylon, polyester, polyamide, acrylique. Elle comprend généralement un laboratoire, des ateliers de filature et d'étirage, un entrepôt industriel, etc.
status: 1

usine de flaconnage
type: Concept
modified: 2015-04-30T15:59:34+02:00
in scheme: Thésaurus de la désignation des œuvres architecturales et des espaces aménagés
narrower: usine de verre destiné a la chimie
broader: usine de verre creux
created: 2011-09-01T00:00:00+02:00
definition: Usine où l'on fabrique flacons, bouteilles et récipients en verre pour la parfumerie, la droguerie, l'alimentation, etc. Elle comprend généralement un bureau, un four industriel, un atelier de conditionnement, etc.
status: 1

usine de verre creux
type: Concept
modified: 2015-04-30T15:56:43+02:00
in scheme: Thésaurus de la désignation des œuvres architecturales et des espaces aménagés
narrower: usine de flaconnage
broader: verrerie
created: 2011-09-01T00:00:00+02:00
definition: Usine où l'on fabrique de la gobeleterie : verres de table, gobelets, pichets, etc. Elle comprend généralement un four industriel, un magasin industriel, un entrepôt industriel, etc.
status: 1

usine de verre destiné a la chimie
type: Concept
modified: 2015-04-30T16:01:50+02:00
in scheme: Thésaurus de la désignation des œuvres architecturales et des espaces aménagés
broader: usine de flaconnage
created: 2011-09-01T00:00:00+02:00
definition: Usine où l'on fabrique divers récipients, instruments et équipements en verre, utilisés en laboratoire par les chimistes et les biologistes (pipettes, cornues, tubes à essais, éprouvettes, etc.). Elle comprend généralement un bureau, un four industriel, etc.
status: 1

usine de gainerie
type: Concept
modified: 2014-12-08T16:28:48+01:00
in scheme: Thésaurus de la désignation des œuvres architecturales et des espaces aménagés
broader: usine de maroquinerie
created: 2011-09-01T00:00:00+02:00
definition: Usine où l'on fabrique des étuis de cuir fin pour en revêtir divers objets faits d'une autre matière, comme les briquets, les sous-mains, les albums, etc. Elle comprend généralement un atelier de conditionnement, un magasin industriel, etc.
status: 1

usine de maroquinerie
type: Concept
modified: 2015-04-28T16:43:21+02:00
in scheme: Thésaurus de la désignation des œuvres architecturales et des espaces aménagés
narrower: usine de gainerie
broader: usine de peausserie
created: 2011-09-01T00:00:00+02:00
definition: Usine où l'on utilise des cuirs fins pour fabriquer ou revêtir divers articles tels que portefeuilles, sacs à main, serviettes, ceintures, porte-cartes, etc. Elle comprend généralement un entrepôt industriel, un atelier de conditionnement, un magasin industriel, etc.
status: 1

usine de gaz comprimés
type: Concept
modified: 2015-04-29T15:55:48+02:00
in scheme: Thésaurus de la désignation des œuvres architecturales et des espaces aménagés
broader: usine de produits chimiques
created: 2011-09-01T00:00:00+02:00
definition: Usine où l'on produit de l'oxygène, de l'hydrogène, de l'azote, de l’acétylène dissous, etc. Elle comprend généralement un bureau, un magasin industriel, un château d'eau, etc.
status: 1

usine de lunetterie
type: Concept
modified: 2015-04-28T15:47:16+02:00
in scheme: Thésaurus de la désignation des œuvres architecturales et des espaces aménagés
broader: usine de matériel optique
created: 2011-09-01T00:00:00+02:00
definition: Usine où l'on fabrique des lunettes destinées à aider ou à protéger la vue et comportant généralement un bureau, un bureau d'études, un atelier de réparation, un atelier de conditionnement, etc.
status: 1

usine de matériel optique
type: Concept
modified: 2015-04-28T15:45:29+02:00
in scheme: Thésaurus de la désignation des œuvres architecturales et des espaces aménagés
narrower: usine de lunetterie
narrower: usine de matériel photocinématographique
broader: usine de mécanique de précision
created: 2011-09-01T00:00:00+02:00
scope note: Ce terme correspond à une usine de montage, la fabrication du verre optique étant effectuée dans une usine de verres optiques.
definition: Usine où l'on fabrique des microscopes, jumelles, loupes, télescopes, etc.
status: 1

usine de matériel de bureau
type: Concept
modified: 2015-02-04T14:21:19+01:00
in scheme: Thésaurus de la désignation des œuvres architecturales et des espaces aménagés
broader: usine de mécanique de précision
created: 2011-09-01T00:00:00+02:00
definition: Usine où l'on fabrique des machines à écrire, à calculer, etc.
status: 1

usine de matériel médicochirurgical
type: Concept
modified: 2015-02-04T14:24:47+01:00
in scheme: Thésaurus de la désignation des œuvres architecturales et des espaces aménagés
broader: usine de mécanique de précision
created: 2011-09-01T00:00:00+02:00
definition: Usine où l'on fabrique du matériel utilisé pour les soins en médecine et en chirurgie, et comprenant généralement des bureaux, un laboratoire, un magasin industriel, etc.
status: 1

usine de matériel photocinématographique
type: Concept
modified: 2015-04-28T15:50:40+02:00
in scheme: Thésaurus de la désignation des œuvres architecturales et des espaces aménagés
broader: usine de matériel optique
created: 2011-09-01T00:00:00+02:00
scope note: Ne pas confondre avec studio de cinéma.
definition: Usine où l'on fabrique des appareils ou du matériel destinés à la prise de vue, aux laboratoires photocinématographiques, etc.
status: 1

usine de peintures et vernis
type: Concept
modified: 2015-04-29T16:06:41+02:00
in scheme: Thésaurus de la désignation des œuvres architecturales et des espaces aménagés
broader: usine de matières colorantes synthétiques
created: 2011-09-01T00:00:00+02:00
definition: Usine où l'on fabrique des matières colorantes à base de pigments, de liants, de solvants et d'additifs, destinées à recouvrir des surfaces diverses. Elle fonctionne avec des broyeurs à pâte, des mélangeurs et des filtres à cartouches, et comprend généralement un atelier de conditionnement, un magasin industriel, etc.
status: 1

usine de pièces détachées en matière plastique
type: Concept
modified: 2015-02-11T14:59:58+01:00
in scheme: Thésaurus de la désignation des œuvres architecturales et des espaces aménagés
broader: usine de matières plastiques
created: 2011-09-01T00:00:00+02:00
definition: Usine où l'on fabrique des pièces détachées en matière plastique pour l'industrie automobile (joints d'étanchéité, soufflets de transmission, poignées, etc.) pour la lunetterie, la robotique, l'électronique, etc. Elle comprend généralement un bureau d'études, un transformateur, un atelier de conditionnement, etc.
status: 1

usine de roulements
type: Concept
modified: 2014-11-27T16:00:49+01:00
in scheme: Thésaurus de la désignation des œuvres architecturales et des espaces aménagés
broader: usine de mécanique de précision
created: 2011-09-01T00:00:00+02:00
definition: Usine où l'on fabrique des roulements, des paliers et des butées à billes, etc., en procédant à différentes opérations (traitement thermique, rectification, polissage, etc.).
status: 1

usine de menuiserie
type: Concept
modified: 2015-03-12T16:26:46+01:00
in scheme: Thésaurus de la désignation des œuvres architecturales et des espaces aménagés
narrower: usine de meubles
broader: usine liée au travail du bois
created: 2011-09-01T00:00:00+02:00
definition: Usine où l'on fabrique, suivant différentes opérations (sciage, rabotage, toupillage, mortaisage, tenonnage), parquets, lambris, portes et fenêtres en bois, etc. Elle comprend généralement une aire des matières premières, un bureau, un magasin industriel, etc.
status: 1

usine de meubles
type: Concept
modified: 2015-04-29T17:15:18+02:00
in scheme: Thésaurus de la désignation des œuvres architecturales et des espaces aménagés
broader: usine de menuiserie
created: 2011-09-01T00:00:00+02:00
definition: Usine où l'on fabrique du mobilier (armoire, commode, table, lit, siège, etc.) destiné à l'aménagement d'un lieu. Elle comprend généralement un entrepôt industriel, un bureau, un magasin industriel, etc.
status: 1

usine de mise en bouteilles
type: Concept
modified: 2015-04-29T15:30:15+02:00
in scheme: Thésaurus de la désignation des œuvres architecturales et des espaces aménagés
narrower: usine de mise en bouteilles des eaux minérales
broader: usine de produits agro-alimentaires
created: 2011-09-01T00:00:00+02:00
definition: Usine où l'on met en bouteilles différents types de boissons (eaux, jus de fruits, vins, alcools, spiritueux, etc.). Elle comprend généralement des machines à rincer, à mettre en bouteilles, à capsuler, un bureau, un entrepôt industriel, un magasin industriel, etc.
status: 1

usine de mise en bouteilles des eaux minérales
type: Concept
modified: 2015-04-29T15:35:38+02:00
in scheme: Thésaurus de la désignation des œuvres architecturales et des espaces aménagés
broader: usine de mise en bouteilles
created: 2011-09-01T00:00:00+02:00
definition: Usine où l'on met en bouteilles l'eau minérale naturelle, l'eau de source, etc. Elle comprend généralement une station de captage, des lignes d'embouteillage, des machines à capsuler, un bureau, un entrepôt industriel, un magasin industriel, etc.
status: 1
broad match: http://vocab.getty.edu/aat/300006340

usine de moutarde
type: Concept
modified: 2015-04-29T15:38:01+02:00
in scheme: Thésaurus de la désignation des œuvres architecturales et des espaces aménagés
broader: usine de produits agro-alimentaires
created: 2011-09-01T00:00:00+02:00
definition: Usine où l'on fabrique de la moutarde à base de grains de la plante éponyme, par broyage, malaxage et tamisage. Elle comprend généralement un bureau, un atelier de conditionnement, un magasin industriel, etc.
status: 1

usine de pâtes alimentaires
type: Concept
modified: 2015-02-04T15:37:23+01:00
in scheme: Thésaurus de la désignation des œuvres architecturales et des espaces aménagés
broader: usine de produits agro-alimentaires
created: 2011-09-01T00:00:00+02:00
definition: Usine où l'on fabrique des pâtes à base de semoule de blé dur. Elle comprend généralement des salles de broyage, une pièce de séchage, un atelier de conditionnement, un magasin industriel, etc.
status: 1

usine de pelleterie
type: Concept
modified: 2015-04-28T16:46:30+02:00
in scheme: Thésaurus de la désignation des œuvres architecturales et des espaces aménagés
broader: usine de peausserie
created: 2011-09-01T00:00:00+02:00
definition: Usine où l'on prépare les peaux avec leur poil pour en faire des fourrures. Elle comprend généralement un entrepôt industriel, un magasin industriel, etc.
status: 1

usine de traitement du poil animal
type: Concept
modified: 2013-04-23T00:00:00+02:00
in scheme: Thésaurus de la désignation des œuvres architecturales et des espaces aménagés
broader: usine de peausserie
created: 2011-09-01T00:00:00+02:00
scope note: Ne pas confondre avec tannerie, ni avec chamoiserie, ni avec brosserie.
definition: Usine où l'on fait subir diverses préparations (peignage, cardage, frisage, etc.) au poil animal (soie de porc, crin, poil de lapin, etc.) en vue de réaliser des matelas, des coussins, des tamis, des brosses et des feutres.
status: 1

usine liée au travail de la corne
type: Concept
modified: 2015-04-28T16:56:07+02:00
in scheme: Thésaurus de la désignation des œuvres architecturales et des espaces aménagés
broader: usine de peausserie
created: 2011-09-01T00:00:00+02:00
definition: Usine spécialisée dans la préparation de la corne (tri, débitage et dressage) pour la tabletterie ou pour la fabrication d'engrais (broyage de la corne en poudre). Elle comprend généralement des machines à mouler par compression, à découper, à polir, à broyer, etc.
status: 1

usine de quincaillerie
type: Concept
modified: 2014-12-15T15:59:13+01:00
in scheme: Thésaurus de la désignation des œuvres architecturales et des espaces aménagés
broader: usine de petite métallurgie
created: 2011-09-01T00:00:00+02:00
definition: Usine où l'on fabrique des petites pièces métalliques telles que clous, boucles, étriers, rivets, crochets, épingles, etc. Elle comprend généralement un entrepôt industriel, un magasin industriel, etc.
status: 1

usine de serrurerie
type: Concept
modified: 2014-12-16T15:31:26+01:00
in scheme: Thésaurus de la désignation des œuvres architecturales et des espaces aménagés
broader: usine de petite métallurgie
created: 2011-09-01T00:00:00+02:00
definition: Usine où l'on fabrique des serrures, des stores, des volets métalliques ainsi que toute décoration métallique, etc.
status: 1

usine de taillanderie
type: Concept
modified: 2015-04-29T14:34:15+02:00
in scheme: Thésaurus de la désignation des œuvres architecturales et des espaces aménagés
broader: usine de petite métallurgie
created: 2011-09-01T00:00:00+02:00
definition: Usine où l'on fabrique des outils et fers tranchants pour l'agriculture : faux, faucilles, socs, etc. Elle comprend généralement un bassin de retenue, un bief de dérivation, une soufflerie, etc.
status: 1

usine de sélection de semences
type: Concept
modified: 2015-04-29T15:41:40+02:00
in scheme: Thésaurus de la désignation des œuvres architecturales et des espaces aménagés
broader: usine de préparation d'un produit agroalimentaire
created: 2011-09-01T00:00:00+02:00
definition: Usine où l'on sélectionne et prépare par différents procédés (sélection massale, chimique, hybride, enrobage, pralinage) des semences céréalières, fourragères, légumières ou potagères, afin de mettre à disposition des planteurs des semences adaptées à leurs besoins. Elle comprend généralement un laboratoire, une pièce de séchage, une chambre froide, etc.
status: 1

usine de préparation de produits textiles
type: Concept
modified: 2015-03-19T17:04:02+01:00
in scheme: Thésaurus de la désignation des œuvres architecturales et des espaces aménagés
broader: usine textile
created: 2011-09-01T00:00:00+02:00
definition: Usine où l'on fait subir aux matières premières ou aux produits textiles (laine, coton, chiffon, etc.) différentes opérations (lavage, cardage, carbonisage, peignage, lissage, effilochage, etc.) en vue de leur transformation en fils ou en feutres. Elle comprend généralement un entrepôt industriel, une station de pompage, une station d'épuration, etc.
status: 1

usine de produits pour l'alimentation animale
type: Concept
modified: 2015-02-06T11:23:36+01:00
in scheme: Thésaurus de la désignation des œuvres architecturales et des espaces aménagés
broader: usine de produits agro-alimentaires
created: 2011-09-01T00:00:00+02:00
definition: Usine où l'on fabrique des aliments composés équilibrés pour les animaux (tourteaux de soja, tournesol, colza, granulés, etc.). Elle comprend généralement un entrepôt industriel, un silo, un poste de chargement, etc.
status: 1

usine de tabac
type: Concept
modified: 2015-02-06T11:44:48+01:00
in scheme: Thésaurus de la désignation des œuvres architecturales et des espaces aménagés
broader: usine de produits agro-alimentaires
created: 2011-09-01T00:00:00+02:00
definition: Usine où l'on fabrique cigares, cigarettes, scaferlatis, etc. Elle comprend généralement un bureau, un entrepôt industriel, un atelier de conditionnement, etc.
status: 1

vinaigrerie
type: Concept
modified: 2015-02-06T14:59:38+01:00
in scheme: Thésaurus de la désignation des œuvres architecturales et des espaces aménagés
broader: usine de produits agro-alimentaires
created: 2011-09-01T00:00:00+02:00
definition: Usine où l'on fabrique le vinaigre par fermentation de surface en fûts de chêne ou par fermentation immergée dans des cuves en inox (acétateurs). Elle comprend généralement un entrepôt industriel, un atelier de conditionnement, un poste de chargement, etc.
status: 1

usine de produits électrochimiques
type: Concept
modified: 2015-02-11T15:17:26+01:00
in scheme: Thésaurus de la désignation des œuvres architecturales et des espaces aménagés
broader: usine de produits chimiques
created: 2011-09-01T00:00:00+02:00
definition: Usine où l'on fabrique des produits chimiques par électrolyse ou électrothermie tels que le carbonate de soude, le chlore, la soude caustique, etc. Elle comprend généralement des ateliers abritant des cellules à cathode de mercure, des cellules à diaphragme, des appareils à cloche, etc.
status: 1

usine de produits d'entretien
type: Concept
modified: 2015-02-11T15:12:11+01:00
in scheme: Thésaurus de la désignation des œuvres architecturales et des espaces aménagés
broader: usine de produits chimiques
created: 2011-09-01T00:00:00+02:00
definition: Usine où l'on fabrique encaustiques, désodorisants, insecticides ménagers, etc. Elle comprend généralement des ateliers de saponification ou de sulfonation, un atelier de conditionnement, un magasin industriel, etc.
status: 1

usine de produits organiques de synthèse
type: Concept
modified: 2013-04-23T00:00:00+02:00
in scheme: Thésaurus de la désignation des œuvres architecturales et des espaces aménagés
broader: usine de produits chimiques
created: 2011-09-01T00:00:00+02:00
definition: Usine où l'on fabrique l'éthylène, le propylène, le butadiène, le benzène, le styrène, etc. Elle comprend généralement un réservoir industriel , un laboratoire, une chaufferie, etc.
status: 1

usine de produits pharmaceutiques
type: Concept
modified: 2015-02-12T12:07:34+01:00
in scheme: Thésaurus de la désignation des œuvres architecturales et des espaces aménagés
broader: usine de produits chimiques
created: 2011-09-01T00:00:00+02:00
definition: Usine où l'on fabrique des médicaments de synthèse sous diverses formes (comprimé, sirop, soluté, injectable, etc.), des produits vétérinaires, des produits d'hygiène et de prophylaxie antiparasitaire, etc. Elle comprend généralement un laboratoire, un bureau, un atelier de conditionnement, un poste de chargement, etc.
status: 1

usine de produits photographiques et cinématographiques
type: Concept
modified: 2015-04-29T16:33:56+02:00
in scheme: Thésaurus de la désignation des œuvres architecturales et des espaces aménagés
broader: usine de produits chimiques
created: 2011-09-01T00:00:00+02:00
definition: Usine où l'on fabrique les diverses surfaces sensibles utilisées en photographie et cinématographie. Elle comprend généralement un laboratoire, un atelier des émulsions, un atelier de façonnage du celluloïd, une pièce de séchage, etc.
status: 1

usine de produits phytosanitaires
type: Concept
modified: 2015-04-29T16:36:35+02:00
in scheme: Thésaurus de la désignation des œuvres architecturales et des espaces aménagés
broader: usine de produits chimiques
created: 2011-09-01T00:00:00+02:00
definition: Usine où l'on fabrique des fongicides, herbicides, insecticides, bactéricides, etc. Elle comprend généralement un bureau, un laboratoire, un atelier de conditionnement, etc.
status: 1

usine de soufre
type: Concept
modified: 2015-04-29T16:39:06+02:00
in scheme: Thésaurus de la désignation des œuvres architecturales et des espaces aménagés
broader: usine de produits chimiques
created: 2011-09-01T00:00:00+02:00
definition: Usine où l'on fabrique du soufre à partir de l'hydrogène sulfuré contenu dans le gaz ou le pétrole. Elle comprend généralement une section de désulfuration à colonnes, une section de brûlage avec fours industriels, une section de conversion catalytique avec réacteurs et tours de lavage, etc.
status: 1

usine de tabletterie
type: Concept
modified: 2015-03-12T17:14:50+01:00
in scheme: Thésaurus de la désignation des œuvres architecturales et des espaces aménagés
broader: usine liée au travail du bois
created: 2011-09-01T00:00:00+02:00
definition: Usine où l'on travaille le bois, le corozo, l'os, la corne, l'ivoire et la nacre pour boîtes, coffrets, manches de couteaux, articles pour fumeurs, éventails, peignes, dominos, etc. Elle comprend généralement un bureau, un atelier de conditionnement, un magasin industriel, etc.
status: 1

usine de teinturerie
type: Concept
modified: 2015-03-23T12:46:11+01:00
in scheme: Thésaurus de la désignation des œuvres architecturales et des espaces aménagés
broader: usine textile
created: 2011-09-01T00:00:00+02:00
definition: Usine où l'on teint les matières textiles et les étoffes en fixant un colorant sur la fibre par imprégnation mécanique ou chimique. Elle comprend généralement un laboratoire, une chaufferie, une pièce de séchage, etc.
status: 1

usine de traitement de surface des métaux
type: Concept
modified: 2015-03-16T11:44:47+01:00
in scheme: Thésaurus de la désignation des œuvres architecturales et des espaces aménagés
broader: usine métallurgique
created: 2011-09-01T00:00:00+02:00
definition: Usine où l'on recouvre des pièces de métal d'une couche de nickel, d'or, d'argent, d'étain, etc., par des procédés d'électrolyse ou de bains.
status: 1

usine de traitement du bois
type: Concept
modified: 2015-04-29T17:18:57+02:00
in scheme: Thésaurus de la désignation des œuvres architecturales et des espaces aménagés
broader: usine liée au travail du bois
created: 2011-09-01T00:00:00+02:00
definition: Usine où l'on traite le bois par différents procédés tels que l'étuvage (élimination de la sève du bois par séchage en étuve) ou le créosotage (imprégnation du bois de créosote soit par injection sous pression, soit par trempage). Elle comprend une aire desmatières premières , une aire des produits manufacturés, un magasin industriel, etc.
status: 1

usine de traitement thermique des métaux
type: Concept
modified: 2015-03-16T11:54:38+01:00
in scheme: Thésaurus de la désignation des œuvres architecturales et des espaces aménagés
broader: usine métallurgique
created: 2011-09-01T00:00:00+02:00
definition: Usine où l'on refroidit, trempe et recuit le métal en vue de lui donner les qualités physiques voulues (dureté, ductilité, etc.).
status: 1

usine de verres optiques
type: Concept
modified: 2015-03-24T12:18:04+01:00
in scheme: Thésaurus de la désignation des œuvres architecturales et des espaces aménagés
broader: verrerie
created: 2011-09-01T00:00:00+02:00
scope note: Ne pas confondre avec usine de matériel optique.
definition: Usine où l'on fabrique des lentilles (y compris des verres de lunettes), des prismes, des guides de lumière, des fibres optiques, etc. Elle comprend généralement un bureau d'études, un magasin industriel, un laboratoire, etc.
status: 1

ville nouvelle
type: Concept
modified: 2015-01-07T11:46:18+01:00
in scheme: Thésaurus de la désignation des œuvres architecturales et des espaces aménagés
preferred label: new towns @en-us
preferred label: new town @en-gb
narrower: ville neuve
broader: ville
created: 2011-09-01T00:00:00+02:00
definition: Agglomération planifiée créée a novo.
status: 1

ville satellite
type: Concept
modified: 2014-10-17T14:26:29+02:00
in scheme: Thésaurus de la désignation des œuvres architecturales et des espaces aménagés
preferred label: satellite towns @en-us
broader: ville
created: 2011-09-01T00:00:00+02:00
definition: Agglomération ou partie d'agglomération aux fonctions spécialisées, comme le logement ou l'industrie, qui la rendent partiellement dépendante d'une autre agglomération dont les fonctions sont plus diversifiées et plus importantes, en particulier pour l'emploi et les services.
status: 1
broad match: http://data.bnf.fr/ark:/12148/cb119382735

ville neuve
type: Concept
modified: 2014-10-17T14:25:16+02:00
in scheme: Thésaurus de la désignation des œuvres architecturales et des espaces aménagés
broader: ville nouvelle
created: 2011-09-01T00:00:00+02:00
scope note: Dans le sud-ouest de la France, les villes neuves sont appelées bastides, castelnaux, sauvetés, etc.
definition: Au Moyen Âge, agglomération nouvelle ou fortement étendue selon un plan régulier, généralement à maillage orthogonal.
status: 1
broad match: http://vocab.getty.edu/aat/300008449
broad match: http://data.bnf.fr/ark:/12148/cb119674524
broad match: Ville nouvelle

voussure
type: Concept
modified: 2015-02-24T17:34:58+01:00
in scheme: Thésaurus de la désignation des œuvres architecturales et des espaces aménagés
preferred label: splayed arches & voussoirs @en-us
broader: voûte
created: 2011-09-01T00:00:00+02:00
scope note: Voir aussi le Thesaurus des objets mobiliers.
definition: Voûte couvrant l'embrasure profonde d'une baie ébrasée.
status: 1

fontaine de dévotion
type: Concept
modified: 2015-02-24T12:05:26+01:00
in scheme: Thésaurus de la désignation des œuvres architecturales et des espaces aménagés
broader: édicule religieux chrétien
created: 2011-09-01T00:00:00+02:00
definition: Fontaine généralement extérieure vouée à un culte particulier.
status: 1

causeEffet
type: ObjectProperty
sub property of: related

actionProduction
type: ObjectProperty
sub property of: related

broaderGeneric
type: ObjectProperty
sub property of: broader
inverse of: narrowerGeneric

narrowerGeneric
type: ObjectProperty
sub property of: narrower
inverse of: broaderGeneric

broaderPartitive
type: ObjectProperty
sub property of: broader
inverse of: narrowerPartitive

narrowerPartitive
type: ObjectProperty
sub property of: narrower
inverse of: broaderPartitive

narrowerInstantive
type: ObjectProperty
sub property of: narrower
inverse of: broaderInstantive

broaderInstantive
type: ObjectProperty
sub property of: broader
inverse of: narrowerInstantive

TermeAssocie
type: ObjectProperty
sub property of: related

CustomConceptAttribute
type: DatatypeProperty

status
type: DatatypeProperty

tunnel
type: PreferredTerm
modified: 2014-12-02T15:05:59+01:00
created: 2011-09-01T00:00:00+02:00
status: 1

rigole
type: PreferredTerm
modified: 2014-12-02T12:44:16+01:00
created: 2011-09-01T00:00:00+02:00
status: 1

conservatoire
type: PreferredTerm
modified: 2014-12-01T16:06:04+01:00
created: 2011-09-01T00:00:00+02:00
status: 1

conservatoire de musique
type: SimpleNonPreferredTerm
modified: 2014-12-01T16:06:04+01:00
created: 2011-09-01T00:00:00+02:00
status: 1

école de théâtre
type: SimpleNonPreferredTerm
modified: 2014-12-01T16:06:04+01:00
created: 2011-09-01T00:00:00+02:00
status: 1

élévateur à bateau
type: PreferredTerm
modified: 2014-10-16T14:47:20+02:00
created: 2011-09-01T00:00:00+02:00
status: 1

ascenseur à bateau
type: SimpleNonPreferredTerm
modified: 2014-10-16T14:47:20+02:00
created: 2011-09-01T00:00:00+02:00
status: 1

écluse à sas mobile
type: SimpleNonPreferredTerm
modified: 2014-10-16T14:47:20+02:00
created: 2011-09-01T00:00:00+02:00
status: 1

édicule artisanal
type: PreferredTerm
modified: 2013-04-23T00:00:00+02:00
created: 2011-09-01T00:00:00+02:00
status: 1

immeuble à logements
type: PreferredTerm
modified: 2014-12-31T12:31:19+01:00
created: 2011-09-01T00:00:00+02:00
status: 1

four à chanvre
type: PreferredTerm
modified: 2015-02-25T15:39:19+01:00
created: 2011-09-01T00:00:00+02:00
status: 1

usine de fibre de verre
type: PreferredTerm
modified: 2015-03-23T15:48:19+01:00
created: 2011-09-01T00:00:00+02:00
status: 1

ensemble de construction électrique
type: PreferredTerm
modified: 2015-05-04T14:58:51+02:00
created: 2011-09-01T00:00:00+02:00
status: 1

usine de pneumatiques
type: PreferredTerm
modified: 2015-02-09T16:20:05+01:00
created: 2011-09-01T00:00:00+02:00
status: 1

barrage fixe
type: SimpleNonPreferredTerm
modified: 2014-12-01T14:00:58+01:00
created: 2011-09-01T00:00:00+02:00
status: 1

barrage
type: PreferredTerm
modified: 2014-12-01T14:00:58+01:00
created: 2011-09-01T00:00:00+02:00
status: 1

chapels 2
type: PreferredTerm
modified: 2014-10-15T17:13:11+02:00
created: 2011-09-01T00:00:00+02:00
status: 1

cappella 2
type: PreferredTerm
modified: 2014-10-15T17:13:11+02:00
created: 2011-09-01T00:00:00+02:00
status: 1

chapel 2
type: PreferredTerm
modified: 2014-10-15T17:13:11+02:00
created: 2011-09-01T00:00:00+02:00
status: 1

chapelle d'église
type: PreferredTerm
modified: 2014-10-15T17:13:11+02:00
created: 2011-09-01T00:00:00+02:00
status: 1

tribune du public
type: PreferredTerm
modified: 2014-10-17T16:46:58+02:00
created: 2011-09-01T00:00:00+02:00
status: 1

calvaire monumental
type: PreferredTerm
modified: 2015-02-24T11:44:09+01:00
created: 2011-09-01T00:00:00+02:00
status: 1

calvario
type: PreferredTerm
modified: 2015-02-24T11:44:09+01:00
created: 2011-09-01T00:00:00+02:00
status: 1

calvary crosses + monuments
type: PreferredTerm
modified: 2015-02-24T11:44:09+01:00
created: 2011-09-01T00:00:00+02:00
status: 1

calvaire extérieur
type: SimpleNonPreferredTerm
modified: 2015-02-24T11:44:09+01:00
created: 2011-09-01T00:00:00+02:00
status: 1

croix calvaire
type: SimpleNonPreferredTerm
modified: 2015-02-24T11:44:09+01:00
created: 2011-09-01T00:00:00+02:00
status: 1

calvary
type: PreferredTerm
modified: 2015-02-24T11:44:09+01:00
created: 2011-09-01T00:00:00+02:00
status: 1

voûte
type: PreferredTerm
modified: 2015-02-24T17:23:08+01:00
created: 2011-09-01T00:00:00+02:00
status: 1

courtine
type: PreferredTerm
modified: 2015-01-05T12:36:35+01:00
created: 2011-09-01T00:00:00+02:00
status: 1

remise à automobiles
type: SimpleNonPreferredTerm
modified: 2014-12-31T15:57:24+01:00
created: 2011-09-01T00:00:00+02:00
status: 1

garage
type: PreferredTerm
modified: 2014-12-31T15:57:24+01:00
created: 2011-09-01T00:00:00+02:00
status: 1

sous-station électrique
type: SimpleNonPreferredTerm
modified: 2014-12-02T15:04:59+01:00
created: 2011-09-01T00:00:00+02:00
status: 1

transformateur (abri)
type: PreferredTerm
modified: 2014-12-02T15:04:59+01:00
created: 2011-09-01T00:00:00+02:00
status: 1

usine de matériel ferroviaire
type: PreferredTerm
modified: 2015-04-28T15:26:25+02:00
created: 2011-09-01T00:00:00+02:00
status: 1

siphon
type: PreferredTerm
modified: 2014-10-16T15:20:46+02:00
created: 2011-09-01T00:00:00+02:00
status: 1

usine de construction électrique
type: PreferredTerm
modified: 2015-04-28T14:57:57+02:00
created: 2011-09-01T00:00:00+02:00
status: 1

christian + religious structures
type: PreferredTerm
modified: 2015-02-24T11:42:54+01:00
created: 2011-09-01T00:00:00+02:00
status: 1

édicule religieux chrétien
type: PreferredTerm
modified: 2015-02-24T11:42:54+01:00
created: 2011-09-01T00:00:00+02:00
status: 1

station service
type: PreferredTerm
modified: 2014-12-05T11:19:56+01:00
created: 2011-09-01T00:00:00+02:00
status: 1

école de danse
type: PreferredTerm
modified: 2014-10-16T10:22:29+02:00
created: 2011-09-01T00:00:00+02:00
status: 1

four
type: PreferredTerm
modified: 2015-02-25T14:43:42+01:00
created: 2011-09-01T00:00:00+02:00
status: 1

émissaire
type: SimpleNonPreferredTerm
modified: 2014-12-02T12:04:39+01:00
created: 2011-09-01T00:00:00+02:00
status: 1

égout
type: PreferredTerm
modified: 2014-12-02T12:04:39+01:00
created: 2011-09-01T00:00:00+02:00
status: 1

aménagement de bac
type: PreferredTerm
modified: 2014-10-23T12:36:05+02:00
created: 2011-09-01T00:00:00+02:00
status: 1

pulpit
type: PreferredTerm
modified: 2014-10-15T17:12:05+02:00
created: 2011-09-01T00:00:00+02:00
status: 1

pulpito esterno
type: PreferredTerm
modified: 2014-10-15T17:12:05+02:00
created: 2011-09-01T00:00:00+02:00
status: 1

chaire à prêcher extérieure
type: PreferredTerm
modified: 2014-10-15T17:12:05+02:00
created: 2011-09-01T00:00:00+02:00
status: 1

exterior + pulpits
type: PreferredTerm
modified: 2014-10-15T17:12:05+02:00
created: 2011-09-01T00:00:00+02:00
status: 1

ensemble de mécanique de précision
type: PreferredTerm
modified: 2015-05-04T15:16:30+02:00
created: 2011-09-01T00:00:00+02:00
status: 1

partie d'édifice de l'administration ou de la vie publique
type: Concept
modified: 2013-10-15T19:08:38+02:00
in scheme: Thésaurus de la désignation des œuvres architecturales et des espaces aménagés
broader: architecture civile publique
created: 2013-10-15T19:06:48+02:00
definition: Partie d’un édifice de l'administration ou de la vie publique ou d’une construction qui lui est associée.
status: 1

partie d'édifice de l'administration ou de la vie publique
type: PreferredTerm
modified: 2013-10-15T19:08:38+02:00
created: 2013-10-15T19:06:48+02:00
status: 1

salle des mariages
type: Concept
modified: 2014-10-17T15:37:15+02:00
in scheme: Thésaurus de la désignation des œuvres architecturales et des espaces aménagés
created: 2013-10-15T19:13:34+02:00
definition: Salle d’une mairie dans laquelle les mariages sont publiquement célébrés par un officier d’état civil.
status: 1
broad match: http://vocab.getty.edu/aat/300006063
broad match: cb12049407z

architecture militaire
type: PreferredTerm
modified: 2013-04-23T00:00:00+02:00
created: 2011-09-01T00:00:00+02:00
status: 1

coupole
type: PreferredTerm
modified: 2015-02-24T17:24:39+01:00
created: 2011-09-01T00:00:00+02:00
status: 1

porte charretière
type: PreferredTerm
modified: 2015-02-25T11:26:38+01:00
created: 2011-09-01T00:00:00+02:00
status: 1

aménagement sportif
type: PreferredTerm
modified: 2014-09-05T15:41:04+02:00
created: 2011-09-01T00:00:00+02:00
status: 1

chemin de ronde
type: PreferredTerm
modified: 2015-01-05T12:34:36+01:00
created: 2011-09-01T00:00:00+02:00
status: 1

salle de bal
type: Concept
modified: 2014-10-17T15:57:59+02:00
in scheme: Thésaurus de la désignation des œuvres architecturales et des espaces aménagés
preferred label: ballrooms @en-us
broader: établissement de danse
created: 2013-10-15T19:04:21+02:00
definition: Grande pièce d’un édifice où sont organisés des bals, et d’autres manifestations.
status: 1

salle de bal
type: PreferredTerm
modified: 2014-10-17T15:57:59+02:00
created: 2011-09-01T00:00:00+02:00
status: 1

jardin
type: PreferredTerm
modified: 2014-12-31T11:21:27+01:00
created: 2011-09-01T00:00:00+02:00
status: 1

hôtel
type: PreferredTerm
modified: 2014-12-31T12:22:24+01:00
created: 2011-09-01T00:00:00+02:00
status: 1

pavement
type: PreferredTerm
modified: 2015-02-25T10:25:18+01:00
created: 2011-09-01T00:00:00+02:00
status: 1

chapelle funéraire
type: PreferredTerm
modified: 2014-09-22T16:20:32+02:00
created: 2011-09-01T00:00:00+02:00
status: 1

sepulchral chapels
type: PreferredTerm
modified: 2014-09-22T16:20:32+02:00
created: 2011-09-01T00:00:00+02:00
status: 1

cappella signorile
type: PreferredTerm
modified: 2014-09-22T16:20:32+02:00
created: 2011-09-01T00:00:00+02:00
status: 1

funeral chapel
type: PreferredTerm
modified: 2014-09-22T16:20:32+02:00
created: 2011-09-01T00:00:00+02:00
status: 1

ensemble de petite métallurgie
type: PreferredTerm
modified: 2015-04-14T15:57:40+02:00
created: 2011-09-01T00:00:00+02:00
status: 1

péage
type: SimpleNonPreferredTerm
modified: 2014-10-09T11:38:01+02:00
created: 2011-09-01T00:00:00+02:00
status: 1

station de péage
type: PreferredTerm
modified: 2014-10-09T11:38:01+02:00
created: 2011-09-01T00:00:00+02:00
status: 1

cantine
type: PreferredTerm
modified: 2015-02-25T11:31:18+01:00
created: 2011-09-01T00:00:00+02:00
status: 1

restaurant administratif
type: SimpleNonPreferredTerm
modified: 2015-02-25T11:31:18+01:00
created: 2011-09-01T00:00:00+02:00
status: 1

mess
type: SimpleNonPreferredTerm
modified: 2015-02-25T11:31:18+01:00
created: 2011-09-01T00:00:00+02:00
status: 1

salle du théâtre
type: PreferredTerm
modified: 2014-10-17T16:43:12+02:00
created: 2011-09-01T00:00:00+02:00
status: 1

rose d'architecture
type: PreferredTerm
modified: 2014-10-16T10:49:33+02:00
created: 2011-09-01T00:00:00+02:00
status: 1

usine de produits organiques de synthèse
type: PreferredTerm
modified: 2013-04-23T00:00:00+02:00
created: 2011-09-01T00:00:00+02:00
status: 1

wayside cross
type: PreferredTerm
modified: 2015-02-24T12:01:53+01:00
created: 2011-09-01T00:00:00+02:00
status: 1

croix de chemin
type: PreferredTerm
modified: 2015-02-24T12:01:53+01:00
created: 2011-09-01T00:00:00+02:00
status: 1

wayside crosses
type: PreferredTerm
modified: 2015-02-24T12:01:53+01:00
created: 2011-09-01T00:00:00+02:00
status: 1

aire de jeux
type: PreferredTerm
modified: 2014-10-17T15:45:35+02:00
created: 2011-09-01T00:00:00+02:00
status: 1

bloc
type: SimpleNonPreferredTerm
modified: 2015-01-05T12:33:48+01:00
created: 2011-09-01T00:00:00+02:00
status: 1

blockhaus
type: PreferredTerm
modified: 2015-01-05T12:33:48+01:00
created: 2011-09-01T00:00:00+02:00
status: 1

loge du concierge
type: SimpleNonPreferredTerm
modified: 2014-12-31T15:50:51+01:00
created: 2011-09-01T00:00:00+02:00
status: 1

porterie
type: SimpleNonPreferredTerm
modified: 2014-12-31T15:50:51+01:00
created: 2011-09-01T00:00:00+02:00
status: 1

conciergerie
type: PreferredTerm
modified: 2014-12-31T15:50:51+01:00
created: 2011-09-01T00:00:00+02:00
status: 1

pédiluve
type: Concept
modified: 2015-02-25T16:36:21+01:00
in scheme: Thésaurus de la désignation des œuvres architecturales et des espaces aménagés
preferred label: footbaths @en-us
broader: partie ou élément commun à tous les types d'architecture et aux espaces aménagés
created: 2013-10-15T18:09:08+02:00
definition: ​Bassin peu profond destiné à laver les pieds, les chaussures ou encore les pattes et sabots des animaux.
status: 1

pédiluve
type: PreferredTerm
modified: 2015-02-25T16:36:21+01:00
created: 2013-10-15T18:09:08+02:00
status: 1

architecture de jardin et des espaces verts
type: PreferredTerm
modified: 2013-04-23T00:00:00+02:00
created: 2011-09-01T00:00:00+02:00
status: 1

ensemble de construction navale
type: PreferredTerm
modified: 2015-05-04T15:13:49+02:00
created: 2011-09-01T00:00:00+02:00
status: 1

parquet
type: PreferredTerm
modified: 2015-02-25T10:24:25+01:00
created: 2011-09-01T00:00:00+02:00
status: 1

immeuble
type: PreferredTerm
modified: 2014-12-31T12:26:01+01:00
created: 2011-09-01T00:00:00+02:00
status: 1

immeuble à appartements
type: SimpleNonPreferredTerm
modified: 2014-12-31T12:26:01+01:00
created: 2011-09-01T00:00:00+02:00
status: 1

cheminée
type: PreferredTerm
modified: 2015-02-25T10:07:16+01:00
created: 2011-09-01T00:00:00+02:00
status: 1

école artistique
type: SimpleNonPreferredTerm
modified: 2014-12-01T16:05:00+01:00
created: 2011-09-01T00:00:00+02:00
status: 1

école d'art
type: PreferredTerm
modified: 2014-12-01T16:05:00+01:00
created: 2011-09-01T00:00:00+02:00
status: 1

salle des ventes
type: PreferredTerm
modified: 2014-10-06T15:39:58+02:00
created: 2011-09-01T00:00:00+02:00
status: 1

usine de transformation des métaux
type: PreferredTerm
modified: 2015-04-30T15:01:19+02:00
created: 2011-09-01T00:00:00+02:00
status: 1

usine d'allumettes
type: PreferredTerm
modified: 2015-02-11T16:25:55+01:00
created: 2011-09-01T00:00:00+02:00
status: 1

tank à ramer
type: PreferredTerm
modified: 2014-12-19T11:27:00+01:00
created: 2011-09-01T00:00:00+02:00
status: 1

cross monuments
type: PreferredTerm
modified: 2015-02-24T11:49:27+01:00
created: 2011-09-01T00:00:00+02:00
status: 1

croix votive
type: SimpleNonPreferredTerm
modified: 2015-02-24T11:49:27+01:00
created: 2011-09-01T00:00:00+02:00
status: 1

croix de mission
type: SimpleNonPreferredTerm
modified: 2015-02-24T11:49:27+01:00
created: 2011-09-01T00:00:00+02:00
status: 1

croce monumentale
type: PreferredTerm
modified: 2015-02-24T11:49:27+01:00
created: 2011-09-01T00:00:00+02:00
status: 1

croix monumentale
type: PreferredTerm
modified: 2015-02-24T11:49:27+01:00
created: 2011-09-01T00:00:00+02:00
status: 1

cross
type: PreferredTerm
modified: 2015-02-24T11:49:27+01:00
created: 2011-09-01T00:00:00+02:00
status: 1

chapelle des fonts
type: PreferredTerm
modified: 2014-09-22T16:25:19+02:00
created: 2011-09-01T00:00:00+02:00
status: 1

casemate
type: PreferredTerm
modified: 2015-01-05T12:31:28+01:00
created: 2011-09-01T00:00:00+02:00
status: 1

académie
type: PreferredTerm
modified: 2014-12-12T14:26:02+01:00
created: 2011-09-01T00:00:00+02:00
status: 1

remise
type: PreferredTerm
modified: 2014-12-31T15:55:08+01:00
created: 2011-09-01T00:00:00+02:00
status: 1

colonnade
type: PreferredTerm
modified: 2015-02-25T11:37:19+01:00
created: 2011-09-01T00:00:00+02:00
status: 1

temple bouddhiste
type: PreferredTerm
modified: 2014-10-15T13:55:08+02:00
created: 2011-09-01T00:00:00+02:00
status: 1

Buddhist temple
type: PreferredTerm
modified: 2014-10-15T13:55:08+02:00
created: 2011-09-01T00:00:00+02:00
status: 1

fenderie
type: PreferredTerm
modified: 2013-04-23T00:00:00+02:00
created: 2011-09-01T00:00:00+02:00
status: 1

revêtement de sol
type: PreferredTerm
modified: 2015-02-25T10:23:33+01:00
created: 2011-09-01T00:00:00+02:00
status: 1

arc de couvrement
type: PreferredTerm
modified: 2015-02-25T12:23:26+01:00
created: 2011-09-01T00:00:00+02:00
status: 1

chevet
type: PreferredTerm
modified: 2014-10-15T17:14:23+02:00
created: 2011-09-01T00:00:00+02:00
status: 1

chevet
type: PreferredTerm
modified: 2014-10-15T17:14:23+02:00
created: 2011-09-01T00:00:00+02:00
status: 1

chevets
type: PreferredTerm
modified: 2014-10-15T17:14:23+02:00
created: 2011-09-01T00:00:00+02:00
status: 1

arsenal
type: PreferredTerm
modified: 2015-01-05T11:31:14+01:00
created: 2011-09-01T00:00:00+02:00
status: 1

espace vert
type: PreferredTerm
modified: 2014-12-31T10:34:29+01:00
created: 2011-09-01T00:00:00+02:00
status: 1

usine d'ouate
type: PreferredTerm
modified: 2015-03-23T12:01:36+01:00
created: 2011-09-01T00:00:00+02:00
status: 1

demeure
type: PreferredTerm
modified: 2014-12-31T13:03:17+01:00
created: 2011-09-01T00:00:00+02:00
status: 1

habitation
type: SimpleNonPreferredTerm
modified: 2014-12-31T13:03:17+01:00
created: 2011-09-01T00:00:00+02:00
status: 1

vestibule
type: PreferredTerm
modified: 2015-02-26T11:33:38+01:00
created: 2011-09-01T00:00:00+02:00
status: 1

hall
type: SimpleNonPreferredTerm
modified: 2015-02-26T11:33:38+01:00
created: 2011-09-01T00:00:00+02:00
status: 1

éperon barré
type: PreferredTerm
modified: 2015-01-05T13:31:09+01:00
created: 2011-09-01T00:00:00+02:00
status: 1

roseraie
type: PreferredTerm
modified: 2014-12-31T11:19:50+01:00
created: 2011-09-01T00:00:00+02:00
status: 1

usine de matériel électroménager
type: PreferredTerm
modified: 2015-04-28T15:04:28+02:00
created: 2011-09-01T00:00:00+02:00
status: 1

puits
type: PreferredTerm
modified: 2015-02-24T15:47:37+01:00
created: 2011-09-01T00:00:00+02:00
status: 1

poterne
type: PreferredTerm
modified: 2015-01-05T13:24:21+01:00
created: 2011-09-01T00:00:00+02:00
status: 1

base aérienne
type: PreferredTerm
modified: 2015-01-05T11:59:50+01:00
created: 2011-09-01T00:00:00+02:00
status: 1

lambris de couvrement
type: PreferredTerm
modified: 2015-02-24T17:14:53+01:00
created: 2011-09-01T00:00:00+02:00
status: 1

usine de préparation d'un produit agroalimentaire
type: PreferredTerm
modified: 2013-04-23T00:00:00+02:00
created: 2011-09-01T00:00:00+02:00
status: 1

usine de fibres artificielles et synthétiques
type: PreferredTerm
modified: 2015-02-10T12:25:38+01:00
created: 2011-09-01T00:00:00+02:00
status: 1

ensemble de fabrication de matériaux de construction
type: PreferredTerm
modified: 2015-04-14T15:45:26+02:00
created: 2011-09-01T00:00:00+02:00
status: 1

hydrobase
type: PreferredTerm
modified: 2014-10-16T14:26:45+02:00
created: 2011-09-01T00:00:00+02:00
status: 1

édicule du génie civil
type: SimpleNonPreferredTerm
modified: 2013-04-23T00:00:00+02:00
created: 2011-09-01T00:00:00+02:00
status: 1

ouvrage du génie civil
type: SimpleNonPreferredTerm
modified: 2013-04-23T00:00:00+02:00
created: 2011-09-01T00:00:00+02:00
status: 1

ouvrage d'art
type: PreferredTerm
modified: 2013-04-23T00:00:00+02:00
created: 2011-09-01T00:00:00+02:00
status: 1

brasserie (restaurant)
type: PreferredTerm
modified: 2014-12-05T10:58:27+01:00
created: 2011-09-01T00:00:00+02:00
status: 1

malterie
type: PreferredTerm
modified: 2015-02-04T16:13:01+01:00
created: 2011-09-01T00:00:00+02:00
status: 1

péristyle
type: PreferredTerm
modified: 2015-02-25T11:42:16+01:00
created: 2011-09-01T00:00:00+02:00
status: 1

caserne
type: PreferredTerm
modified: 2015-01-05T11:37:08+01:00
created: 2011-09-01T00:00:00+02:00
status: 1

fonderie
type: PreferredTerm
modified: 2015-03-16T15:28:20+01:00
created: 2011-09-01T00:00:00+02:00
status: 1

jardin d'agrément
type: PreferredTerm
modified: 2014-12-31T10:33:15+01:00
created: 2011-09-01T00:00:00+02:00
status: 1

chapelle seigneuriale
type: PreferredTerm
modified: 2014-09-22T16:24:20+02:00
created: 2011-09-01T00:00:00+02:00
status: 1

maison de plaisance
type: SimpleNonPreferredTerm
modified: 2014-12-31T12:18:54+01:00
created: 2011-09-01T00:00:00+02:00
status: 1

château
type: PreferredTerm
modified: 2014-12-31T12:18:54+01:00
created: 2011-09-01T00:00:00+02:00
status: 1

position fortifiée
type: PreferredTerm
modified: 2015-01-05T13:22:27+01:00
created: 2011-09-01T00:00:00+02:00
status: 1

usine de teinturerie
type: PreferredTerm
modified: 2015-03-23T12:46:11+01:00
created: 2011-09-01T00:00:00+02:00
status: 1

enceinte
type: PreferredTerm
modified: 2015-01-05T12:44:17+01:00
created: 2011-09-01T00:00:00+02:00
status: 1

rempart
type: SimpleNonPreferredTerm
modified: 2015-01-05T12:44:17+01:00
created: 2011-09-01T00:00:00+02:00
status: 1

regard
type: PreferredTerm
modified: 2014-10-16T15:16:05+02:00
created: 2011-09-01T00:00:00+02:00
status: 1

petit parc
type: PreferredTerm
modified: 2014-12-31T11:06:21+01:00
created: 2011-09-01T00:00:00+02:00
status: 1

usine de matériel radioélectrique
type: PreferredTerm
modified: 2015-01-28T12:27:12+01:00
created: 2011-09-01T00:00:00+02:00
status: 1

base navale
type: PreferredTerm
modified: 2015-01-05T12:01:17+01:00
created: 2011-09-01T00:00:00+02:00
status: 1

linteau
type: PreferredTerm
modified: 2015-02-24T17:16:06+01:00
created: 2011-09-01T00:00:00+02:00
status: 1

usine de fabrication et distillation des goudrons
type: PreferredTerm
modified: 2015-04-29T15:54:03+02:00
created: 2011-09-01T00:00:00+02:00
status: 1

restaurant
type: PreferredTerm
modified: 2014-12-05T10:57:26+01:00
created: 2011-09-01T00:00:00+02:00
status: 1

station d'incinération des déchets
type: PreferredTerm
modified: 2014-10-16T14:15:24+02:00
created: 2011-09-01T00:00:00+02:00
status: 1

usine d'incinération des déchets
type: SimpleNonPreferredTerm
modified: 2014-10-16T14:15:24+02:00
created: 2011-09-01T00:00:00+02:00
status: 1

ensemble d'industrie verrière
type: PreferredTerm
modified: 2015-05-04T14:56:28+02:00
created: 2011-09-01T00:00:00+02:00
status: 1

citadelle
type: PreferredTerm
modified: 2015-01-05T11:26:36+01:00
created: 2011-09-01T00:00:00+02:00
status: 1

grosse forge
type: PreferredTerm
modified: 2015-03-16T15:52:56+01:00
created: 2011-09-01T00:00:00+02:00
status: 1

religious structures
type: PreferredTerm
modified: 2013-04-23T00:00:00+02:00
created: 2011-09-01T00:00:00+02:00
status: 1

religious (other structures)
type: PreferredTerm
modified: 2013-04-23T00:00:00+02:00
created: 2011-09-01T00:00:00+02:00
status: 1

édicule religieux
type: PreferredTerm
modified: 2013-04-23T00:00:00+02:00
created: 2011-09-01T00:00:00+02:00
status: 1

double caponnière
type: PreferredTerm
modified: 2015-01-05T12:41:35+01:00
created: 2011-09-01T00:00:00+02:00
status: 1

câblerie
type: PreferredTerm
modified: 2015-01-28T12:02:36+01:00
created: 2011-09-01T00:00:00+02:00
status: 1

usine de peausserie
type: PreferredTerm
modified: 2014-12-08T11:10:57+01:00
created: 2011-09-01T00:00:00+02:00
status: 1

souterrain
type: PreferredTerm
modified: 2014-12-31T12:06:45+01:00
created: 2011-09-01T00:00:00+02:00
status: 1

pont-bascule
type: PreferredTerm
modified: 2015-02-26T11:38:48+01:00
created: 2011-09-01T00:00:00+02:00
status: 1

poids public
type: SimpleNonPreferredTerm
modified: 2015-02-26T11:39:58+01:00
created: 2011-09-01T00:00:00+02:00
status: 1

pont-levis
type: PreferredTerm
modified: 2015-01-05T13:21:03+01:00
created: 2011-09-01T00:00:00+02:00
status: 1

réservoir
type: PreferredTerm
modified: 2014-12-02T12:41:41+01:00
created: 2011-09-01T00:00:00+02:00
status: 1

marégraphe
type: PreferredTerm
modified: 2014-10-10T10:48:03+02:00
created: 2011-09-01T00:00:00+02:00
status: 1

usine d'engrais
type: PreferredTerm
modified: 2015-02-09T12:11:36+01:00
created: 2011-09-01T00:00:00+02:00
status: 1

ensemble militaire
type: PreferredTerm
modified: 2013-04-23T00:00:00+02:00
created: 2011-09-01T00:00:00+02:00
status: 1

plafond
type: PreferredTerm
modified: 2015-02-25T12:24:39+01:00
created: 2011-09-01T00:00:00+02:00
status: 1

ensemble d'industrie céramique
type: PreferredTerm
modified: 2015-05-04T14:40:06+02:00
created: 2011-09-01T00:00:00+02:00
status: 1

ascenseur public
type: SimpleNonPreferredTerm
modified: 2014-10-23T12:39:06+02:00
created: 2011-09-01T00:00:00+02:00
status: 1

ascenseur indépendant
type: PreferredTerm
modified: 2014-10-23T12:39:06+02:00
created: 2011-09-01T00:00:00+02:00
status: 1

charpente
type: PreferredTerm
modified: 2015-02-24T16:56:08+01:00
created: 2011-09-01T00:00:00+02:00
status: 1

édifice logistique
type: PreferredTerm
modified: 2015-01-05T11:52:04+01:00
created: 2011-09-01T00:00:00+02:00
status: 1

choir
type: PreferredTerm
modified: 2015-03-09T11:09:01+01:00
created: 2011-09-01T00:00:00+02:00
status: 1

coro
type: PreferredTerm
modified: 2015-03-09T11:09:01+01:00
created: 2011-09-01T00:00:00+02:00
status: 1

choirs
type: PreferredTerm
modified: 2015-03-09T11:09:01+01:00
created: 2011-09-01T00:00:00+02:00
status: 1

chœur
type: SimpleNonPreferredTerm
modified: 2015-03-09T11:09:01+01:00
created: 2011-09-01T00:00:00+02:00
status: 1

usine d'emboutissage
type: PreferredTerm
modified: 2015-04-30T15:20:37+02:00
created: 2011-09-01T00:00:00+02:00
status: 1

jardin d'attractions
type: PreferredTerm
modified: 2014-09-18T16:04:26+02:00
created: 2011-09-01T00:00:00+02:00
status: 1

Hindu temple
type: PreferredTerm
modified: 2014-11-28T12:59:53+01:00
created: 2011-09-01T00:00:00+02:00
status: 1

temple hindouiste
type: PreferredTerm
modified: 2014-11-28T12:59:53+01:00
created: 2011-09-01T00:00:00+02:00
status: 1

citerne
type: PreferredTerm
modified: 2014-12-02T12:48:56+01:00
created: 2011-09-01T00:00:00+02:00
status: 1

corroierie
type: PreferredTerm
modified: 2015-04-28T16:31:34+02:00
created: 2011-09-01T00:00:00+02:00
status: 1

souterrain refuge
type: PreferredTerm
modified: 2014-12-31T12:04:49+01:00
created: 2011-09-01T00:00:00+02:00
status: 1

piège à animaux
type: PreferredTerm
modified: 2014-10-16T11:37:42+02:00
created: 2011-09-01T00:00:00+02:00
status: 1

donjon
type: PreferredTerm
modified: 2015-01-05T12:40:16+01:00
created: 2011-09-01T00:00:00+02:00
status: 1

usine de matériel électrique industriel
type: PreferredTerm
modified: 2015-04-28T15:00:07+02:00
created: 2011-09-01T00:00:00+02:00
status: 1

château d'eau
type: PreferredTerm
modified: 2014-12-02T12:49:39+01:00
created: 2011-09-01T00:00:00+02:00
status: 1

construction de jardin
type: PreferredTerm
modified: 2014-12-30T16:13:34+01:00
created: 2011-09-01T00:00:00+02:00
status: 1

appontement
type: PreferredTerm
modified: 2014-10-16T14:33:02+02:00
created: 2011-09-01T00:00:00+02:00
status: 1

wharf
type: SimpleNonPreferredTerm
modified: 2014-10-16T14:33:02+02:00
created: 2011-09-01T00:00:00+02:00
status: 1

ensemble de construction électronique
type: PreferredTerm
modified: 2015-05-04T15:00:33+02:00
created: 2011-09-01T00:00:00+02:00
status: 1

usine de colles
type: PreferredTerm
modified: 2015-02-09T16:31:06+01:00
created: 2011-09-01T00:00:00+02:00
status: 1

base militaire
type: PreferredTerm
modified: 2014-10-14T15:54:10+02:00
created: 2011-09-01T00:00:00+02:00
status: 1

plate-bande
type: PreferredTerm
modified: 2015-02-25T12:31:33+01:00
created: 2011-09-01T00:00:00+02:00
status: 1

fort
type: PreferredTerm
modified: 2015-01-05T11:17:17+01:00
created: 2011-09-01T00:00:00+02:00
status: 1

édifice d'enseignement supérieur
type: PreferredTerm
modified: 2014-12-01T17:14:04+01:00
created: 2011-09-01T00:00:00+02:00
status: 1

station météorologique
type: PreferredTerm
modified: 2014-12-19T10:26:08+01:00
created: 2011-09-01T00:00:00+02:00
status: 1

cimenterie
type: PreferredTerm
modified: 2015-02-03T11:28:48+01:00
created: 2011-09-01T00:00:00+02:00
status: 1

montjoie
type: PreferredTerm
modified: 2015-02-24T11:25:02+01:00
created: 2011-09-01T00:00:00+02:00
status: 1

charretterie
type: PreferredTerm
modified: 2014-12-30T14:51:28+01:00
created: 2011-09-01T00:00:00+02:00
status: 1

mikyé
type: SimpleNonPreferredTerm
modified: 2014-10-15T13:36:20+02:00
created: 2011-09-01T00:00:00+02:00
status: 1

Jewish ritual bath
type: PreferredTerm
modified: 2014-10-15T13:36:20+02:00
created: 2011-09-01T00:00:00+02:00
status: 1

bains rituels
type: PreferredTerm
modified: 2014-10-15T13:36:20+02:00
created: 2011-09-01T00:00:00+02:00
status: 1

cantaro
type: PreferredTerm
modified: 2014-10-15T13:36:20+02:00
created: 2011-09-01T00:00:00+02:00
status: 1

pièce de gazon
type: PreferredTerm
modified: 2014-11-13T12:58:44+01:00
created: 2011-09-01T00:00:00+02:00
status: 1

complexe sportif
type: PreferredTerm
modified: 2014-12-19T11:21:20+01:00
created: 2011-09-01T00:00:00+02:00
status: 1

plan d'eau aménagé
type: PreferredTerm
modified: 2014-12-19T10:54:59+01:00
created: 2011-09-01T00:00:00+02:00
status: 1

chemin de halage
type: PreferredTerm
modified: 2015-01-07T12:45:49+01:00
created: 2011-09-01T00:00:00+02:00
status: 1

tow path
type: PreferredTerm
modified: 2015-01-07T12:45:49+01:00
created: 2011-09-01T00:00:00+02:00
status: 1

poste de secours
type: PreferredTerm
modified: 2014-11-28T17:06:52+01:00
created: 2011-09-01T00:00:00+02:00
status: 1

usine de peintures et vernis
type: PreferredTerm
modified: 2015-04-29T16:06:41+02:00
created: 2011-09-01T00:00:00+02:00
status: 1

grenier à sel
type: PreferredTerm
modified: 2015-01-02T11:07:41+01:00
created: 2011-09-01T00:00:00+02:00
status: 1

canal de navigation
type: PreferredTerm
modified: 2014-12-01T13:07:15+01:00
created: 2011-09-01T00:00:00+02:00
status: 1

canal de dérivation
type: SimpleNonPreferredTerm
modified: 2014-12-01T13:07:15+01:00
created: 2011-09-01T00:00:00+02:00
status: 1

canal à point de partage
type: SimpleNonPreferredTerm
modified: 2014-12-01T13:07:15+01:00
created: 2011-09-01T00:00:00+02:00
status: 1

canal latéral
type: SimpleNonPreferredTerm
modified: 2014-12-01T13:07:15+01:00
created: 2011-09-01T00:00:00+02:00
status: 1

parlement
type: PreferredTerm
modified: 2015-01-05T10:41:02+01:00
created: 2011-09-01T00:00:00+02:00
status: 1

cour de parlement
type: SimpleNonPreferredTerm
modified: 2015-01-05T10:41:02+01:00
created: 2011-09-01T00:00:00+02:00
status: 1

partie d'édifice hospitalier d'assistance ou de protection sociale
type: PreferredTerm
modified: 2013-04-23T00:00:00+02:00
created: 2011-09-01T00:00:00+02:00
status: 1

usine d'estampage
type: PreferredTerm
modified: 2015-03-17T14:22:49+01:00
created: 2011-09-01T00:00:00+02:00
status: 1

usine de fabrication de matériaux de construction
type: PreferredTerm
modified: 2015-04-28T15:30:01+02:00
created: 2011-09-01T00:00:00+02:00
status: 1

galerie maçonnée
type: PreferredTerm
modified: 2015-03-30T16:58:40+02:00
created: 2011-09-01T00:00:00+02:00
status: 1

remise agricole
type: PreferredTerm
modified: 2014-12-30T14:49:41+01:00
created: 2011-09-01T00:00:00+02:00
status: 1

station de sismologie
type: PreferredTerm
modified: 2014-10-17T16:02:03+02:00
created: 2011-09-01T00:00:00+02:00
status: 1

édifice religieux
type: PreferredTerm
modified: 2013-04-23T00:00:00+02:00
created: 2011-09-01T00:00:00+02:00
status: 1

religious buildings
type: PreferredTerm
modified: 2013-04-23T00:00:00+02:00
created: 2011-09-01T00:00:00+02:00
status: 1

sanctuaire
type: SimpleNonPreferredTerm
modified: 2013-04-23T00:00:00+02:00
created: 2011-09-01T00:00:00+02:00
status: 1

salle de billard
type: PreferredTerm
modified: 2014-12-19T10:54:51+01:00
created: 2011-09-01T00:00:00+02:00
status: 1

cloître canonial
type: SimpleNonPreferredTerm
modified: 2014-10-23T10:40:34+02:00
created: 2011-09-01T00:00:00+02:00
status: 1

quartier canonial
type: PreferredTerm
modified: 2014-10-23T10:40:34+02:00
created: 2011-09-01T00:00:00+02:00
status: 1

cloître (ensemble)
type: SimpleNonPreferredTerm
modified: 2014-10-23T10:40:34+02:00
created: 2011-09-01T00:00:00+02:00
status: 1

ensemble canonial
type: SimpleNonPreferredTerm
modified: 2014-10-23T10:40:34+02:00
created: 2011-09-01T00:00:00+02:00
status: 1

canonica
type: PreferredTerm
modified: 2014-10-23T10:40:34+02:00
created: 2011-09-01T00:00:00+02:00
status: 1

laminoir
type: PreferredTerm
modified: 2015-03-17T14:48:57+01:00
created: 2011-09-01T00:00:00+02:00
status: 1

pelouse
type: PreferredTerm
modified: 2014-12-30T16:45:50+01:00
created: 2011-09-01T00:00:00+02:00
status: 1

camping
type: PreferredTerm
modified: 2014-12-19T11:19:47+01:00
created: 2011-09-01T00:00:00+02:00
status: 1

trackway
type: PreferredTerm
modified: 2015-01-07T12:43:28+01:00
created: 2011-09-01T00:00:00+02:00
status: 1

chemin
type: PreferredTerm
modified: 2015-01-07T12:43:28+01:00
created: 2011-09-01T00:00:00+02:00
status: 1

chemin carrossable
type: SimpleNonPreferredTerm
modified: 2015-01-07T12:43:28+01:00
created: 2011-09-01T00:00:00+02:00
status: 1

gymnase
type: PreferredTerm
modified: 2014-12-12T15:05:49+01:00
created: 2011-09-01T00:00:00+02:00
status: 1

salle de sport
type: SimpleNonPreferredTerm
modified: 2014-12-12T15:05:49+01:00
created: 2011-09-01T00:00:00+02:00
status: 1

grange aux dîmes
type: PreferredTerm
modified: 2015-01-02T11:06:00+01:00
created: 2011-09-01T00:00:00+02:00
status: 1

usine d'encres
type: PreferredTerm
modified: 2015-02-10T12:51:53+01:00
created: 2011-09-01T00:00:00+02:00
status: 1

forteresse
type: PreferredTerm
modified: 2015-01-05T11:21:38+01:00
created: 2011-09-01T00:00:00+02:00
status: 1

canal d'irrigation
type: PreferredTerm
modified: 2014-12-01T12:57:28+01:00
created: 2011-09-01T00:00:00+02:00
status: 1

génie civil
type: PreferredTerm
modified: 2013-04-23T00:00:00+02:00
created: 2011-09-01T00:00:00+02:00
status: 1

amphithéâtre d'anatomie
type: PreferredTerm
modified: 2015-01-02T12:29:46+01:00
created: 2011-09-01T00:00:00+02:00
status: 1

palais de justice
type: PreferredTerm
modified: 2015-01-05T10:36:38+01:00
created: 2011-09-01T00:00:00+02:00
status: 1

toit en shed
type: PreferredTerm
modified: 2015-02-25T12:06:55+01:00
created: 2011-09-01T00:00:00+02:00
status: 1

architecture hospitalière d'assistance ou de protection sociale
type: PreferredTerm
modified: 2013-04-23T00:00:00+02:00
created: 2011-09-01T00:00:00+02:00
status: 1

station de traitement des déchets
type: PreferredTerm
modified: 2014-10-23T12:03:25+02:00
created: 2011-09-01T00:00:00+02:00
status: 1

galerie d'art
type: PreferredTerm
modified: 2014-10-10T10:57:01+02:00
created: 2011-09-01T00:00:00+02:00
status: 1

salle d'asile
type: PreferredTerm
modified: 2014-12-01T16:50:14+01:00
created: 2011-09-01T00:00:00+02:00
status: 1

chenal de navigation
type: SimpleNonPreferredTerm
modified: 2014-12-01T14:16:50+01:00
created: 2011-09-01T00:00:00+02:00
status: 1

chenal
type: PreferredTerm
modified: 2014-12-01T14:16:50+01:00
created: 2011-09-01T00:00:00+02:00
status: 1

army camp
type: PreferredTerm
modified: 2015-01-05T11:03:35+01:00
created: 2011-09-01T00:00:00+02:00
status: 1

camp
type: PreferredTerm
modified: 2015-01-05T11:03:35+01:00
created: 2011-09-01T00:00:00+02:00
status: 1

baraquement
type: Concept
modified: 2014-12-31T12:00:41+01:00
in scheme: Thésaurus de la désignation des œuvres architecturales et des espaces aménagés
preferred label: shacks @en-us
broader: abri
created: 2013-10-15T18:00:12+02:00
related: camp
related: camp de concentration
related: campement
definition: Logement collectif provisoire destiné à abriter des soldats, des ouvriers, des migrants, des réfugiés, des sinistrés, des prisonniers, etc.
TermeAssocie: camp
TermeAssocie: camp de concentration
TermeAssocie: campement
status: 1
broad match: Abri

usine de verres optiques
type: PreferredTerm
modified: 2015-03-24T12:18:04+01:00
created: 2011-09-01T00:00:00+02:00
status: 1

battistero
type: PreferredTerm
modified: 2014-11-27T15:40:53+01:00
created: 2011-09-01T00:00:00+02:00
status: 1

baptisteries
type: PreferredTerm
modified: 2014-11-27T15:40:53+01:00
created: 2011-09-01T00:00:00+02:00
status: 1

baptistère
type: PreferredTerm
modified: 2014-11-27T15:40:53+01:00
created: 2011-09-01T00:00:00+02:00
status: 1

baptistery
type: PreferredTerm
modified: 2014-11-27T15:40:53+01:00
created: 2011-09-01T00:00:00+02:00
status: 1

pressoir à vin
type: PreferredTerm
modified: 2014-12-30T14:47:21+01:00
created: 2011-09-01T00:00:00+02:00
status: 1

parcours de golf
type: PreferredTerm
modified: 2014-12-12T15:27:56+01:00
created: 2011-09-01T00:00:00+02:00
status: 1

base de loisirs
type: PreferredTerm
modified: 2014-10-17T16:21:55+02:00
created: 2011-09-01T00:00:00+02:00
status: 1

palais des congrès
type: PreferredTerm
modified: 2014-12-19T10:47:20+01:00
created: 2011-09-01T00:00:00+02:00
status: 1

bâtiment du martinet
type: PreferredTerm
modified: 2015-04-30T15:08:52+02:00
created: 2011-09-01T00:00:00+02:00
status: 1

alley
type: PreferredTerm
modified: 2015-01-07T13:16:59+01:00
created: 2011-09-01T00:00:00+02:00
status: 1

passage
type: PreferredTerm
modified: 2015-01-07T13:16:59+01:00
created: 2011-09-01T00:00:00+02:00
status: 1

planche de jardin
type: PreferredTerm
modified: 2014-11-18T13:58:58+01:00
created: 2011-09-01T00:00:00+02:00
status: 1

verrière en couverture
type: PreferredTerm
modified: 2015-02-25T12:09:40+01:00
created: 2011-09-01T00:00:00+02:00
status: 1

gibet
type: PreferredTerm
modified: 2014-10-14T14:08:59+02:00
created: 2011-09-01T00:00:00+02:00
status: 1

arbre de justice
type: SimpleNonPreferredTerm
modified: 2014-10-14T14:08:59+02:00
created: 2011-09-01T00:00:00+02:00
status: 1

usine de matières colorantes synthétiques
type: PreferredTerm
modified: 2015-02-10T12:45:13+01:00
created: 2011-09-01T00:00:00+02:00
status: 1

abribus
type: SimpleNonPreferredTerm
modified: 2014-10-16T14:13:12+02:00
created: 2011-09-01T00:00:00+02:00
status: 1

station d'autocar
type: SimpleNonPreferredTerm
modified: 2014-10-16T14:13:12+02:00
created: 2011-09-01T00:00:00+02:00
status: 1

station d'autobus
type: PreferredTerm
modified: 2014-10-16T14:13:12+02:00
created: 2011-09-01T00:00:00+02:00
status: 1

usine de gaz comprimés
type: PreferredTerm
modified: 2015-04-29T15:55:48+02:00
created: 2011-09-01T00:00:00+02:00
status: 1

lieu d'exposition
type: PreferredTerm
modified: 2014-09-05T17:21:23+02:00
created: 2011-09-01T00:00:00+02:00
status: 1

maison aux dîmes
type: PreferredTerm
modified: 2015-01-02T11:10:14+01:00
created: 2011-09-01T00:00:00+02:00
status: 1

maternité
type: PreferredTerm
modified: 2015-01-02T12:16:46+01:00
created: 2011-09-01T00:00:00+02:00
status: 1

slipway
type: SimpleNonPreferredTerm
modified: 2014-12-01T14:15:49+01:00
created: 2011-09-01T00:00:00+02:00
status: 1

cale
type: PreferredTerm
modified: 2014-12-01T14:15:49+01:00
created: 2011-09-01T00:00:00+02:00
status: 1

château fort
type: PreferredTerm
modified: 2015-01-05T11:06:45+01:00
created: 2011-09-01T00:00:00+02:00
status: 1

glacerie
type: PreferredTerm
modified: 2015-04-30T16:06:07+02:00
created: 2011-09-01T00:00:00+02:00
status: 1

séminaire
type: PreferredTerm
modified: 2014-12-01T17:06:42+01:00
created: 2011-09-01T00:00:00+02:00
status: 1

christian + religious buildings
type: PreferredTerm
modified: 2013-04-23T00:00:00+02:00
created: 2011-09-01T00:00:00+02:00
status: 1

édifice religieux chrétien
type: PreferredTerm
modified: 2013-04-23T00:00:00+02:00
created: 2011-09-01T00:00:00+02:00
status: 1

lampisterie
type: PreferredTerm
modified: 2015-02-25T16:13:45+01:00
created: 2011-09-01T00:00:00+02:00
status: 1

établissement nautique
type: PreferredTerm
modified: 2014-12-12T14:56:51+01:00
created: 2011-09-01T00:00:00+02:00
status: 1

platinerie
type: PreferredTerm
modified: 2013-04-23T00:00:00+02:00
created: 2011-09-01T00:00:00+02:00
status: 1

vertugadin
type: PreferredTerm
modified: 2014-09-30T15:06:15+02:00
created: 2011-09-01T00:00:00+02:00
status: 1

impasse
type: PreferredTerm
modified: 2015-01-07T13:09:04+01:00
created: 2011-09-01T00:00:00+02:00
status: 1

plage artificielle
type: SimpleNonPreferredTerm
modified: 2014-12-19T10:48:35+01:00
created: 2011-09-01T00:00:00+02:00
status: 1

plage aménagée
type: PreferredTerm
modified: 2014-12-19T10:48:35+01:00
created: 2011-09-01T00:00:00+02:00
status: 1

édicule judiciaire pénitentiaire ou de police
type: PreferredTerm
modified: 2013-04-23T00:00:00+02:00
created: 2011-09-01T00:00:00+02:00
status: 1

couvrement
type: PreferredTerm
modified: 2015-02-24T17:11:20+01:00
created: 2011-09-01T00:00:00+02:00
status: 1

rotonde ferroviaire
type: SimpleNonPreferredTerm
modified: 2014-11-28T17:08:16+01:00
created: 2011-09-01T00:00:00+02:00
status: 1

remise ferroviaire
type: PreferredTerm
modified: 2014-11-28T17:08:16+01:00
created: 2011-09-01T00:00:00+02:00
status: 1

rotonde à locomotive
type: SimpleNonPreferredTerm
modified: 2014-11-28T17:08:16+01:00
created: 2011-09-01T00:00:00+02:00
status: 1

sala del sinodo
type: PreferredTerm
modified: 2014-10-23T10:55:44+02:00
created: 2011-09-01T00:00:00+02:00
status: 1

synodal hall
type: PreferredTerm
modified: 2014-10-23T10:55:44+02:00
created: 2011-09-01T00:00:00+02:00
status: 1

salle synodale
type: PreferredTerm
modified: 2014-10-23T10:55:44+02:00
created: 2011-09-01T00:00:00+02:00
status: 1

jeu d'arc
type: PreferredTerm
modified: 2014-10-17T15:52:20+02:00
created: 2011-09-01T00:00:00+02:00
status: 1

viale di circonvallazione
type: PreferredTerm
modified: 2015-01-07T12:31:39+01:00
created: 2011-09-01T00:00:00+02:00
status: 1

boulevards
type: PreferredTerm
modified: 2015-01-07T12:31:39+01:00
created: 2011-09-01T00:00:00+02:00
status: 1

boulevard
type: PreferredTerm
modified: 2015-01-07T12:31:39+01:00
created: 2011-09-01T00:00:00+02:00
status: 1

édifice et aménagement de culture recherche sport ou loisir
type: PreferredTerm
modified: 2013-04-23T00:00:00+02:00
created: 2011-09-01T00:00:00+02:00
status: 1

salle d'exposition
type: PreferredTerm
modified: 2014-10-17T16:04:18+02:00
created: 2011-09-01T00:00:00+02:00
status: 1

poste de police
type: SimpleNonPreferredTerm
modified: 2015-01-05T10:29:44+01:00
created: 2011-09-01T00:00:00+02:00
status: 1

commissariat de police
type: PreferredTerm
modified: 2015-01-05T10:29:44+01:00
created: 2011-09-01T00:00:00+02:00
status: 1

usine de verre plat
type: PreferredTerm
modified: 2015-04-23T10:58:44+02:00
created: 2011-09-01T00:00:00+02:00
status: 1

déversoir de crue
type: SimpleNonPreferredTerm
modified: 2014-12-01T14:24:18+01:00
created: 2011-09-01T00:00:00+02:00
status: 1

épanchoir
type: SimpleNonPreferredTerm
modified: 2014-12-01T14:24:18+01:00
created: 2011-09-01T00:00:00+02:00
status: 1

déversoir de superficie
type: PreferredTerm
modified: 2014-12-01T14:24:18+01:00
created: 2011-09-01T00:00:00+02:00
status: 1

reversoir
type: SimpleNonPreferredTerm
modified: 2014-12-01T14:24:18+01:00
created: 2011-09-01T00:00:00+02:00
status: 1

grotte de Lourdes
type: PreferredTerm
modified: 2015-02-24T12:06:56+01:00
created: 2011-09-01T00:00:00+02:00
status: 1

réseau d'air comprimé
type: PreferredTerm
modified: 2014-10-17T09:15:56+02:00
created: 2011-09-01T00:00:00+02:00
status: 1

édifice militaire
type: PreferredTerm
modified: 2015-01-05T11:57:11+01:00
created: 2011-09-01T00:00:00+02:00
status: 1

noviciat
type: PreferredTerm
modified: 2014-12-08T11:07:31+01:00
created: 2011-09-01T00:00:00+02:00
status: 1

quartier d'aliénés
type: PreferredTerm
modified: 2015-01-02T12:35:11+01:00
created: 2011-09-01T00:00:00+02:00
status: 1

club-house
type: PreferredTerm
modified: 2014-12-19T11:24:30+01:00
created: 2011-09-01T00:00:00+02:00
status: 1

levée
type: SimpleNonPreferredTerm
modified: 2014-12-01T14:27:37+01:00
created: 2011-09-01T00:00:00+02:00
status: 1

digue
type: PreferredTerm
modified: 2014-12-01T14:27:37+01:00
created: 2011-09-01T00:00:00+02:00
status: 1

ensemble de construction automobile
type: PreferredTerm
modified: 2015-05-04T15:09:48+02:00
created: 2011-09-01T00:00:00+02:00
status: 1

installation hydraulique
type: PreferredTerm
modified: 2015-02-25T16:11:33+01:00
created: 2011-09-01T00:00:00+02:00
status: 1

complexe aéroportuaire
type: SimpleNonPreferredTerm
modified: 2014-12-01T12:05:58+01:00
created: 2011-09-01T00:00:00+02:00
status: 1

aéroport
type: PreferredTerm
modified: 2014-12-01T12:05:58+01:00
created: 2011-09-01T00:00:00+02:00
status: 1

fournil
type: PreferredTerm
modified: 2014-12-04T16:05:42+01:00
created: 2011-09-01T00:00:00+02:00
status: 1

tréfilerie
type: PreferredTerm
modified: 2015-03-17T15:22:56+01:00
created: 2011-09-01T00:00:00+02:00
status: 1

jeu de l'arquebuse
type: PreferredTerm
modified: 2014-10-17T15:53:27+02:00
created: 2011-09-01T00:00:00+02:00
status: 1

avenue (road)
type: PreferredTerm
modified: 2015-01-07T12:29:45+01:00
created: 2011-09-01T00:00:00+02:00
status: 1

avenues
type: PreferredTerm
modified: 2015-01-07T12:29:45+01:00
created: 2011-09-01T00:00:00+02:00
status: 1

viale urbano
type: PreferredTerm
modified: 2015-01-07T12:29:45+01:00
created: 2011-09-01T00:00:00+02:00
status: 1

avenue
type: PreferredTerm
modified: 2015-01-07T12:29:45+01:00
created: 2011-09-01T00:00:00+02:00
status: 1

village de vacances
type: PreferredTerm
modified: 2014-12-12T14:45:49+01:00
created: 2011-09-01T00:00:00+02:00
status: 1

édifice fortifié
type: PreferredTerm
modified: 2015-01-05T11:29:17+01:00
created: 2011-09-01T00:00:00+02:00
status: 1

réseau de chauffage urbain
type: PreferredTerm
modified: 2014-10-17T09:18:26+02:00
created: 2011-09-01T00:00:00+02:00
status: 1

déversoir de fond
type: PreferredTerm
modified: 2014-09-23T16:51:29+02:00
created: 2011-09-01T00:00:00+02:00
status: 1

déchargeoir
type: SimpleNonPreferredTerm
modified: 2014-09-23T16:51:29+02:00
created: 2011-09-01T00:00:00+02:00
status: 1

édifice judiciaire pénitentiaire ou de police
type: PreferredTerm
modified: 2013-04-23T00:00:00+02:00
created: 2011-09-01T00:00:00+02:00
status: 1

pavillon d'exposition
type: PreferredTerm
modified: 2014-12-19T10:29:01+01:00
created: 2011-09-01T00:00:00+02:00
status: 1

palais d'exposition
type: SimpleNonPreferredTerm
modified: 2014-12-19T10:29:01+01:00
created: 2011-09-01T00:00:00+02:00
status: 1

pensionnat
type: PreferredTerm
modified: 2014-12-08T11:12:23+01:00
created: 2011-09-01T00:00:00+02:00
status: 1

usine de pâte à papier
type: PreferredTerm
modified: 2015-04-28T16:19:18+02:00
created: 2011-09-01T00:00:00+02:00
status: 1

churchyard cross
type: PreferredTerm
modified: 2015-02-24T12:04:04+01:00
created: 2011-09-01T00:00:00+02:00
status: 1

croce cimiteriale
type: PreferredTerm
modified: 2015-02-24T12:04:04+01:00
created: 2011-09-01T00:00:00+02:00
status: 1

croix de cimetière
type: PreferredTerm
modified: 2015-02-24T12:04:04+01:00
created: 2011-09-01T00:00:00+02:00
status: 1

cemetery + crosses
type: PreferredTerm
modified: 2015-02-24T12:04:04+01:00
created: 2011-09-01T00:00:00+02:00
status: 1

salle des mariages
type: PreferredTerm
modified: 2014-10-17T15:37:15+02:00
created: 2013-10-15T19:13:34+02:00
status: 1

salle d'opération
type: PreferredTerm
modified: 2014-10-14T15:37:13+02:00
created: 2011-09-01T00:00:00+02:00
status: 1

piste d'athlétisme
type: PreferredTerm
modified: 2014-10-10T12:21:21+02:00
created: 2011-09-01T00:00:00+02:00
status: 1

usine de verre destiné a la chimie
type: PreferredTerm
modified: 2015-04-30T16:01:50+02:00
created: 2011-09-01T00:00:00+02:00
status: 1

ensemble de construction aéronautique
type: PreferredTerm
modified: 2015-05-04T15:06:21+02:00
created: 2011-09-01T00:00:00+02:00
status: 1

fromagerie
type: PreferredTerm
modified: 2014-12-04T16:17:32+01:00
created: 2011-09-01T00:00:00+02:00
status: 1

aérodrome
type: PreferredTerm
modified: 2014-12-01T12:01:10+01:00
created: 2011-09-01T00:00:00+02:00
status: 1

terrain d'aviation
type: SimpleNonPreferredTerm
modified: 2014-12-01T12:01:10+01:00
created: 2011-09-01T00:00:00+02:00
status: 1

hangar
type: PreferredTerm
modified: 2015-02-25T16:09:59+01:00
created: 2011-09-01T00:00:00+02:00
status: 1

architecture monumentale commémorative funéraire et votive
type: PreferredTerm
modified: 2013-04-23T00:00:00+02:00
created: 2011-09-01T00:00:00+02:00
status: 1

funerary + commemorative
type: PreferredTerm
modified: 2013-04-23T00:00:00+02:00
created: 2011-09-01T00:00:00+02:00
status: 1

établissement de tir
type: PreferredTerm
modified: 2014-10-17T15:51:01+02:00
created: 2011-09-01T00:00:00+02:00
status: 1

stand de tir
type: SimpleNonPreferredTerm
modified: 2014-10-17T15:51:01+02:00
created: 2011-09-01T00:00:00+02:00
status: 1

avenue de jardin
type: PreferredTerm
modified: 2014-10-14T09:29:41+02:00
created: 2011-09-01T00:00:00+02:00
status: 1

école militaire
type: PreferredTerm
modified: 2014-12-01T16:08:16+01:00
created: 2011-09-01T00:00:00+02:00
status: 1

usine d'emballage et conditionnement
type: PreferredTerm
modified: 2015-01-27T11:03:45+01:00
created: 2011-09-01T00:00:00+02:00
status: 1

prévôté
type: SimpleNonPreferredTerm
modified: 2015-01-05T10:48:53+01:00
created: 2011-09-01T00:00:00+02:00
status: 1

sénéchaussée
type: SimpleNonPreferredTerm
modified: 2015-01-05T10:48:53+01:00
created: 2011-09-01T00:00:00+02:00
status: 1

présidial
type: SimpleNonPreferredTerm
modified: 2015-01-05T10:48:53+01:00
created: 2011-09-01T00:00:00+02:00
status: 1

justice de paix
type: SimpleNonPreferredTerm
modified: 2015-01-05T10:48:53+01:00
created: 2011-09-01T00:00:00+02:00
status: 1

officialité
type: SimpleNonPreferredTerm
modified: 2015-01-05T10:48:53+01:00
created: 2011-09-01T00:00:00+02:00
status: 1

bailliage
type: SimpleNonPreferredTerm
modified: 2015-01-05T10:48:53+01:00
created: 2011-09-01T00:00:00+02:00
status: 1

tribunal
type: PreferredTerm
modified: 2015-01-05T10:48:53+01:00
created: 2011-09-01T00:00:00+02:00
status: 1

sergenterie
type: SimpleNonPreferredTerm
modified: 2015-01-05T10:48:53+01:00
created: 2011-09-01T00:00:00+02:00
status: 1

établissement de production audiovisuelle
type: PreferredTerm
modified: 2014-12-19T10:31:59+01:00
created: 2011-09-01T00:00:00+02:00
status: 1

réseau du génie civil
type: PreferredTerm
modified: 2013-04-23T00:00:00+02:00
created: 2011-09-01T00:00:00+02:00
status: 1

foyer socio-culturel
type: SimpleNonPreferredTerm
modified: 2014-10-10T11:57:33+02:00
created: 2011-09-01T00:00:00+02:00
status: 1

salle polyvalente
type: SimpleNonPreferredTerm
modified: 2014-10-10T11:57:33+02:00
created: 2011-09-01T00:00:00+02:00
status: 1

salle des fêtes
type: PreferredTerm
modified: 2014-10-10T11:57:33+02:00
created: 2011-09-01T00:00:00+02:00
status: 1

échelle d'écluses
type: PreferredTerm
modified: 2014-10-23T12:55:36+02:00
created: 2011-09-01T00:00:00+02:00
status: 1

canal
type: PreferredTerm
modified: 2014-12-01T12:54:44+01:00
created: 2011-09-01T00:00:00+02:00
status: 1

usine de flaconnage
type: PreferredTerm
modified: 2015-04-30T15:59:34+02:00
created: 2011-09-01T00:00:00+02:00
status: 1

chaussée
type: PreferredTerm
modified: 2015-01-07T12:37:26+01:00
created: 2011-09-01T00:00:00+02:00
status: 1

ensemble commémoratif
type: PreferredTerm
modified: 2015-02-24T16:29:52+01:00
created: 2011-09-01T00:00:00+02:00
status: 1

four à prunes
type: PreferredTerm
modified: 2015-02-25T16:07:33+01:00
created: 2011-09-01T00:00:00+02:00
status: 1

parc résidentiel de loisirs
type: PreferredTerm
modified: 2014-12-12T14:43:53+01:00
created: 2011-09-01T00:00:00+02:00
status: 1

chemin de jardin
type: PreferredTerm
modified: 2014-10-14T09:30:41+02:00
created: 2011-09-01T00:00:00+02:00
status: 1

rocade
type: PreferredTerm
modified: 2014-10-17T14:50:10+02:00
created: 2011-09-01T00:00:00+02:00
status: 1

terrain de boule
type: SimpleNonPreferredTerm
modified: 2014-12-12T14:50:52+01:00
created: 2011-09-01T00:00:00+02:00
status: 1

boulodrome
type: PreferredTerm
modified: 2014-12-12T14:50:52+01:00
created: 2011-09-01T00:00:00+02:00
status: 1

groupe scolaire
type: PreferredTerm
modified: 2014-12-01T16:33:46+01:00
created: 2011-09-01T00:00:00+02:00
status: 1

prison
type: PreferredTerm
modified: 2015-01-05T10:33:06+01:00
created: 2011-09-01T00:00:00+02:00
status: 1

maison d'arrêt
type: SimpleNonPreferredTerm
modified: 2015-01-05T10:33:06+01:00
created: 2011-09-01T00:00:00+02:00
status: 1

prison centrale
type: SimpleNonPreferredTerm
modified: 2015-01-05T10:33:06+01:00
created: 2011-09-01T00:00:00+02:00
status: 1

ouradour
type: SimpleNonPreferredTerm
modified: 2015-02-24T12:18:23+01:00
created: 2011-09-01T00:00:00+02:00
status: 1

oratorio
type: PreferredTerm
modified: 2015-02-24T12:18:23+01:00
created: 2011-09-01T00:00:00+02:00
status: 1

private chapel
type: PreferredTerm
modified: 2015-02-24T12:18:23+01:00
created: 2011-09-01T00:00:00+02:00
status: 1

oratories
type: PreferredTerm
modified: 2015-02-24T12:18:23+01:00
created: 2011-09-01T00:00:00+02:00
status: 1

oratoire
type: PreferredTerm
modified: 2015-02-24T12:18:23+01:00
created: 2011-09-01T00:00:00+02:00
status: 1

lieu de production médiatique
type: PreferredTerm
modified: 2013-04-23T00:00:00+02:00
created: 2011-09-01T00:00:00+02:00
status: 1

usine de façonnage du papier
type: PreferredTerm
modified: 2013-04-23T00:00:00+02:00
created: 2011-09-01T00:00:00+02:00
status: 1

pharmacie
type: PreferredTerm
modified: 2015-01-02T12:34:11+01:00
created: 2011-09-01T00:00:00+02:00
status: 1

salle paroissiale
type: PreferredTerm
modified: 2014-12-19T10:56:25+01:00
created: 2011-09-01T00:00:00+02:00
status: 1

écluse
type: PreferredTerm
modified: 2014-12-02T12:00:08+01:00
created: 2011-09-01T00:00:00+02:00
status: 1

écluse à sas
type: SimpleNonPreferredTerm
modified: 2014-12-02T12:00:08+01:00
created: 2011-09-01T00:00:00+02:00
status: 1

usine de verre creux
type: PreferredTerm
modified: 2015-04-30T15:56:43+02:00
created: 2011-09-01T00:00:00+02:00
status: 1

réseau d'équipement urbain
type: PreferredTerm
modified: 2014-09-24T10:33:30+02:00
created: 2011-09-01T00:00:00+02:00
status: 1

usine de matières plastiques
type: PreferredTerm
modified: 2015-04-29T16:12:03+02:00
created: 2011-09-01T00:00:00+02:00
status: 1

caniveau
type: PreferredTerm
modified: 2015-01-07T12:35:02+01:00
created: 2011-09-01T00:00:00+02:00
status: 1

drain
type: SimpleNonPreferredTerm
modified: 2015-01-07T12:35:02+01:00
created: 2011-09-01T00:00:00+02:00
status: 1

parc de loisirs
type: SimpleNonPreferredTerm
modified: 2014-10-10T12:10:42+02:00
created: 2011-09-01T00:00:00+02:00
status: 1

parc d'attractions
type: PreferredTerm
modified: 2014-10-10T12:10:42+02:00
created: 2011-09-01T00:00:00+02:00
status: 1

parc à thèmes
type: SimpleNonPreferredTerm
modified: 2014-10-10T12:10:42+02:00
created: 2011-09-01T00:00:00+02:00
status: 1

four à pain
type: PreferredTerm
modified: 2015-02-25T16:06:51+01:00
created: 2011-09-01T00:00:00+02:00
status: 1

aqueduc
type: PreferredTerm
modified: 2014-12-01T12:49:56+01:00
created: 2011-09-01T00:00:00+02:00
status: 1

banc des morts
type: SimpleNonPreferredTerm
modified: 2015-02-24T12:20:38+01:00
created: 2011-09-01T00:00:00+02:00
status: 1

pierre des morts
type: PreferredTerm
modified: 2015-02-24T12:20:38+01:00
created: 2011-09-01T00:00:00+02:00
status: 1

coffin rest
type: PreferredTerm
modified: 2015-02-24T12:20:38+01:00
created: 2011-09-01T00:00:00+02:00
status: 1

gare maritime
type: PreferredTerm
modified: 2014-11-18T12:58:40+01:00
created: 2011-09-01T00:00:00+02:00
status: 1

parterre de gazon
type: PreferredTerm
modified: 2014-12-30T16:38:37+01:00
created: 2011-09-01T00:00:00+02:00
status: 1

fausse rivière
type: PreferredTerm
modified: 2014-10-14T11:11:19+02:00
created: 2011-09-01T00:00:00+02:00
status: 1

laiterie
type: PreferredTerm
modified: 2014-12-04T16:44:21+01:00
created: 2011-09-01T00:00:00+02:00
status: 1

consulat
type: PreferredTerm
modified: 2014-10-09T11:55:21+02:00
created: 2011-09-01T00:00:00+02:00
status: 1

pressoir
type: PreferredTerm
modified: 2014-12-30T14:43:23+01:00
created: 2011-09-01T00:00:00+02:00
status: 1

ensemble hospitalier d'assistance ou de protection sociale
type: PreferredTerm
modified: 2013-04-23T00:00:00+02:00
created: 2011-09-01T00:00:00+02:00
status: 1

varangue
type: SimpleNonPreferredTerm
modified: 2015-02-26T11:30:49+01:00
created: 2011-09-01T00:00:00+02:00
status: 1

véranda
type: PreferredTerm
modified: 2015-02-26T11:30:49+01:00
created: 2011-09-01T00:00:00+02:00
status: 1

infirmerie
type: PreferredTerm
modified: 2015-01-02T11:54:53+01:00
created: 2011-09-01T00:00:00+02:00
status: 1

chai
type: PreferredTerm
modified: 2015-03-26T12:58:29+01:00
created: 2011-09-01T00:00:00+02:00
status: 1

mirador
type: PreferredTerm
modified: 2015-01-05T10:25:07+01:00
created: 2011-09-01T00:00:00+02:00
status: 1

districts
type: PreferredTerm
modified: 2015-01-09T12:14:58+01:00
created: 2011-09-01T00:00:00+02:00
status: 1

secteur urbain
type: PreferredTerm
modified: 2015-01-09T12:14:58+01:00
created: 2011-09-01T00:00:00+02:00
status: 1

réseau de communication
type: PreferredTerm
modified: 2014-10-17T10:00:13+02:00
created: 2011-09-01T00:00:00+02:00
status: 1

aire de lavage
type: PreferredTerm
modified: 2015-03-24T13:16:00+01:00
created: 2011-09-01T00:00:00+02:00
status: 1

observatoire
type: PreferredTerm
modified: 2014-12-19T10:21:10+01:00
created: 2011-09-01T00:00:00+02:00
status: 1

observatoire astronomique
type: SimpleNonPreferredTerm
modified: 2014-12-19T10:21:10+01:00
created: 2011-09-01T00:00:00+02:00
status: 1

boucherie
type: PreferredTerm
modified: 2014-10-06T12:46:18+02:00
created: 2011-09-01T00:00:00+02:00
status: 1

clôture de jardin
type: PreferredTerm
modified: 2014-12-30T15:13:52+01:00
created: 2011-09-01T00:00:00+02:00
status: 1

patinoire
type: PreferredTerm
modified: 2014-12-12T15:28:49+01:00
created: 2011-09-01T00:00:00+02:00
status: 1

columbarium
type: PreferredTerm
modified: 2015-02-24T15:57:32+01:00
created: 2011-09-01T00:00:00+02:00
status: 1

immeuble de bureaux
type: PreferredTerm
modified: 2014-12-04T16:33:48+01:00
created: 2011-09-01T00:00:00+02:00
status: 1

port
type: PreferredTerm
modified: 2014-12-01T13:26:26+01:00
created: 2011-09-01T00:00:00+02:00
status: 1

campus
type: SimpleNonPreferredTerm
modified: 2014-10-16T10:33:27+02:00
created: 2011-09-01T00:00:00+02:00
status: 1

campus universitaire
type: PreferredTerm
modified: 2014-10-16T10:33:27+02:00
created: 2011-09-01T00:00:00+02:00
status: 1

étang
type: PreferredTerm
modified: 2014-12-30T17:04:59+01:00
created: 2011-09-01T00:00:00+02:00
status: 1

église orthodoxe
type: SimpleNonPreferredTerm
modified: 2014-11-24T11:15:54+01:00
created: 2011-09-01T00:00:00+02:00
status: 1

church
type: PreferredTerm
modified: 2014-11-24T11:15:54+01:00
created: 2011-09-01T00:00:00+02:00
status: 1

église
type: PreferredTerm
modified: 2014-11-24T11:15:54+01:00
created: 2011-09-01T00:00:00+02:00
status: 1

churches
type: PreferredTerm
modified: 2014-11-24T11:15:54+01:00
created: 2011-09-01T00:00:00+02:00
status: 1

église luthérienne
type: SimpleNonPreferredTerm
modified: 2014-11-24T11:15:54+01:00
created: 2011-09-01T00:00:00+02:00
status: 1

chiesa
type: PreferredTerm
modified: 2014-11-24T11:15:54+01:00
created: 2011-09-01T00:00:00+02:00
status: 1

église catholique
type: SimpleNonPreferredTerm
modified: 2014-11-24T11:15:54+01:00
created: 2011-09-01T00:00:00+02:00
status: 1

ossuaries (buildings)
type: PreferredTerm
modified: 2015-02-24T16:28:53+01:00
created: 2011-09-01T00:00:00+02:00
status: 1

ossuary
type: PreferredTerm
modified: 2015-02-24T16:28:53+01:00
created: 2011-09-01T00:00:00+02:00
status: 1

ossario
type: PreferredTerm
modified: 2015-02-24T16:28:53+01:00
created: 2011-09-01T00:00:00+02:00
status: 1

ossuaire
type: PreferredTerm
modified: 2015-02-24T16:28:53+01:00
created: 2011-09-01T00:00:00+02:00
status: 1

pressoir à cidre
type: PreferredTerm
modified: 2014-12-30T14:45:08+01:00
created: 2011-09-01T00:00:00+02:00
status: 1

beffroi
type: PreferredTerm
modified: 2014-12-05T12:06:14+01:00
created: 2011-09-01T00:00:00+02:00
status: 1

beffroi communal
type: SimpleNonPreferredTerm
modified: 2014-12-05T12:06:14+01:00
created: 2011-09-01T00:00:00+02:00
status: 1

réseau d'irrigation
type: PreferredTerm
modified: 2014-10-06T12:01:57+02:00
created: 2011-09-01T00:00:00+02:00
status: 1

CHU
type: SimpleNonPreferredTerm
modified: 2015-01-02T12:28:27+01:00
created: 2011-09-01T00:00:00+02:00
status: 1

centre hospitalier universitaire
type: PreferredTerm
modified: 2015-01-02T12:28:27+01:00
created: 2011-09-01T00:00:00+02:00
status: 1

pièce de stockage du combustible
type: PreferredTerm
modified: 2015-04-30T17:05:47+02:00
created: 2011-09-01T00:00:00+02:00
status: 1

chambre froide
type: PreferredTerm
modified: 2015-03-26T13:04:12+01:00
created: 2011-09-01T00:00:00+02:00
status: 1

parterre de pièces coupées
type: PreferredTerm
modified: 2014-10-14T11:02:15+02:00
created: 2011-09-01T00:00:00+02:00
status: 1

dispensaire
type: PreferredTerm
modified: 2015-01-02T11:51:29+01:00
created: 2011-09-01T00:00:00+02:00
status: 1

réseau du gaz
type: PreferredTerm
modified: 2014-10-17T09:21:02+02:00
created: 2011-09-01T00:00:00+02:00
status: 1

pilori
type: PreferredTerm
modified: 2014-10-14T14:10:05+02:00
created: 2011-09-01T00:00:00+02:00
status: 1

banlieue
type: PreferredTerm
modified: 2014-10-17T14:52:57+02:00
created: 2011-09-01T00:00:00+02:00
status: 1

garden city
type: PreferredTerm
modified: 2015-01-09T11:18:18+01:00
created: 2011-09-01T00:00:00+02:00
status: 1

cité jardin
type: PreferredTerm
modified: 2015-01-09T11:18:18+01:00
created: 2011-09-01T00:00:00+02:00
status: 1

garden cities
type: PreferredTerm
modified: 2015-01-09T11:18:18+01:00
created: 2011-09-01T00:00:00+02:00
status: 1

coupole d'observatoire
type: SimpleNonPreferredTerm
modified: 2014-12-19T10:23:01+01:00
created: 2011-09-01T00:00:00+02:00
status: 1

abri d'instrument équatorial
type: PreferredTerm
modified: 2014-12-19T10:23:01+01:00
created: 2011-09-01T00:00:00+02:00
status: 1

aire de séchage
type: PreferredTerm
modified: 2015-03-24T14:58:37+01:00
created: 2011-09-01T00:00:00+02:00
status: 1

sottopassaggio
type: PreferredTerm
modified: 2015-01-07T13:13:00+01:00
created: 2011-09-01T00:00:00+02:00
status: 1

passage couvert
type: PreferredTerm
modified: 2015-01-07T13:13:00+01:00
created: 2011-09-01T00:00:00+02:00
status: 1

covered way
type: PreferredTerm
modified: 2015-01-07T13:13:00+01:00
created: 2011-09-01T00:00:00+02:00
status: 1

abattoir
type: PreferredTerm
modified: 2014-12-04T14:55:33+01:00
created: 2011-09-01T00:00:00+02:00
status: 1

charnier
type: PreferredTerm
modified: 2014-10-15T12:59:33+02:00
created: 2011-09-01T00:00:00+02:00
status: 1

charnel pit
type: PreferredTerm
modified: 2014-10-15T12:59:33+02:00
created: 2011-09-01T00:00:00+02:00
status: 1

fossa comune
type: PreferredTerm
modified: 2014-10-15T12:59:33+02:00
created: 2011-09-01T00:00:00+02:00
status: 1

chemin de ceinture
type: PreferredTerm
modified: 2013-04-23T00:00:00+02:00
created: 2011-09-01T00:00:00+02:00
status: 1

bureau de poste
type: PreferredTerm
modified: 2014-12-05T12:07:02+01:00
created: 2011-09-01T00:00:00+02:00
status: 1

fronton de pelote basque
type: PreferredTerm
modified: 2014-10-10T10:05:12+02:00
created: 2011-09-01T00:00:00+02:00
status: 1

trinquet
type: SimpleNonPreferredTerm
modified: 2014-10-10T10:05:12+02:00
created: 2011-09-01T00:00:00+02:00
status: 1

usine de taille de pierre pour la joaillerie et l'industrie
type: PreferredTerm
modified: 2015-01-21T17:04:27+01:00
created: 2011-09-01T00:00:00+02:00
status: 1

hôtel de voyageurs
type: PreferredTerm
modified: 2014-12-04T16:33:01+01:00
created: 2011-09-01T00:00:00+02:00
status: 1

hôtel de tourisme
type: SimpleNonPreferredTerm
modified: 2014-12-04T16:33:01+01:00
created: 2011-09-01T00:00:00+02:00
status: 1

arc funéraire
type: SimpleNonPreferredTerm
modified: 2015-02-24T16:33:18+01:00
created: 2011-09-01T00:00:00+02:00
status: 1

arc commémoratif
type: SimpleNonPreferredTerm
modified: 2015-02-24T16:33:18+01:00
created: 2011-09-01T00:00:00+02:00
status: 1

memorial arches
type: PreferredTerm
modified: 2015-02-24T16:33:18+01:00
created: 2011-09-01T00:00:00+02:00
status: 1

arc monumental
type: PreferredTerm
modified: 2015-02-24T16:33:18+01:00
created: 2011-09-01T00:00:00+02:00
status: 1

commemorative monument + arch
type: PreferredTerm
modified: 2015-02-24T16:33:18+01:00
created: 2011-09-01T00:00:00+02:00
status: 1

arco onorario
type: PreferredTerm
modified: 2015-02-24T16:33:18+01:00
created: 2011-09-01T00:00:00+02:00
status: 1

avant-port
type: PreferredTerm
modified: 2014-12-01T13:28:01+01:00
created: 2011-09-01T00:00:00+02:00
status: 1

hôpital psychiatrique
type: SimpleNonPreferredTerm
modified: 2015-01-02T12:01:23+01:00
created: 2011-09-01T00:00:00+02:00
status: 1

asile d'aliénés
type: PreferredTerm
modified: 2015-01-02T12:01:23+01:00
created: 2011-09-01T00:00:00+02:00
status: 1

bureau d'études
type: PreferredTerm
modified: 2015-03-25T16:42:44+01:00
created: 2011-09-01T00:00:00+02:00
status: 1

basilican church
type: PreferredTerm
modified: 2014-11-27T15:55:37+01:00
created: 2011-09-01T00:00:00+02:00
status: 1

basilique
type: PreferredTerm
modified: 2014-11-27T15:55:37+01:00
created: 2011-09-01T00:00:00+02:00
status: 1

basilica
type: PreferredTerm
modified: 2014-11-27T15:55:37+01:00
created: 2011-09-01T00:00:00+02:00
status: 1

parterre de broderie
type: PreferredTerm
modified: 2014-12-30T16:42:33+01:00
created: 2011-09-01T00:00:00+02:00
status: 1

ensemble scolaire
type: PreferredTerm
modified: 2013-04-23T00:00:00+02:00
created: 2011-09-01T00:00:00+02:00
status: 1

abri d'instrument méridien
type: PreferredTerm
modified: 2014-12-19T10:24:34+01:00
created: 2011-09-01T00:00:00+02:00
status: 1

édifice hospitalier d'assistance ou de protection sociale
type: PreferredTerm
modified: 2013-04-23T00:00:00+02:00
created: 2011-09-01T00:00:00+02:00
status: 1

pièce de séchage
type: PreferredTerm
modified: 2015-04-08T11:36:21+02:00
created: 2011-09-01T00:00:00+02:00
status: 1

pont à plusieurs niveaux
type: PreferredTerm
modified: 2014-10-23T13:13:37+02:00
created: 2011-09-01T00:00:00+02:00
status: 1

réseau de distribution électrique
type: PreferredTerm
modified: 2014-10-17T09:19:16+02:00
created: 2011-09-01T00:00:00+02:00
status: 1

aire de concassage
type: PreferredTerm
modified: 2015-03-24T12:55:25+01:00
created: 2011-09-01T00:00:00+02:00
status: 1

partie d'édifice judiciaire pénitentiaire ou de police
type: PreferredTerm
modified: 2013-04-23T00:00:00+02:00
created: 2011-09-01T00:00:00+02:00
status: 1

lac de jardin
type: PreferredTerm
modified: 2014-12-30T17:09:43+01:00
created: 2011-09-01T00:00:00+02:00
status: 1

piste cyclable
type: PreferredTerm
modified: 2015-01-07T13:18:35+01:00
created: 2011-09-01T00:00:00+02:00
status: 1

cycle path
type: PreferredTerm
modified: 2015-01-07T13:18:35+01:00
created: 2011-09-01T00:00:00+02:00
status: 1

enfeu
type: PreferredTerm
modified: 2015-02-24T14:41:37+01:00
created: 2011-09-01T00:00:00+02:00
status: 1

tomb + niche
type: PreferredTerm
modified: 2015-02-24T14:41:37+01:00
created: 2011-09-01T00:00:00+02:00
status: 1

loculo
type: PreferredTerm
modified: 2015-02-24T14:41:37+01:00
created: 2011-09-01T00:00:00+02:00
status: 1

relief artificiel de jardin
type: PreferredTerm
modified: 2013-04-23T00:00:00+02:00
created: 2011-09-01T00:00:00+02:00
status: 1

pigeonnier à pied
type: SimpleNonPreferredTerm
modified: 2014-12-30T14:37:57+01:00
created: 2011-09-01T00:00:00+02:00
status: 1

colombier
type: PreferredTerm
modified: 2014-12-30T14:37:57+01:00
created: 2011-09-01T00:00:00+02:00
status: 1

jeu de paume
type: PreferredTerm
modified: 2014-10-10T10:09:44+02:00
created: 2011-09-01T00:00:00+02:00
status: 1

édifice privé commercial
type: SimpleNonPreferredTerm
modified: 2013-04-23T00:00:00+02:00
created: 2011-09-01T00:00:00+02:00
status: 1

édifice artisanal commercial ou tertiaire
type: PreferredTerm
modified: 2013-04-23T00:00:00+02:00
created: 2011-09-01T00:00:00+02:00
status: 1

palissade de verdure
type: PreferredTerm
modified: 2014-10-14T09:41:40+02:00
created: 2011-09-01T00:00:00+02:00
status: 1

usine métallurgique
type: PreferredTerm
modified: 2015-03-13T12:36:57+01:00
created: 2011-09-01T00:00:00+02:00
status: 1

rivière aménagée
type: PreferredTerm
modified: 2014-12-01T13:29:26+01:00
created: 2011-09-01T00:00:00+02:00
status: 1

commemorative monument 1
type: PreferredTerm
modified: 2015-02-24T12:36:36+01:00
created: 2011-09-01T00:00:00+02:00
status: 1

monument
type: PreferredTerm
modified: 2015-02-24T12:36:36+01:00
created: 2011-09-01T00:00:00+02:00
status: 1

édicule votif
type: SimpleNonPreferredTerm
modified: 2015-02-24T12:36:36+01:00
created: 2011-09-01T00:00:00+02:00
status: 1

monuments
type: PreferredTerm
modified: 2015-02-24T12:36:36+01:00
created: 2011-09-01T00:00:00+02:00
status: 1

garage de réparation automobile
type: PreferredTerm
modified: 2014-10-06T13:22:22+02:00
created: 2011-09-01T00:00:00+02:00
status: 1

cathedrals (buildings)
type: PreferredTerm
modified: 2014-11-27T16:08:35+01:00
created: 2011-09-01T00:00:00+02:00
status: 1

cattedrale
type: PreferredTerm
modified: 2014-11-27T16:08:35+01:00
created: 2011-09-01T00:00:00+02:00
status: 1

cathédrale
type: PreferredTerm
modified: 2014-11-27T16:08:35+01:00
created: 2011-09-01T00:00:00+02:00
status: 1

primatiale
type: SimpleNonPreferredTerm
modified: 2014-11-27T16:08:35+01:00
created: 2011-09-01T00:00:00+02:00
status: 1

cathedral
type: PreferredTerm
modified: 2014-11-27T16:08:35+01:00
created: 2011-09-01T00:00:00+02:00
status: 1

île artificielle
type: PreferredTerm
modified: 2014-12-30T17:06:45+01:00
created: 2011-09-01T00:00:00+02:00
status: 1

cale de construction
type: PreferredTerm
modified: 2015-03-26T11:48:04+01:00
created: 2011-09-01T00:00:00+02:00
status: 1

hôtel-Dieu
type: SimpleNonPreferredTerm
modified: 2015-01-02T12:22:42+01:00
created: 2011-09-01T00:00:00+02:00
status: 1

centre hospitalier
type: SimpleNonPreferredTerm
modified: 2015-01-02T12:22:42+01:00
created: 2011-09-01T00:00:00+02:00
status: 1

hôpital
type: PreferredTerm
modified: 2015-01-02T12:22:42+01:00
created: 2011-09-01T00:00:00+02:00
status: 1

parterre en mosaïculture
type: PreferredTerm
modified: 2014-10-14T11:02:44+02:00
created: 2011-09-01T00:00:00+02:00
status: 1

architecture scolaire
type: PreferredTerm
modified: 2014-12-01T15:26:35+01:00
created: 2011-09-01T00:00:00+02:00
status: 1

édifice d'assistance ou de protection sociale
type: PreferredTerm
modified: 2013-04-23T00:00:00+02:00
created: 2011-09-01T00:00:00+02:00
status: 1

magasin industriel
type: PreferredTerm
modified: 2015-03-31T16:12:20+02:00
created: 2011-09-01T00:00:00+02:00
status: 1

aire de fabrication
type: PreferredTerm
modified: 2015-03-24T13:01:03+01:00
created: 2011-09-01T00:00:00+02:00
status: 1

réseau d'éclairage urbain
type: PreferredTerm
modified: 2014-10-17T09:17:05+02:00
created: 2011-09-01T00:00:00+02:00
status: 1

éclairage urbain
type: SimpleNonPreferredTerm
modified: 2014-10-17T09:17:05+02:00
created: 2011-09-01T00:00:00+02:00
status: 1

auditoire
type: SimpleNonPreferredTerm
modified: 2015-01-05T10:59:24+01:00
created: 2011-09-01T00:00:00+02:00
status: 1

salle d'audience
type: PreferredTerm
modified: 2015-01-05T10:59:24+01:00
created: 2011-09-01T00:00:00+02:00
status: 1

prétoire
type: SimpleNonPreferredTerm
modified: 2015-01-05T10:59:24+01:00
created: 2011-09-01T00:00:00+02:00
status: 1

bande cyclable
type: PreferredTerm
modified: 2014-10-17T14:52:09+02:00
created: 2011-09-01T00:00:00+02:00
status: 1

four crématoire
type: SimpleNonPreferredTerm
modified: 2014-10-15T13:01:10+02:00
created: 2011-09-01T00:00:00+02:00
status: 1

crématorium
type: PreferredTerm
modified: 2014-10-15T13:01:10+02:00
created: 2011-09-01T00:00:00+02:00
status: 1

crematories
type: PreferredTerm
modified: 2014-10-15T13:01:10+02:00
created: 2011-09-01T00:00:00+02:00
status: 1

crematorio
type: PreferredTerm
modified: 2014-10-15T13:01:10+02:00
created: 2011-09-01T00:00:00+02:00
status: 1

crematorium
type: PreferredTerm
modified: 2014-10-15T13:01:10+02:00
created: 2011-09-01T00:00:00+02:00
status: 1

jeu d'eau
type: PreferredTerm
modified: 2014-12-30T17:08:50+01:00
created: 2011-09-01T00:00:00+02:00
status: 1

jet d'eau
type: SimpleNonPreferredTerm
modified: 2014-12-30T17:08:50+01:00
created: 2011-09-01T00:00:00+02:00
status: 1

manège
type: PreferredTerm
modified: 2014-12-12T15:26:33+01:00
created: 2011-09-01T00:00:00+02:00
status: 1

parc d'exposition
type: PreferredTerm
modified: 2014-10-17T15:18:12+02:00
created: 2011-09-01T00:00:00+02:00
status: 1

bordure
type: PreferredTerm
modified: 2014-10-14T09:40:28+02:00
created: 2011-09-01T00:00:00+02:00
status: 1

belvédère de jardin
type: PreferredTerm
modified: 2014-12-31T11:23:18+01:00
created: 2011-09-01T00:00:00+02:00
status: 1

point de vue
type: SimpleNonPreferredTerm
modified: 2014-12-31T11:23:18+01:00
created: 2011-09-01T00:00:00+02:00
status: 1

poulailler
type: PreferredTerm
modified: 2014-12-30T14:39:41+01:00
created: 2011-09-01T00:00:00+02:00
status: 1

bureau d'embauche
type: PreferredTerm
modified: 2014-10-20T09:48:17+02:00
created: 2011-09-01T00:00:00+02:00
status: 1

carrefour
type: PreferredTerm
modified: 2015-01-07T12:01:37+01:00
created: 2011-09-01T00:00:00+02:00
status: 1

croisement
type: SimpleNonPreferredTerm
modified: 2015-01-07T12:01:37+01:00
created: 2011-09-01T00:00:00+02:00
status: 1

crossroads, road junction
type: PreferredTerm
modified: 2015-01-07T12:01:37+01:00
created: 2011-09-01T00:00:00+02:00
status: 1

logis patronal
type: SimpleNonPreferredTerm
modified: 2015-03-31T15:47:29+02:00
created: 2011-09-01T00:00:00+02:00
status: 1

logement patronal
type: PreferredTerm
modified: 2015-03-31T15:47:29+02:00
created: 2011-09-01T00:00:00+02:00
status: 1

grand magasin
type: PreferredTerm
modified: 2014-12-05T10:16:26+01:00
created: 2011-09-01T00:00:00+02:00
status: 1

entrepôt agricole
type: PreferredTerm
modified: 2014-12-30T13:47:53+01:00
created: 2011-09-01T00:00:00+02:00
status: 1

coopérative agricole
type: SimpleNonPreferredTerm
modified: 2014-12-30T13:47:53+01:00
created: 2011-09-01T00:00:00+02:00
status: 1

cercle de sociabilité
type: PreferredTerm
modified: 2014-12-12T10:48:54+01:00
created: 2011-09-01T00:00:00+02:00
status: 1

cercle
type: SimpleNonPreferredTerm
modified: 2014-12-12T10:48:54+01:00
created: 2013-12-09T16:41:33+01:00
status: 1

musée
type: PreferredTerm
modified: 2014-12-19T10:42:37+01:00
created: 2011-09-01T00:00:00+02:00
status: 1

museum
type: SimpleNonPreferredTerm
modified: 2014-12-19T10:42:37+01:00
created: 2011-09-01T00:00:00+02:00
status: 1

entrée de jardin
type: PreferredTerm
modified: 2014-10-14T09:32:11+02:00
created: 2011-09-01T00:00:00+02:00
status: 1

cappella 1
type: PreferredTerm
modified: 2014-11-27T16:11:16+01:00
created: 2011-09-01T00:00:00+02:00
status: 1

église dite chapelle
type: SimpleNonPreferredTerm
modified: 2014-11-27T16:11:16+01:00
created: 2011-09-01T00:00:00+02:00
status: 1

chapelle
type: PreferredTerm
modified: 2014-11-27T16:11:16+01:00
created: 2011-09-01T00:00:00+02:00
status: 1

chapels 1
type: PreferredTerm
modified: 2014-11-27T16:11:16+01:00
created: 2011-09-01T00:00:00+02:00
status: 1

chapel 1
type: PreferredTerm
modified: 2014-11-27T16:11:16+01:00
created: 2011-09-01T00:00:00+02:00
status: 1

massif de fleurs
type: PreferredTerm
modified: 2014-12-30T16:36:13+01:00
created: 2011-09-01T00:00:00+02:00
status: 1

butte artificielle
type: PreferredTerm
modified: 2014-12-31T11:24:46+01:00
created: 2011-09-01T00:00:00+02:00
status: 1

usine de papiers peints
type: PreferredTerm
modified: 2015-01-23T12:29:42+01:00
created: 2011-09-01T00:00:00+02:00
status: 1

enclos funéraire
type: PreferredTerm
modified: 2014-10-20T11:33:18+02:00
created: 2011-09-01T00:00:00+02:00
status: 1

churchyard + walls
type: PreferredTerm
modified: 2014-10-20T11:33:18+02:00
created: 2011-09-01T00:00:00+02:00
status: 1

funerary enclosure
type: PreferredTerm
modified: 2014-10-20T11:33:18+02:00
created: 2011-09-01T00:00:00+02:00
status: 1

recinto cimiteriale
type: PreferredTerm
modified: 2014-10-20T11:33:18+02:00
created: 2011-09-01T00:00:00+02:00
status: 1

mare
type: PreferredTerm
modified: 2014-12-30T14:33:27+01:00
created: 2011-09-01T00:00:00+02:00
status: 1

complexe hôtelier
type: PreferredTerm
modified: 2014-10-17T15:16:46+02:00
created: 2011-09-01T00:00:00+02:00
status: 1

raffinerie de sucre
type: PreferredTerm
modified: 2015-04-29T15:17:52+02:00
created: 2011-09-01T00:00:00+02:00
status: 1

usine de produits pharmaceutiques
type: PreferredTerm
modified: 2015-02-12T12:07:34+01:00
created: 2011-09-01T00:00:00+02:00
status: 1

rond-point
type: SimpleNonPreferredTerm
modified: 2015-01-07T11:59:33+01:00
created: 2011-09-01T00:00:00+02:00
status: 1

carrefour giratoire
type: PreferredTerm
modified: 2015-01-07T11:59:33+01:00
created: 2011-09-01T00:00:00+02:00
status: 1

roundabout
type: PreferredTerm
modified: 2015-01-07T11:59:33+01:00
created: 2011-09-01T00:00:00+02:00
status: 1

galerie marchande
type: PreferredTerm
modified: 2014-12-05T10:13:57+01:00
created: 2011-09-01T00:00:00+02:00
status: 1

logement d'ouvriers
type: PreferredTerm
modified: 2015-03-31T15:46:38+02:00
created: 2011-09-01T00:00:00+02:00
status: 1

centre social
type: PreferredTerm
modified: 2015-01-02T11:19:02+01:00
created: 2011-09-01T00:00:00+02:00
status: 1

centre socio-culturel
type: SimpleNonPreferredTerm
modified: 2015-01-02T11:19:02+01:00
created: 2011-09-01T00:00:00+02:00
status: 1

parcours sportif
type: PreferredTerm
modified: 2014-10-09T13:11:11+02:00
created: 2011-09-01T00:00:00+02:00
status: 1

maison de quartier
type: PreferredTerm
modified: 2014-12-19T10:36:25+01:00
created: 2011-09-01T00:00:00+02:00
status: 1

chambre de commerce
type: PreferredTerm
modified: 2014-12-12T10:51:51+01:00
created: 2011-09-01T00:00:00+02:00
status: 1

corbeille de jardin
type: PreferredTerm
modified: 2014-10-14T10:57:57+02:00
created: 2011-09-01T00:00:00+02:00
status: 1

ferme
type: PreferredTerm
modified: 2014-12-30T13:52:01+01:00
created: 2011-09-01T00:00:00+02:00
status: 1

chapelle des morts
type: PreferredTerm
modified: 2014-11-27T16:19:40+01:00
created: 2011-09-01T00:00:00+02:00
status: 1

triumphal arches
type: PreferredTerm
modified: 2015-02-24T16:34:15+01:00
created: 2011-09-01T00:00:00+02:00
status: 1

arc de triomphe
type: PreferredTerm
modified: 2015-02-24T16:34:15+01:00
created: 2011-09-01T00:00:00+02:00
status: 1

triumphal arch
type: PreferredTerm
modified: 2015-02-24T16:34:15+01:00
created: 2011-09-01T00:00:00+02:00
status: 1

arco di trionfo
type: PreferredTerm
modified: 2015-02-24T16:34:15+01:00
created: 2011-09-01T00:00:00+02:00
status: 1

saut de loup
type: PreferredTerm
modified: 2014-10-14T09:44:30+02:00
created: 2011-09-01T00:00:00+02:00
status: 1

pigeonnier
type: PreferredTerm
modified: 2014-12-30T14:35:56+01:00
created: 2011-09-01T00:00:00+02:00
status: 1

fuie
type: SimpleNonPreferredTerm
modified: 2014-12-30T14:35:56+01:00
created: 2011-09-01T00:00:00+02:00
status: 1

cemeteries
type: PreferredTerm
modified: 2014-10-15T13:13:57+02:00
created: 2011-09-01T00:00:00+02:00
status: 1

cimetière
type: PreferredTerm
modified: 2014-10-15T13:13:57+02:00
created: 2011-09-01T00:00:00+02:00
status: 1

cimitero
type: PreferredTerm
modified: 2014-10-15T13:13:57+02:00
created: 2011-09-01T00:00:00+02:00
status: 1

churchyard
type: SimpleNonPreferredTerm
modified: 2014-10-15T13:13:57+02:00
created: 2011-09-01T00:00:00+02:00
status: 1

cemetery 1
type: PreferredTerm
modified: 2014-10-15T13:13:57+02:00
created: 2011-09-01T00:00:00+02:00
status: 1

charmille
type: PreferredTerm
modified: 2014-12-30T15:19:39+01:00
created: 2011-09-01T00:00:00+02:00
status: 1

montagne artificielle
type: PreferredTerm
modified: 2014-10-22T12:17:05+02:00
created: 2011-09-01T00:00:00+02:00
status: 1

usine de produits photographiques et cinématographiques
type: PreferredTerm
modified: 2015-04-29T16:33:56+02:00
created: 2011-09-01T00:00:00+02:00
status: 1

partie d'édifice industriel
type: SimpleNonPreferredTerm
modified: 2015-04-30T16:08:45+02:00
created: 2011-09-01T00:00:00+02:00
status: 1

parties industrielles
type: PreferredTerm
modified: 2015-04-30T16:08:45+02:00
created: 2011-09-01T00:00:00+02:00
status: 1

champ de courses
type: SimpleNonPreferredTerm
modified: 2014-12-12T15:08:13+01:00
created: 2011-09-01T00:00:00+02:00
status: 1

hippodrome
type: PreferredTerm
modified: 2014-12-12T15:08:13+01:00
created: 2011-09-01T00:00:00+02:00
status: 1

champ de foire
type: PreferredTerm
modified: 2014-12-05T11:22:29+01:00
created: 2011-09-01T00:00:00+02:00
status: 1

sucrerie
type: PreferredTerm
modified: 2015-04-29T15:15:06+02:00
created: 2011-09-01T00:00:00+02:00
status: 1

chaufferie
type: PreferredTerm
modified: 2015-03-26T13:38:32+01:00
created: 2011-09-01T00:00:00+02:00
status: 1

dépôt de mendicité
type: PreferredTerm
modified: 2015-01-02T11:20:25+01:00
created: 2011-09-01T00:00:00+02:00
status: 1

logement de contremaître
type: PreferredTerm
modified: 2015-03-31T14:22:20+02:00
created: 2011-09-01T00:00:00+02:00
status: 1

courée
type: PreferredTerm
modified: 2015-01-09T11:25:02+01:00
created: 2011-09-01T00:00:00+02:00
status: 1

collegiate churches
type: PreferredTerm
modified: 2014-11-27T16:31:34+01:00
created: 2011-09-01T00:00:00+02:00
status: 1

collegiata
type: PreferredTerm
modified: 2014-11-27T16:31:34+01:00
created: 2011-09-01T00:00:00+02:00
status: 1

collégiale
type: PreferredTerm
modified: 2014-11-27T16:31:34+01:00
created: 2011-09-01T00:00:00+02:00
status: 1

collegiate church
type: PreferredTerm
modified: 2014-11-27T16:31:34+01:00
created: 2011-09-01T00:00:00+02:00
status: 1

studio de cinéma
type: PreferredTerm
modified: 2014-12-19T10:34:28+01:00
created: 2011-09-01T00:00:00+02:00
status: 1

échoppe
type: PreferredTerm
modified: 2014-12-05T10:04:33+01:00
created: 2011-09-01T00:00:00+02:00
status: 1

parterre
type: PreferredTerm
modified: 2014-12-30T16:40:57+01:00
created: 2011-09-01T00:00:00+02:00
status: 1

cascade
type: PreferredTerm
modified: 2014-12-30T17:01:55+01:00
created: 2011-09-01T00:00:00+02:00
status: 1

usine d'habillement
type: PreferredTerm
modified: 2015-01-22T11:34:29+01:00
created: 2011-09-01T00:00:00+02:00
status: 1

terrasse agricole
type: PreferredTerm
modified: 2014-12-30T14:07:10+01:00
created: 2011-09-01T00:00:00+02:00
status: 1

terrasse de culture
type: SimpleNonPreferredTerm
modified: 2014-12-30T14:07:10+01:00
created: 2011-09-01T00:00:00+02:00
status: 1

gare de triage
type: PreferredTerm
modified: 2014-12-01T13:12:36+01:00
created: 2011-09-01T00:00:00+02:00
status: 1

triage
type: SimpleNonPreferredTerm
modified: 2014-12-01T13:12:36+01:00
created: 2011-09-01T00:00:00+02:00
status: 1

moulin à huile
type: PreferredTerm
modified: 2015-01-20T11:40:21+01:00
created: 2011-09-01T00:00:00+02:00
status: 1

fenil
type: PreferredTerm
modified: 2014-12-30T14:29:18+01:00
created: 2011-09-01T00:00:00+02:00
status: 1

siège d'association ou d'organisation
type: PreferredTerm
modified: 2014-10-17T15:32:31+02:00
created: 2011-09-01T00:00:00+02:00
status: 1

funerary buildings
type: PreferredTerm
modified: 2013-04-23T00:00:00+02:00
created: 2011-09-01T00:00:00+02:00
status: 1

funerary building
type: PreferredTerm
modified: 2013-04-23T00:00:00+02:00
created: 2011-09-01T00:00:00+02:00
status: 1

édifices et édicules funéraires
type: PreferredTerm
modified: 2013-04-23T00:00:00+02:00
created: 2011-09-01T00:00:00+02:00
status: 1

terrasse en terre-plein
type: PreferredTerm
modified: 2014-12-31T11:27:06+01:00
created: 2011-09-01T00:00:00+02:00
status: 1

usine d'impression sur papier
type: PreferredTerm
modified: 2013-04-23T00:00:00+02:00
created: 2011-09-01T00:00:00+02:00
status: 1

industrial housings
type: PreferredTerm
modified: 2015-01-09T11:22:17+01:00
created: 2011-09-01T00:00:00+02:00
status: 1

worker's village
type: PreferredTerm
modified: 2015-01-09T11:22:17+01:00
created: 2011-09-01T00:00:00+02:00
status: 1

cité ouvrière
type: PreferredTerm
modified: 2015-01-09T11:22:17+01:00
created: 2011-09-01T00:00:00+02:00
status: 1

città operaia + quartiere operaio
type: PreferredTerm
modified: 2015-01-09T11:22:17+01:00
created: 2011-09-01T00:00:00+02:00
status: 1

plâtrière
type: PreferredTerm
modified: 2015-02-03T11:48:45+01:00
created: 2011-09-01T00:00:00+02:00
status: 1

local du comité d'entreprise
type: PreferredTerm
modified: 2015-04-30T17:03:32+02:00
created: 2011-09-01T00:00:00+02:00
status: 1

bureau de bienfaisance
type: SimpleNonPreferredTerm
modified: 2015-01-02T11:33:51+01:00
created: 2011-09-01T00:00:00+02:00
status: 1

établissement de bienfaisance
type: PreferredTerm
modified: 2015-01-02T11:33:51+01:00
created: 2011-09-01T00:00:00+02:00
status: 1

établissement de charité
type: SimpleNonPreferredTerm
modified: 2015-01-02T11:33:51+01:00
created: 2011-09-01T00:00:00+02:00
status: 1

maison de charité
type: SimpleNonPreferredTerm
modified: 2015-01-02T11:33:51+01:00
created: 2011-09-01T00:00:00+02:00
status: 1

usine de taillanderie
type: PreferredTerm
modified: 2015-04-29T14:34:15+02:00
created: 2011-09-01T00:00:00+02:00
status: 1

espace libre
type: PreferredTerm
modified: 2014-09-24T11:29:08+02:00
created: 2011-09-01T00:00:00+02:00
status: 1

voirie
type: SimpleNonPreferredTerm
modified: 2014-09-24T11:29:08+02:00
created: 2011-09-01T00:00:00+02:00
status: 1

urban spaces
type: PreferredTerm
modified: 2014-09-24T11:29:08+02:00
created: 2011-09-01T00:00:00+02:00
status: 1

parish church
type: PreferredTerm
modified: 2014-11-27T16:31:25+01:00
created: 2011-09-01T00:00:00+02:00
status: 1

église paroissiale
type: PreferredTerm
modified: 2014-11-27T16:31:25+01:00
created: 2011-09-01T00:00:00+02:00
status: 1

chiesa parrocchiale
type: PreferredTerm
modified: 2014-11-27T16:31:25+01:00
created: 2011-09-01T00:00:00+02:00
status: 1

parish churches
type: PreferredTerm
modified: 2014-11-27T16:31:25+01:00
created: 2011-09-01T00:00:00+02:00
status: 1

usine liée au travail de la corne
type: PreferredTerm
modified: 2015-04-28T16:56:07+02:00
created: 2011-09-01T00:00:00+02:00
status: 1

chute d'eau
type: PreferredTerm
modified: 2014-12-30T16:57:35+01:00
created: 2011-09-01T00:00:00+02:00
status: 1

pas japonais
type: PreferredTerm
modified: 2014-09-30T12:55:51+02:00
created: 2011-09-01T00:00:00+02:00
status: 1

parterre de carrés
type: PreferredTerm
modified: 2014-10-14T10:58:53+02:00
created: 2011-09-01T00:00:00+02:00
status: 1

édifice agricole
type: PreferredTerm
modified: 2014-09-02T16:59:42+02:00
created: 2011-09-01T00:00:00+02:00
status: 1

plate-forme multimodale
type: PreferredTerm
modified: 2014-10-16T14:19:26+02:00
created: 2011-09-01T00:00:00+02:00
status: 1

magasin de commerce
type: PreferredTerm
modified: 2014-10-06T13:25:50+02:00
created: 2011-09-01T00:00:00+02:00
status: 1

siège de presse
type: PreferredTerm
modified: 2014-12-19T10:33:36+01:00
created: 2011-09-01T00:00:00+02:00
status: 1

bourse du travail
type: PreferredTerm
modified: 2014-12-12T10:45:55+01:00
created: 2011-09-01T00:00:00+02:00
status: 1

grange
type: PreferredTerm
modified: 2014-12-30T14:32:07+01:00
created: 2011-09-01T00:00:00+02:00
status: 1

imprimerie
type: PreferredTerm
modified: 2015-01-23T12:17:30+01:00
created: 2011-09-01T00:00:00+02:00
status: 1

temple
type: PreferredTerm
modified: 2014-11-27T16:46:17+01:00
created: 2011-09-01T00:00:00+02:00
status: 1

protestant + churches
type: PreferredTerm
modified: 2014-11-27T16:46:17+01:00
created: 2011-09-01T00:00:00+02:00
status: 1

chiesa protestante
type: PreferredTerm
modified: 2014-11-27T16:46:17+01:00
created: 2011-09-01T00:00:00+02:00
status: 1

protestant church
type: PreferredTerm
modified: 2014-11-27T16:46:17+01:00
created: 2011-09-01T00:00:00+02:00
status: 1

temple protestant
type: SimpleNonPreferredTerm
modified: 2014-11-27T16:46:17+01:00
created: 2011-09-01T00:00:00+02:00
status: 1

nécropole
type: PreferredTerm
modified: 2014-10-15T13:17:44+02:00
created: 2011-09-01T00:00:00+02:00
status: 1

cemetery 2
type: PreferredTerm
modified: 2014-10-15T13:17:44+02:00
created: 2011-09-01T00:00:00+02:00
status: 1

vallon artificiel
type: PreferredTerm
modified: 2014-10-22T12:18:02+02:00
created: 2011-09-01T00:00:00+02:00
status: 1

moulin à blé
type: PreferredTerm
modified: 2015-04-29T15:12:32+02:00
created: 2011-09-01T00:00:00+02:00
status: 1

réseau télégraphique
type: PreferredTerm
modified: 2014-10-17T10:03:17+02:00
created: 2011-09-01T00:00:00+02:00
status: 1

moulin à farine
type: PreferredTerm
modified: 2015-01-19T16:28:38+01:00
created: 2011-09-01T00:00:00+02:00
status: 1

couvert de jardin
type: PreferredTerm
modified: 2014-10-14T10:44:04+02:00
created: 2011-09-01T00:00:00+02:00
status: 1

usine de matériel électroacoustique
type: PreferredTerm
modified: 2015-01-28T15:12:30+01:00
created: 2011-09-01T00:00:00+02:00
status: 1

bûcher
type: PreferredTerm
modified: 2014-12-31T15:35:01+01:00
created: 2011-09-01T00:00:00+02:00
status: 1

séchoir à bois
type: SimpleNonPreferredTerm
modified: 2014-12-31T15:35:01+01:00
created: 2011-09-01T00:00:00+02:00
status: 1

usine de traitement des corps gras
type: PreferredTerm
modified: 2015-02-12T12:49:10+01:00
created: 2011-09-01T00:00:00+02:00
status: 1

fabrique en belvédère
type: PreferredTerm
modified: 2014-12-30T15:30:20+01:00
created: 2011-09-01T00:00:00+02:00
status: 1

fontaine
type: PreferredTerm
modified: 2015-02-24T15:39:06+01:00
created: 2011-09-01T00:00:00+02:00
status: 1

fontaine monumentale
type: SimpleNonPreferredTerm
modified: 2015-02-24T15:39:06+01:00
created: 2011-09-01T00:00:00+02:00
status: 1

isolato
type: PreferredTerm
modified: 2015-01-08T10:36:54+01:00
created: 2011-09-01T00:00:00+02:00
status: 1

city blocks
type: PreferredTerm
modified: 2015-01-08T10:36:54+01:00
created: 2011-09-01T00:00:00+02:00
status: 1

îlot
type: PreferredTerm
modified: 2015-01-08T10:36:54+01:00
created: 2011-09-01T00:00:00+02:00
status: 1

mine à ciel ouvert
type: PreferredTerm
modified: 2015-01-21T15:39:13+01:00
created: 2011-09-01T00:00:00+02:00
status: 1

intendance
type: PreferredTerm
modified: 2014-12-05T12:22:39+01:00
created: 2011-09-01T00:00:00+02:00
status: 1

magnanerie
type: PreferredTerm
modified: 2014-12-30T13:56:25+01:00
created: 2011-09-01T00:00:00+02:00
status: 1

usine de boutons
type: PreferredTerm
modified: 2014-11-17T14:51:33+01:00
created: 2011-09-01T00:00:00+02:00
status: 1

cadole
type: SimpleNonPreferredTerm
modified: 2014-12-31T12:03:19+01:00
created: 2011-09-01T00:00:00+02:00
status: 1

hutte
type: SimpleNonPreferredTerm
modified: 2014-12-31T12:03:19+01:00
created: 2011-09-01T00:00:00+02:00
status: 1

orry
type: SimpleNonPreferredTerm
modified: 2014-12-31T12:03:19+01:00
created: 2011-09-01T00:00:00+02:00
status: 1

chibotte
type: SimpleNonPreferredTerm
modified: 2014-12-31T12:03:19+01:00
created: 2011-09-01T00:00:00+02:00
status: 1

cabane
type: PreferredTerm
modified: 2014-12-31T12:03:19+01:00
created: 2011-09-01T00:00:00+02:00
status: 1

borie
type: SimpleNonPreferredTerm
modified: 2014-12-31T12:03:19+01:00
created: 2011-09-01T00:00:00+02:00
status: 1

planning
type: PreferredTerm
modified: 2013-04-23T00:00:00+02:00
created: 2011-09-01T00:00:00+02:00
status: 1

urbanisme et espaces aménagés
type: PreferredTerm
modified: 2013-04-23T00:00:00+02:00
created: 2011-09-01T00:00:00+02:00
status: 1

sanatorium
type: PreferredTerm
modified: 2015-01-02T12:13:56+01:00
created: 2011-09-01T00:00:00+02:00
status: 1

siège de parti politique
type: PreferredTerm
modified: 2014-10-17T15:34:49+02:00
created: 2011-09-01T00:00:00+02:00
status: 1

galerie
type: PreferredTerm
modified: 2015-02-26T11:06:42+01:00
created: 2011-09-01T00:00:00+02:00
status: 1

usine d'impression sur étoffes
type: PreferredTerm
modified: 2015-04-30T15:42:53+02:00
created: 2011-09-01T00:00:00+02:00
status: 1

porte
type: PreferredTerm
modified: 2015-02-24T16:50:20+01:00
created: 2011-09-01T00:00:00+02:00
status: 1

usine de tabac
type: PreferredTerm
modified: 2015-02-06T11:44:48+01:00
created: 2011-09-01T00:00:00+02:00
status: 1

carrefour en étoile
type: PreferredTerm
modified: 2014-11-18T12:39:52+01:00
created: 2011-09-01T00:00:00+02:00
status: 1

usine de serrurerie
type: PreferredTerm
modified: 2014-12-16T15:31:26+01:00
created: 2011-09-01T00:00:00+02:00
status: 1

minoterie
type: PreferredTerm
modified: 2015-04-29T15:07:56+02:00
created: 2011-09-01T00:00:00+02:00
status: 1

savonnerie
type: PreferredTerm
modified: 2015-04-29T16:52:34+02:00
created: 2011-09-01T00:00:00+02:00
status: 1

alignement d'arbres
type: PreferredTerm
modified: 2014-12-30T16:14:56+01:00
created: 2011-09-01T00:00:00+02:00
status: 1

quartier
type: PreferredTerm
modified: 2015-01-08T10:46:20+01:00
created: 2011-09-01T00:00:00+02:00
status: 1

town quarter
type: PreferredTerm
modified: 2015-01-08T10:46:20+01:00
created: 2011-09-01T00:00:00+02:00
status: 1

quarters
type: PreferredTerm
modified: 2015-01-08T10:46:20+01:00
created: 2011-09-01T00:00:00+02:00
status: 1

circoscrizione
type: PreferredTerm
modified: 2015-01-08T10:46:20+01:00
created: 2011-09-01T00:00:00+02:00
status: 1

usine de préparation de produit minéral
type: PreferredTerm
modified: 2015-01-21T16:44:30+01:00
created: 2011-09-01T00:00:00+02:00
status: 1

usine de composants électroniques
type: PreferredTerm
modified: 2015-01-28T14:56:21+01:00
created: 2011-09-01T00:00:00+02:00
status: 1

usine de dentelle mécanique
type: PreferredTerm
modified: 2015-04-30T15:47:11+02:00
created: 2011-09-01T00:00:00+02:00
status: 1

partie d'édifice agricole
type: PreferredTerm
modified: 2014-09-02T17:16:32+02:00
created: 2011-09-01T00:00:00+02:00
status: 1

usine de cellulose
type: PreferredTerm
modified: 2015-04-28T16:27:10+02:00
created: 2011-09-01T00:00:00+02:00
status: 1

grotte artificielle
type: PreferredTerm
modified: 2014-12-30T15:32:01+01:00
created: 2011-09-01T00:00:00+02:00
status: 1

grotte de jardin
type: SimpleNonPreferredTerm
modified: 2014-12-30T15:32:01+01:00
created: 2011-09-01T00:00:00+02:00
status: 1

ministère
type: PreferredTerm
modified: 2014-10-09T12:10:31+02:00
created: 2011-09-01T00:00:00+02:00
status: 1

habitat
type: SimpleNonPreferredTerm
modified: 2015-01-07T11:52:24+01:00
created: 2011-09-01T00:00:00+02:00
status: 1

settlement
type: PreferredTerm
modified: 2015-01-07T11:52:24+01:00
created: 2011-09-01T00:00:00+02:00
status: 1

ensemble urbain
type: SimpleNonPreferredTerm
modified: 2015-01-07T11:52:24+01:00
created: 2011-09-01T00:00:00+02:00
status: 1

agglomération
type: PreferredTerm
modified: 2015-01-07T11:52:24+01:00
created: 2011-09-01T00:00:00+02:00
status: 1

usine de ganterie
type: PreferredTerm
modified: 2015-04-28T14:37:03+02:00
created: 2011-09-01T00:00:00+02:00
status: 1

usine de quincaillerie
type: PreferredTerm
modified: 2014-12-15T15:59:13+01:00
created: 2011-09-01T00:00:00+02:00
status: 1

abri troglodytique
type: PreferredTerm
modified: 2014-12-31T11:31:42+01:00
created: 2011-09-01T00:00:00+02:00
status: 1

buanderie
type: PreferredTerm
modified: 2014-12-31T15:33:40+01:00
created: 2011-09-01T00:00:00+02:00
status: 1

siège d'organisation internationale
type: PreferredTerm
modified: 2014-10-17T15:34:11+02:00
created: 2011-09-01T00:00:00+02:00
status: 1

aérium
type: SimpleNonPreferredTerm
modified: 2015-01-02T12:10:21+01:00
created: 2011-09-01T00:00:00+02:00
status: 1

préventorium
type: PreferredTerm
modified: 2015-01-02T12:10:21+01:00
created: 2011-09-01T00:00:00+02:00
status: 1

galerie fermée
type: PreferredTerm
modified: 2015-02-26T11:07:57+01:00
created: 2011-09-01T00:00:00+02:00
status: 1

bureau d'entreprise
type: PreferredTerm
modified: 2015-03-25T15:03:39+01:00
created: 2011-09-01T00:00:00+02:00
status: 1

niche
type: PreferredTerm
modified: 2015-02-24T16:49:09+01:00
created: 2011-09-01T00:00:00+02:00
status: 1

usine de produits pour l'alimentation animale
type: PreferredTerm
modified: 2015-02-06T11:23:36+01:00
created: 2011-09-01T00:00:00+02:00
status: 1

carrefour en trident
type: SimpleNonPreferredTerm
modified: 2014-10-17T14:32:01+02:00
created: 2011-09-01T00:00:00+02:00
status: 1

carrefour en patte d'oie
type: PreferredTerm
modified: 2014-10-17T14:32:01+02:00
created: 2011-09-01T00:00:00+02:00
status: 1

arbre isolé
type: PreferredTerm
modified: 2014-12-30T16:16:36+01:00
created: 2011-09-01T00:00:00+02:00
status: 1

arbre de la liberté
type: SimpleNonPreferredTerm
modified: 2014-12-30T16:16:36+01:00
created: 2011-09-01T00:00:00+02:00
status: 1

ensemble d'édifices derrière façade
type: PreferredTerm
modified: 2015-01-08T10:28:54+01:00
created: 2011-09-01T00:00:00+02:00
status: 1

funerary site
type: PreferredTerm
modified: 2013-04-23T00:00:00+02:00
created: 2011-09-01T00:00:00+02:00
status: 1

ensemble funéraire
type: PreferredTerm
modified: 2013-04-23T00:00:00+02:00
created: 2011-09-01T00:00:00+02:00
status: 1

funerary buildings + complexes
type: PreferredTerm
modified: 2013-04-23T00:00:00+02:00
created: 2011-09-01T00:00:00+02:00
status: 1

laiterie industrielle
type: PreferredTerm
modified: 2015-01-19T12:50:34+01:00
created: 2011-09-01T00:00:00+02:00
status: 1

grange monastique
type: PreferredTerm
modified: 2014-12-30T13:49:45+01:00
created: 2011-09-01T00:00:00+02:00
status: 1

marais salant
type: PreferredTerm
modified: 2015-01-15T16:45:57+01:00
created: 2011-09-01T00:00:00+02:00
status: 1

kiosque de jardin
type: SimpleNonPreferredTerm
modified: 2014-12-30T15:33:50+01:00
created: 2011-09-01T00:00:00+02:00
status: 1

kiosque à musique
type: SimpleNonPreferredTerm
modified: 2014-12-30T15:33:50+01:00
created: 2011-09-01T00:00:00+02:00
status: 1

kiosque
type: PreferredTerm
modified: 2014-12-30T15:33:50+01:00
created: 2011-09-01T00:00:00+02:00
status: 1

grenier public
type: PreferredTerm
modified: 2014-12-05T12:20:26+01:00
created: 2011-09-01T00:00:00+02:00
status: 1

usine de chaussures
type: PreferredTerm
modified: 2015-04-28T14:31:56+02:00
created: 2011-09-01T00:00:00+02:00
status: 1

pont aqueduc
type: PreferredTerm
modified: 2014-12-02T12:37:06+01:00
created: 2011-09-01T00:00:00+02:00
status: 1

usine de construction électronique
type: PreferredTerm
modified: 2015-04-28T15:14:23+02:00
created: 2011-09-01T00:00:00+02:00
status: 1

usine de produits phytosanitaires
type: PreferredTerm
modified: 2015-04-29T16:36:35+02:00
created: 2011-09-01T00:00:00+02:00
status: 1

usine de produit textile non tissé
type: PreferredTerm
modified: 2015-04-30T15:51:27+02:00
created: 2011-09-01T00:00:00+02:00
status: 1

porte cochère
type: PreferredTerm
modified: 2015-02-25T11:24:09+01:00
created: 2011-09-01T00:00:00+02:00
status: 1

baile
type: SimpleNonPreferredTerm
modified: 2014-12-31T15:32:08+01:00
created: 2011-09-01T00:00:00+02:00
status: 1

basse-cour
type: PreferredTerm
modified: 2014-12-31T15:32:08+01:00
created: 2011-09-01T00:00:00+02:00
status: 1

siège de corporation
type: PreferredTerm
modified: 2014-12-12T10:52:57+01:00
created: 2011-09-01T00:00:00+02:00
status: 1

galerie ouverte
type: PreferredTerm
modified: 2015-02-26T11:09:31+01:00
created: 2011-09-01T00:00:00+02:00
status: 1

usine de ferblanterie
type: PreferredTerm
modified: 2015-04-29T14:31:18+02:00
created: 2011-09-01T00:00:00+02:00
status: 1

usine de sélection de semences
type: PreferredTerm
modified: 2015-04-29T15:41:40+02:00
created: 2011-09-01T00:00:00+02:00
status: 1

trilite
type: PreferredTerm
modified: 2015-02-24T16:22:06+01:00
created: 2011-09-01T00:00:00+02:00
status: 1

trilithons
type: PreferredTerm
modified: 2015-02-24T16:22:06+01:00
created: 2011-09-01T00:00:00+02:00
status: 1

trilithon
type: PreferredTerm
modified: 2015-02-24T16:22:06+01:00
created: 2011-09-01T00:00:00+02:00
status: 1

trilithe
type: PreferredTerm
modified: 2015-02-24T16:22:06+01:00
created: 2011-09-01T00:00:00+02:00
status: 1

lichaven
type: SimpleNonPreferredTerm
modified: 2015-02-24T16:22:06+01:00
created: 2011-09-01T00:00:00+02:00
status: 1

carrefour en demi-étoile
type: PreferredTerm
modified: 2014-10-17T14:30:20+02:00
created: 2011-09-01T00:00:00+02:00
status: 1

huilerie
type: PreferredTerm
modified: 2015-01-19T12:24:29+01:00
created: 2011-09-01T00:00:00+02:00
status: 1

front de mer
type: SimpleNonPreferredTerm
modified: 2015-01-08T10:34:31+01:00
created: 2011-09-01T00:00:00+02:00
status: 1

front bâti
type: PreferredTerm
modified: 2015-01-08T10:34:31+01:00
created: 2011-09-01T00:00:00+02:00
status: 1

bocage de jardin
type: PreferredTerm
modified: 2014-10-14T10:38:12+02:00
created: 2011-09-01T00:00:00+02:00
status: 1

screen
type: PreferredTerm
modified: 2014-10-23T10:57:43+02:00
created: 2011-09-01T00:00:00+02:00
status: 1

parcloses
type: PreferredTerm
modified: 2014-10-23T10:57:43+02:00
created: 2011-09-01T00:00:00+02:00
status: 1

clôture de chapelle
type: PreferredTerm
modified: 2014-10-23T10:57:43+02:00
created: 2011-09-01T00:00:00+02:00
status: 1

balaustrata della cappella
type: PreferredTerm
modified: 2014-10-23T10:57:43+02:00
created: 2011-09-01T00:00:00+02:00
status: 1

établissement administratif
type: PreferredTerm
modified: 2014-09-05T11:12:26+02:00
created: 2011-09-01T00:00:00+02:00
status: 1

service administratif
type: SimpleNonPreferredTerm
modified: 2014-09-05T11:12:26+02:00
created: 2011-09-01T00:00:00+02:00
status: 1

mine
type: PreferredTerm
modified: 2015-04-28T14:17:56+02:00
created: 2011-09-01T00:00:00+02:00
status: 1

haras
type: PreferredTerm
modified: 2014-12-30T13:54:21+01:00
created: 2011-09-01T00:00:00+02:00
status: 1

usine de petit matériel électrique
type: PreferredTerm
modified: 2015-04-28T15:11:05+02:00
created: 2011-09-01T00:00:00+02:00
status: 1

pergola
type: PreferredTerm
modified: 2014-12-30T15:35:14+01:00
created: 2011-09-01T00:00:00+02:00
status: 1

buffet d'eau
type: PreferredTerm
modified: 2014-10-15T12:29:45+02:00
created: 2011-09-01T00:00:00+02:00
status: 1

usine de soufre
type: PreferredTerm
modified: 2015-04-29T16:39:06+02:00
created: 2011-09-01T00:00:00+02:00
status: 1

usine de préparation de produits textiles
type: PreferredTerm
modified: 2015-03-19T17:04:02+01:00
created: 2011-09-01T00:00:00+02:00
status: 1

fontaine de dévotion
type: PreferredTerm
modified: 2015-02-24T12:05:26+01:00
created: 2011-09-01T00:00:00+02:00
status: 1

usine de décolletage
type: PreferredTerm
modified: 2014-12-15T12:53:43+01:00
created: 2011-09-01T00:00:00+02:00
status: 1

jardin public
type: PreferredTerm
modified: 2014-12-31T10:39:14+01:00
created: 2011-09-01T00:00:00+02:00
status: 1

maison du peuple
type: PreferredTerm
modified: 2014-10-09T12:52:56+02:00
created: 2011-09-01T00:00:00+02:00
status: 1

portique
type: PreferredTerm
modified: 2015-02-26T11:12:16+01:00
created: 2011-09-01T00:00:00+02:00
status: 1

usine de chapellerie
type: PreferredTerm
modified: 2015-01-22T11:45:40+01:00
created: 2011-09-01T00:00:00+02:00
status: 1

râperie
type: PreferredTerm
modified: 2015-02-04T16:23:22+01:00
created: 2011-09-01T00:00:00+02:00
status: 1

échangeur
type: PreferredTerm
modified: 2014-10-17T14:34:19+02:00
created: 2011-09-01T00:00:00+02:00
status: 1

reposoir
type: PreferredTerm
modified: 2014-11-27T15:23:35+01:00
created: 2011-09-01T00:00:00+02:00
status: 1

portail
type: PreferredTerm
modified: 2015-02-24T16:53:32+01:00
created: 2011-09-01T00:00:00+02:00
status: 1

remise de la pompe à incendie
type: SimpleNonPreferredTerm
modified: 2014-12-05T12:15:14+01:00
created: 2011-09-01T00:00:00+02:00
status: 1

remise de matériel d'incendie
type: PreferredTerm
modified: 2014-12-05T12:15:14+01:00
created: 2011-09-01T00:00:00+02:00
status: 1

remise de pompiers
type: SimpleNonPreferredTerm
modified: 2014-12-05T12:15:14+01:00
created: 2011-09-01T00:00:00+02:00
status: 1

tour
type: PreferredTerm
modified: 2015-02-26T12:18:46+01:00
created: 2011-09-01T00:00:00+02:00
status: 1

saline
type: PreferredTerm
modified: 2015-01-21T16:00:51+01:00
created: 2011-09-01T00:00:00+02:00
status: 1

hourd
type: PreferredTerm
modified: 2015-01-05T12:55:12+01:00
created: 2011-09-01T00:00:00+02:00
status: 1

usine de parapluies et cannes
type: PreferredTerm
modified: 2014-11-17T14:31:32+01:00
created: 2011-09-01T00:00:00+02:00
status: 1

logement
type: PreferredTerm
modified: 2014-12-31T15:48:26+01:00
created: 2011-09-01T00:00:00+02:00
status: 1

pièce d'eau
type: PreferredTerm
modified: 2014-12-31T10:10:03+01:00
created: 2011-09-01T00:00:00+02:00
status: 1

recinto del coro
type: PreferredTerm
modified: 2015-03-09T11:11:12+01:00
created: 2011-09-01T00:00:00+02:00
status: 1

choir screen
type: PreferredTerm
modified: 2015-03-09T11:11:12+01:00
created: 2011-09-01T00:00:00+02:00
status: 1

chancel
type: SimpleNonPreferredTerm
modified: 2015-03-09T11:11:12+01:00
created: 2011-09-01T00:00:00+02:00
status: 1

clôture de chœur
type: SimpleNonPreferredTerm
modified: 2015-03-09T11:11:12+01:00
created: 2011-09-01T00:00:00+02:00
status: 1

choir screens
type: PreferredTerm
modified: 2015-03-09T11:11:12+01:00
created: 2011-09-01T00:00:00+02:00
status: 1

fromagerie industrielle
type: PreferredTerm
modified: 2015-04-29T14:56:27+02:00
created: 2011-09-01T00:00:00+02:00
status: 1

usine de détergents
type: PreferredTerm
modified: 2015-02-18T12:33:31+01:00
created: 2011-09-01T00:00:00+02:00
status: 1

ensemble d'édifices à cour commune
type: PreferredTerm
modified: 2015-01-08T10:25:32+01:00
created: 2011-09-01T00:00:00+02:00
status: 1

blanchisserie
type: PreferredTerm
modified: 2014-10-09T11:24:15+02:00
created: 2011-09-01T00:00:00+02:00
status: 1

parties artisanales
type: PreferredTerm
modified: 2013-04-23T00:00:00+02:00
created: 2011-09-01T00:00:00+02:00
status: 1

partie d'édifice artisanal
type: SimpleNonPreferredTerm
modified: 2013-04-23T00:00:00+02:00
created: 2011-09-01T00:00:00+02:00
status: 1

cairns
type: PreferredTerm
modified: 2015-02-24T16:24:50+01:00
created: 2011-09-01T00:00:00+02:00
status: 1

galgal
type: PreferredTerm
modified: 2015-02-24T16:24:50+01:00
created: 2011-09-01T00:00:00+02:00
status: 1

galgal
type: SimpleNonPreferredTerm
modified: 2015-02-24T16:24:50+01:00
created: 2011-09-01T00:00:00+02:00
status: 1

cairn
type: PreferredTerm
modified: 2015-02-24T16:24:50+01:00
created: 2011-09-01T00:00:00+02:00
status: 1

burial cairn
type: PreferredTerm
modified: 2015-02-24T16:24:50+01:00
created: 2011-09-01T00:00:00+02:00
status: 1

bâtiment de recette
type: PreferredTerm
modified: 2015-04-30T16:38:01+02:00
created: 2011-09-01T00:00:00+02:00
status: 1

hôpital marin
type: PreferredTerm
modified: 2015-01-02T12:03:04+01:00
created: 2011-09-01T00:00:00+02:00
status: 1

usine de chaudronnerie
type: PreferredTerm
modified: 2014-12-15T12:34:33+01:00
created: 2011-09-01T00:00:00+02:00
status: 1

square
type: PreferredTerm
modified: 2014-12-31T10:41:59+01:00
created: 2011-09-01T00:00:00+02:00
status: 1

logette
type: PreferredTerm
modified: 2015-02-26T11:20:29+01:00
created: 2011-09-01T00:00:00+02:00
status: 1

cabane de jardin
type: PreferredTerm
modified: 2014-12-30T15:23:27+01:00
created: 2011-09-01T00:00:00+02:00
status: 1

frazione
type: PreferredTerm
modified: 2015-01-07T11:30:26+01:00
created: 2011-09-01T00:00:00+02:00
status: 1

écart
type: PreferredTerm
modified: 2015-01-07T11:30:26+01:00
created: 2011-09-01T00:00:00+02:00
status: 1

hamlets
type: PreferredTerm
modified: 2015-01-07T11:30:26+01:00
created: 2011-09-01T00:00:00+02:00
status: 1

hamlet
type: PreferredTerm
modified: 2015-01-07T11:30:26+01:00
created: 2011-09-01T00:00:00+02:00
status: 1

lieu-dit
type: SimpleNonPreferredTerm
modified: 2015-01-07T11:30:26+01:00
created: 2011-09-01T00:00:00+02:00
status: 1

hameau
type: SimpleNonPreferredTerm
modified: 2015-01-07T11:30:26+01:00
created: 2011-09-01T00:00:00+02:00
status: 1

corderie
type: PreferredTerm
modified: 2015-03-18T10:28:20+01:00
created: 2011-09-01T00:00:00+02:00
status: 1

écurie
type: PreferredTerm
modified: 2014-12-31T15:42:17+01:00
created: 2011-09-01T00:00:00+02:00
status: 1

colonnade de jardin
type: PreferredTerm
modified: 2014-10-14T10:19:07+02:00
created: 2011-09-01T00:00:00+02:00
status: 1

motte
type: PreferredTerm
modified: 2015-01-05T12:57:45+01:00
created: 2011-09-01T00:00:00+02:00
status: 1

entrepôt public
type: PreferredTerm
modified: 2014-12-05T12:19:27+01:00
created: 2011-09-01T00:00:00+02:00
status: 1

tourelle
type: PreferredTerm
modified: 2015-02-26T12:21:03+01:00
created: 2011-09-01T00:00:00+02:00
status: 1

usine de confection
type: PreferredTerm
modified: 2015-01-23T11:17:09+01:00
created: 2011-09-01T00:00:00+02:00
status: 1

naumachie
type: PreferredTerm
modified: 2014-12-30T17:11:10+01:00
created: 2011-09-01T00:00:00+02:00
status: 1

iconostasi
type: PreferredTerm
modified: 2014-10-15T17:24:04+02:00
created: 2011-09-01T00:00:00+02:00
status: 1

iconostases
type: PreferredTerm
modified: 2014-10-15T17:24:04+02:00
created: 2011-09-01T00:00:00+02:00
status: 1

iconostasis
type: PreferredTerm
modified: 2014-10-15T17:24:04+02:00
created: 2011-09-01T00:00:00+02:00
status: 1

iconostase
type: PreferredTerm
modified: 2014-10-15T17:24:04+02:00
created: 2011-09-01T00:00:00+02:00
status: 1

usine d'ouvrages en amiante
type: PreferredTerm
modified: 2013-04-23T00:00:00+02:00
created: 2011-09-01T00:00:00+02:00
status: 1

banque
type: PreferredTerm
modified: 2014-12-04T15:10:17+01:00
created: 2011-09-01T00:00:00+02:00
status: 1

féculerie
type: PreferredTerm
modified: 2015-01-15T15:21:14+01:00
created: 2011-09-01T00:00:00+02:00
status: 1

ensemble d'édifices à desserte commune
type: PreferredTerm
modified: 2013-04-23T00:00:00+02:00
created: 2011-09-01T00:00:00+02:00
status: 1

parties commerciales
type: PreferredTerm
modified: 2013-04-23T00:00:00+02:00
created: 2011-09-01T00:00:00+02:00
status: 1

partie d'édifice commercial
type: SimpleNonPreferredTerm
modified: 2013-04-23T00:00:00+02:00
created: 2011-09-01T00:00:00+02:00
status: 1

salle des coffres
type: Concept
modified: 2014-10-06T15:52:37+02:00
in scheme: Thésaurus de la désignation des œuvres architecturales et des espaces aménagés
preferred label: vaults (strong rooms) @en-us
broader: parties commerciales
created: 2013-10-15T18:28:30+02:00
related: banque de France
related: caisse d'épargne
definition: Partie ou pièce, le plus souvent blindée, d'un établissement bancaire où sont installés les coffres forts des clients et de l’institution.
TermeAssocie: banque de France
TermeAssocie: caisse d'épargne
status: 1

blanchisserie industrielle
type: PreferredTerm
modified: 2015-04-30T15:29:19+02:00
created: 2011-09-01T00:00:00+02:00
status: 1

dolmen sous tumulus
type: SimpleNonPreferredTerm
modified: 2015-02-24T16:23:16+01:00
created: 2011-09-01T00:00:00+02:00
status: 1

barrow
type: SimpleNonPreferredTerm
modified: 2015-02-24T16:23:16+01:00
created: 2011-09-01T00:00:00+02:00
status: 1

barrow
type: PreferredTerm
modified: 2015-02-24T16:23:16+01:00
created: 2011-09-01T00:00:00+02:00
status: 1

tumulo
type: PreferredTerm
modified: 2015-02-24T16:23:16+01:00
created: 2011-09-01T00:00:00+02:00
status: 1

tumulus
type: PreferredTerm
modified: 2015-02-24T16:23:16+01:00
created: 2011-09-01T00:00:00+02:00
status: 1

montissel
type: SimpleNonPreferredTerm
modified: 2015-02-24T16:23:16+01:00
created: 2011-09-01T00:00:00+02:00
status: 1

burial mounds
type: PreferredTerm
modified: 2015-02-24T16:23:16+01:00
created: 2011-09-01T00:00:00+02:00
status: 1

hôpital d'isolement
type: PreferredTerm
modified: 2014-10-20T10:06:14+02:00
created: 2011-09-01T00:00:00+02:00
status: 1

loggia
type: PreferredTerm
modified: 2015-02-26T11:25:14+01:00
created: 2011-09-01T00:00:00+02:00
status: 1

bâtiment de la soufflerie
type: PreferredTerm
modified: 2015-03-25T16:30:58+01:00
created: 2011-09-01T00:00:00+02:00
status: 1

jardin de collection
type: SimpleNonPreferredTerm
modified: 2014-12-31T10:26:47+01:00
created: 2011-09-01T00:00:00+02:00
status: 1

arboretum
type: SimpleNonPreferredTerm
modified: 2014-12-31T10:26:47+01:00
created: 2011-09-01T00:00:00+02:00
status: 1

jardin botanique
type: PreferredTerm
modified: 2014-12-31T10:26:47+01:00
created: 2011-09-01T00:00:00+02:00
status: 1

usine de taille de matériaux de construction
type: PreferredTerm
modified: 2015-01-21T16:43:19+01:00
created: 2011-09-01T00:00:00+02:00
status: 1

cité lacustre
type: SimpleNonPreferredTerm
modified: 2015-01-07T11:31:25+01:00
created: 2011-09-01T00:00:00+02:00
status: 1

lake village
type: PreferredTerm
modified: 2015-01-07T11:31:25+01:00
created: 2011-09-01T00:00:00+02:00
status: 1

palafitta
type: PreferredTerm
modified: 2015-01-07T11:31:25+01:00
created: 2011-09-01T00:00:00+02:00
status: 1

palafitte
type: PreferredTerm
modified: 2015-01-07T11:31:25+01:00
created: 2011-09-01T00:00:00+02:00
status: 1

lake dwelings
type: PreferredTerm
modified: 2015-01-07T11:31:25+01:00
created: 2011-09-01T00:00:00+02:00
status: 1

fabrique
type: SimpleNonPreferredTerm
modified: 2014-12-30T15:50:28+01:00
created: 2011-09-01T00:00:00+02:00
status: 1

fabrique de jardin
type: PreferredTerm
modified: 2014-12-30T15:50:28+01:00
created: 2011-09-01T00:00:00+02:00
status: 1

robinetterie
type: PreferredTerm
modified: 2014-12-15T11:56:04+01:00
created: 2011-09-01T00:00:00+02:00
status: 1

fossé
type: PreferredTerm
modified: 2015-01-05T12:51:43+01:00
created: 2011-09-01T00:00:00+02:00
status: 1

usine de broderie mécanique
type: PreferredTerm
modified: 2015-03-19T12:55:41+01:00
created: 2011-09-01T00:00:00+02:00
status: 1

abreuvoir
type: PreferredTerm
modified: 2014-12-30T14:11:06+01:00
created: 2011-09-01T00:00:00+02:00
status: 1

vaisseau
type: PreferredTerm
modified: 2015-02-26T12:24:37+01:00
created: 2011-09-01T00:00:00+02:00
status: 1

brosserie
type: PreferredTerm
modified: 2015-03-11T11:49:50+01:00
created: 2011-09-01T00:00:00+02:00
status: 1

puits de gaz naturel
type: PreferredTerm
modified: 2014-09-23T16:06:18+02:00
created: 2011-09-01T00:00:00+02:00
status: 1

chenil
type: PreferredTerm
modified: 2014-12-31T15:39:03+01:00
created: 2011-09-01T00:00:00+02:00
status: 1

fabrique de treillage
type: PreferredTerm
modified: 2014-12-30T15:25:41+01:00
created: 2011-09-01T00:00:00+02:00
status: 1

auberge
type: PreferredTerm
modified: 2014-12-04T15:08:53+01:00
created: 2011-09-01T00:00:00+02:00
status: 1

rood screen
type: PreferredTerm
modified: 2015-03-09T11:12:45+01:00
created: 2011-09-01T00:00:00+02:00
status: 1

chancel screens
type: PreferredTerm
modified: 2015-03-09T11:12:46+01:00
created: 2011-09-01T00:00:00+02:00
status: 1

jubé
type: PreferredTerm
modified: 2015-03-09T11:12:45+01:00
created: 2011-09-01T00:00:00+02:00
status: 1

pontile
type: PreferredTerm
modified: 2015-03-09T11:12:46+01:00
created: 2011-09-01T00:00:00+02:00
status: 1

stéarinerie
type: PreferredTerm
modified: 2013-04-23T00:00:00+02:00
created: 2011-09-01T00:00:00+02:00
status: 1

sobborgo
type: PreferredTerm
modified: 2015-01-08T10:15:47+01:00
created: 2011-09-01T00:00:00+02:00
status: 1

faubourg
type: PreferredTerm
modified: 2015-01-08T10:15:47+01:00
created: 2011-09-01T00:00:00+02:00
status: 1

suburb
type: PreferredTerm
modified: 2015-01-08T10:15:47+01:00
created: 2011-09-01T00:00:00+02:00
status: 1

suburbs
type: PreferredTerm
modified: 2015-01-08T10:15:47+01:00
created: 2011-09-01T00:00:00+02:00
status: 1

parloir
type: PreferredTerm
modified: 2015-02-26T11:27:40+01:00
created: 2011-09-01T00:00:00+02:00
status: 1

usine textile
type: PreferredTerm
modified: 2015-03-17T16:14:48+01:00
created: 2011-09-01T00:00:00+02:00
status: 1

polissoir
type: PreferredTerm
modified: 2014-12-04T14:49:51+01:00
created: 2011-09-01T00:00:00+02:00
status: 1

coutellerie
type: PreferredTerm
modified: 2014-12-15T11:35:36+01:00
created: 2011-09-01T00:00:00+02:00
status: 1

pressoir à huile
type: PreferredTerm
modified: 2014-12-30T14:46:15+01:00
created: 2011-09-01T00:00:00+02:00
status: 1

bâtiment d'eau
type: PreferredTerm
modified: 2015-04-09T15:22:51+02:00
created: 2011-09-01T00:00:00+02:00
status: 1

maladrerie
type: PreferredTerm
modified: 2015-01-02T12:07:12+01:00
created: 2011-09-01T00:00:00+02:00
status: 1

léproserie
type: SimpleNonPreferredTerm
modified: 2015-01-02T12:07:12+01:00
created: 2011-09-01T00:00:00+02:00
status: 1

jardin alpin
type: PreferredTerm
modified: 2014-12-31T10:29:05+01:00
created: 2011-09-01T00:00:00+02:00
status: 1

boroughs
type: PreferredTerm
modified: 2015-01-07T11:28:31+01:00
created: 2011-09-01T00:00:00+02:00
status: 1

burgh
type: PreferredTerm
modified: 2015-01-07T11:28:31+01:00
created: 2011-09-01T00:00:00+02:00
status: 1

bourg
type: PreferredTerm
modified: 2015-01-07T11:28:31+01:00
created: 2011-09-01T00:00:00+02:00
status: 1

borgo
type: PreferredTerm
modified: 2015-01-07T11:28:31+01:00
created: 2011-09-01T00:00:00+02:00
status: 1

mortuary
type: PreferredTerm
modified: 2015-02-24T16:27:09+01:00
created: 2011-09-01T00:00:00+02:00
status: 1

morgue
type: PreferredTerm
modified: 2015-02-24T16:27:09+01:00
created: 2011-09-01T00:00:00+02:00
status: 1

institut médicolégal
type: SimpleNonPreferredTerm
modified: 2015-02-24T16:27:09+01:00
created: 2011-09-01T00:00:00+02:00
status: 1

obitorio + camera mortuaria
type: PreferredTerm
modified: 2015-02-24T16:27:09+01:00
created: 2011-09-01T00:00:00+02:00
status: 1

usine liée au travail du bois
type: PreferredTerm
modified: 2015-03-11T12:06:21+01:00
created: 2011-09-01T00:00:00+02:00
status: 1

bassin
type: PreferredTerm
modified: 2014-12-31T10:13:46+01:00
created: 2011-09-01T00:00:00+02:00
status: 1

caserne de pompiers
type: PreferredTerm
modified: 2014-10-09T11:58:21+02:00
created: 2011-09-01T00:00:00+02:00
status: 1

usine de bonneterie
type: PreferredTerm
modified: 2015-03-19T12:36:06+01:00
created: 2011-09-01T00:00:00+02:00
status: 1

vestiaire
type: PreferredTerm
modified: 2015-02-26T12:31:22+01:00
created: 2011-09-01T00:00:00+02:00
status: 1

salle des pendus
type: SimpleNonPreferredTerm
modified: 2015-02-26T12:31:22+01:00
created: 2011-09-01T00:00:00+02:00
status: 1

puits de pétrole
type: PreferredTerm
modified: 2015-01-21T15:48:16+01:00
created: 2011-09-01T00:00:00+02:00
status: 1

cellier
type: PreferredTerm
modified: 2014-12-31T15:38:03+01:00
created: 2011-09-01T00:00:00+02:00
status: 1

usine de matériel informatique
type: PreferredTerm
modified: 2014-11-17T14:15:05+01:00
created: 2011-09-01T00:00:00+02:00
status: 1

tonnelle
type: PreferredTerm
modified: 2014-12-30T15:29:03+01:00
created: 2011-09-01T00:00:00+02:00
status: 1

douves
type: PreferredTerm
modified: 2015-01-05T12:52:45+01:00
created: 2011-09-01T00:00:00+02:00
status: 1

atelier
type: PreferredTerm
modified: 2014-12-04T15:07:12+01:00
created: 2011-09-01T00:00:00+02:00
status: 1

navata laterale
type: PreferredTerm
modified: 2014-11-28T15:58:21+01:00
created: 2011-09-01T00:00:00+02:00
status: 1

aisle
type: PreferredTerm
modified: 2014-11-28T15:58:21+01:00
created: 2011-09-01T00:00:00+02:00
status: 1

bas-côté
type: SimpleNonPreferredTerm
modified: 2014-11-28T15:58:21+01:00
created: 2011-09-01T00:00:00+02:00
status: 1

collatéral
type: PreferredTerm
modified: 2014-11-28T15:58:21+01:00
created: 2011-09-01T00:00:00+02:00
status: 1

side + aisles
type: PreferredTerm
modified: 2014-11-28T15:58:21+01:00
created: 2011-09-01T00:00:00+02:00
status: 1

usine de bougies
type: PreferredTerm
modified: 2015-02-18T11:59:50+01:00
created: 2011-09-01T00:00:00+02:00
status: 1

périphérie
type: PreferredTerm
modified: 2014-10-17T15:04:01+02:00
created: 2011-09-01T00:00:00+02:00
status: 1

tribune
type: PreferredTerm
modified: 2015-02-25T10:17:47+01:00
created: 2011-09-01T00:00:00+02:00
status: 1

vinaigrerie
type: PreferredTerm
modified: 2015-02-06T14:59:38+01:00
created: 2011-09-01T00:00:00+02:00
status: 1

travail à ferrer
type: PreferredTerm
modified: 2014-12-04T14:51:46+01:00
created: 2011-09-01T00:00:00+02:00
status: 1

maréchalerie
type: SimpleNonPreferredTerm
modified: 2014-12-04T14:51:46+01:00
created: 2011-09-01T00:00:00+02:00
status: 1

usine de petite métallurgie
type: PreferredTerm
modified: 2014-12-10T16:56:27+01:00
created: 2011-09-01T00:00:00+02:00
status: 1

jardin d'utilité
type: PreferredTerm
modified: 2014-09-18T15:43:45+02:00
created: 2011-09-01T00:00:00+02:00
status: 1

bâtiment de la machine d'extraction
type: PreferredTerm
modified: 2015-04-30T16:38:49+02:00
created: 2011-09-01T00:00:00+02:00
status: 1

poste de chargement
type: PreferredTerm
modified: 2015-04-08T12:59:15+02:00
created: 2011-09-01T00:00:00+02:00
status: 1

site archéologique
type: Concept
modified: 2015-02-25T14:35:24+01:00
in scheme: Thésaurus de la désignation des œuvres architecturales et des espaces aménagés
preferred label: archeological sites @en-us
broader: ensemble à fonction non identifiée
created: 2013-10-15T18:45:04+02:00
status: 1

site archéologique
type: PreferredTerm
modified: 2015-02-25T14:35:24+01:00
created: 2013-10-15T18:45:04+02:00
status: 1

lazaret
type: PreferredTerm
modified: 2015-01-02T12:04:45+01:00
created: 2011-09-01T00:00:00+02:00
status: 1

tombeau
type: PreferredTerm
modified: 2015-02-24T15:26:07+01:00
created: 2011-09-01T00:00:00+02:00
status: 1

tombs
type: PreferredTerm
modified: 2015-02-24T15:26:07+01:00
created: 2011-09-01T00:00:00+02:00
status: 1

tomba
type: PreferredTerm
modified: 2015-02-24T15:26:07+01:00
created: 2011-09-01T00:00:00+02:00
status: 1

tomb
type: PreferredTerm
modified: 2015-02-24T15:26:07+01:00
created: 2011-09-01T00:00:00+02:00
status: 1

conurbation
type: PreferredTerm
modified: 2014-10-17T10:42:48+02:00
created: 2011-09-01T00:00:00+02:00
status: 1

navata
type: PreferredTerm
modified: 2014-11-28T16:00:53+01:00
created: 2011-09-01T00:00:00+02:00
status: 1

naves
type: PreferredTerm
modified: 2014-11-28T16:00:53+01:00
created: 2011-09-01T00:00:00+02:00
status: 1

nef
type: PreferredTerm
modified: 2014-11-28T16:00:53+01:00
created: 2011-09-01T00:00:00+02:00
status: 1

nave
type: PreferredTerm
modified: 2014-11-28T16:00:53+01:00
created: 2011-09-01T00:00:00+02:00
status: 1

communs
type: PreferredTerm
modified: 2014-12-31T16:08:23+01:00
created: 2011-09-01T00:00:00+02:00
status: 1

mur de clôture
type: PreferredTerm
modified: 2015-02-25T16:20:40+01:00
created: 2011-09-01T00:00:00+02:00
status: 1

jardin maraîcher
type: PreferredTerm
modified: 2014-12-31T10:47:19+01:00
created: 2011-09-01T00:00:00+02:00
status: 1

place forte
type: PreferredTerm
modified: 2015-01-05T12:17:49+01:00
created: 2011-09-01T00:00:00+02:00
status: 1

usine d'agglomérés
type: PreferredTerm
modified: 2015-02-03T11:57:42+01:00
created: 2011-09-01T00:00:00+02:00
status: 1

usine d'appareils de levage et de manutention
type: PreferredTerm
modified: 2015-01-28T15:52:11+01:00
created: 2011-09-01T00:00:00+02:00
status: 1

clocher
type: PreferredTerm
modified: 2015-02-25T11:55:45+01:00
created: 2011-09-01T00:00:00+02:00
status: 1

borne milliaire
type: SimpleNonPreferredTerm
modified: 2014-12-01T14:12:42+01:00
created: 2011-09-01T00:00:00+02:00
status: 1

milliaire
type: PreferredTerm
modified: 2014-12-01T14:12:42+01:00
created: 2011-09-01T00:00:00+02:00
status: 1

ensemble d'industrie extractive
type: PreferredTerm
modified: 2015-05-04T14:54:58+02:00
created: 2011-09-01T00:00:00+02:00
status: 1

office de tourisme
type: PreferredTerm
modified: 2014-12-19T10:46:21+01:00
created: 2011-09-01T00:00:00+02:00
status: 1

syndicat d'initiative
type: SimpleNonPreferredTerm
modified: 2014-12-19T10:46:21+01:00
created: 2011-09-01T00:00:00+02:00
status: 1

conduite forcée
type: PreferredTerm
modified: 2014-12-02T12:27:04+01:00
created: 2011-09-01T00:00:00+02:00
status: 1

pont
type: PreferredTerm
modified: 2014-12-02T13:05:30+01:00
created: 2011-09-01T00:00:00+02:00
status: 1

viaduc
type: SimpleNonPreferredTerm
modified: 2014-12-02T13:05:30+01:00
created: 2011-09-01T00:00:00+02:00
status: 1

ponceau
type: SimpleNonPreferredTerm
modified: 2014-12-02T13:05:30+01:00
created: 2011-09-01T00:00:00+02:00
status: 1

ouvrage avancé
type: PreferredTerm
modified: 2015-01-05T13:14:37+01:00
created: 2011-09-01T00:00:00+02:00
status: 1

internat
type: PreferredTerm
modified: 2014-12-08T11:38:32+01:00
created: 2011-09-01T00:00:00+02:00
status: 1

quartier de cavalerie
type: PreferredTerm
modified: 2015-01-05T11:42:44+01:00
created: 2011-09-01T00:00:00+02:00
status: 1

passerelle
type: PreferredTerm
modified: 2014-12-02T13:06:10+01:00
created: 2011-09-01T00:00:00+02:00
status: 1

latrine
type: PreferredTerm
modified: 2014-12-31T16:23:14+01:00
created: 2011-09-01T00:00:00+02:00
status: 1

aciérie
type: PreferredTerm
modified: 2015-03-13T16:03:02+01:00
created: 2011-09-01T00:00:00+02:00
status: 1

salle capitulaire
type: PreferredTerm
modified: 2014-11-28T15:12:31+01:00
created: 2011-09-01T00:00:00+02:00
status: 1

chapter house
type: PreferredTerm
modified: 2014-11-28T15:12:31+01:00
created: 2011-09-01T00:00:00+02:00
status: 1

chapter houses
type: PreferredTerm
modified: 2014-11-28T15:12:31+01:00
created: 2011-09-01T00:00:00+02:00
status: 1

sala capitolare
type: PreferredTerm
modified: 2014-11-28T15:12:31+01:00
created: 2011-09-01T00:00:00+02:00
status: 1

phare
type: PreferredTerm
modified: 2014-11-28T17:06:09+01:00
created: 2011-09-01T00:00:00+02:00
status: 1

édifice industriel
type: SimpleNonPreferredTerm
modified: 2015-02-09T15:23:28+01:00
created: 2011-09-01T00:00:00+02:00
status: 1

usine
type: PreferredTerm
modified: 2015-02-09T15:23:28+01:00
created: 2011-09-01T00:00:00+02:00
status: 1

ensemble d'industrie du papier
type: PreferredTerm
modified: 2015-05-04T14:50:42+02:00
created: 2011-09-01T00:00:00+02:00
status: 1

clôture
type: PreferredTerm
modified: 2015-02-25T10:29:02+01:00
created: 2011-09-01T00:00:00+02:00
status: 1

massif antérieur
type: PreferredTerm
modified: 2014-10-15T17:30:38+02:00
created: 2011-09-01T00:00:00+02:00
status: 1

westwork
type: PreferredTerm
modified: 2014-10-15T17:30:38+02:00
created: 2011-09-01T00:00:00+02:00
status: 1

corpo occidentale
type: PreferredTerm
modified: 2014-10-15T17:30:38+02:00
created: 2011-09-01T00:00:00+02:00
status: 1

westworks
type: PreferredTerm
modified: 2014-10-15T17:30:38+02:00
created: 2011-09-01T00:00:00+02:00
status: 1

massif occidental
type: SimpleNonPreferredTerm
modified: 2014-10-15T17:30:38+02:00
created: 2011-09-01T00:00:00+02:00
status: 1

borne routière
type: PreferredTerm
modified: 2015-02-24T11:23:06+01:00
created: 2011-09-01T00:00:00+02:00
status: 1

théâtre de plein air
type: PreferredTerm
modified: 2014-10-10T12:07:19+02:00
created: 2011-09-01T00:00:00+02:00
status: 1

usine d'armes
type: PreferredTerm
modified: 2015-01-29T14:31:19+01:00
created: 2011-09-01T00:00:00+02:00
status: 1

campanile
type: PreferredTerm
modified: 2015-02-25T11:57:02+01:00
created: 2011-09-01T00:00:00+02:00
status: 1

polygone de tir
type: PreferredTerm
modified: 2015-01-05T12:24:15+01:00
created: 2011-09-01T00:00:00+02:00
status: 1

champ de tir
type: SimpleNonPreferredTerm
modified: 2015-01-05T12:24:15+01:00
created: 2011-09-01T00:00:00+02:00
status: 1

ensemble générateur d'énergie
type: PreferredTerm
modified: 2015-04-15T11:00:07+02:00
created: 2011-09-01T00:00:00+02:00
status: 1

usine de matériel de télécommunication
type: PreferredTerm
modified: 2015-04-28T15:21:06+02:00
created: 2011-09-01T00:00:00+02:00
status: 1

grotte
type: SimpleNonPreferredTerm
modified: 2014-12-31T11:29:42+01:00
created: 2011-09-01T00:00:00+02:00
status: 1

abri sous roche
type: PreferredTerm
modified: 2014-12-31T11:29:42+01:00
created: 2011-09-01T00:00:00+02:00
status: 1

grotte préhistorique
type: SimpleNonPreferredTerm
modified: 2014-12-31T11:29:42+01:00
created: 2011-09-01T00:00:00+02:00
status: 1

usine élévatoire
type: SimpleNonPreferredTerm
modified: 2014-12-02T12:50:50+01:00
created: 2011-09-01T00:00:00+02:00
status: 1

usine élévatrice des eaux
type: SimpleNonPreferredTerm
modified: 2014-12-02T12:50:50+01:00
created: 2011-09-01T00:00:00+02:00
status: 1

établissement élévateur des eaux
type: PreferredTerm
modified: 2014-12-02T12:50:50+01:00
created: 2011-09-01T00:00:00+02:00
status: 1

jardin potager
type: PreferredTerm
modified: 2014-12-31T10:46:32+01:00
created: 2011-09-01T00:00:00+02:00
status: 1

gendarmerie
type: PreferredTerm
modified: 2015-01-05T11:41:05+01:00
created: 2011-09-01T00:00:00+02:00
status: 1

amphithéâtre d'enseignement
type: PreferredTerm
modified: 2014-12-08T11:31:59+01:00
created: 2011-09-01T00:00:00+02:00
status: 1

amphithéâtre universitaire
type: SimpleNonPreferredTerm
modified: 2014-12-08T11:31:59+01:00
created: 2011-09-01T00:00:00+02:00
status: 1

pont canal
type: PreferredTerm
modified: 2014-12-02T13:07:17+01:00
created: 2011-09-01T00:00:00+02:00
status: 1

usine de mécanique de précision
type: PreferredTerm
modified: 2015-02-03T12:34:29+01:00
created: 2011-09-01T00:00:00+02:00
status: 1

demi-lune
type: PreferredTerm
modified: 2015-01-05T13:07:03+01:00
created: 2011-09-01T00:00:00+02:00
status: 1

refectories
type: PreferredTerm
modified: 2014-11-28T15:11:17+01:00
created: 2011-09-01T00:00:00+02:00
status: 1

refectory
type: PreferredTerm
modified: 2014-11-28T15:11:17+01:00
created: 2011-09-01T00:00:00+02:00
status: 1

refettorio
type: PreferredTerm
modified: 2014-11-28T15:11:17+01:00
created: 2011-09-01T00:00:00+02:00
status: 1

réfectoire
type: PreferredTerm
modified: 2014-11-28T15:11:17+01:00
created: 2011-09-01T00:00:00+02:00
status: 1

affinerie
type: PreferredTerm
modified: 2015-03-13T16:17:45+01:00
created: 2011-09-01T00:00:00+02:00
status: 1

pas de tir
type: PreferredTerm
modified: 2014-10-16T14:09:05+02:00
created: 2011-09-01T00:00:00+02:00
status: 1

aire de lancement
type: SimpleNonPreferredTerm
modified: 2014-10-16T14:09:05+02:00
created: 2011-09-01T00:00:00+02:00
status: 1

borne
type: PreferredTerm
modified: 2015-02-24T11:23:56+01:00
created: 2011-09-01T00:00:00+02:00
status: 1

borne de juridiction
type: SimpleNonPreferredTerm
modified: 2015-02-24T11:23:56+01:00
created: 2011-09-01T00:00:00+02:00
status: 1

borne frontière
type: SimpleNonPreferredTerm
modified: 2015-02-24T11:23:56+01:00
created: 2011-09-01T00:00:00+02:00
status: 1

borne géodésique
type: SimpleNonPreferredTerm
modified: 2015-02-24T11:23:56+01:00
created: 2011-09-01T00:00:00+02:00
status: 1

borne kilométrique
type: SimpleNonPreferredTerm
modified: 2015-02-24T11:23:56+01:00
created: 2011-09-01T00:00:00+02:00
status: 1

borne de propriété
type: SimpleNonPreferredTerm
modified: 2015-02-24T11:23:56+01:00
created: 2011-09-01T00:00:00+02:00
status: 1

borne frontalière
type: SimpleNonPreferredTerm
modified: 2015-02-24T11:23:56+01:00
created: 2011-09-01T00:00:00+02:00
status: 1

ensemble de fabrication des métaux
type: PreferredTerm
modified: 2015-04-21T11:45:03+02:00
created: 2011-09-01T00:00:00+02:00
status: 1

usine d'éléments préfabriqués
type: PreferredTerm
modified: 2015-04-28T15:36:00+02:00
created: 2011-09-01T00:00:00+02:00
status: 1

pignon
type: PreferredTerm
modified: 2015-02-25T16:27:37+01:00
created: 2011-09-01T00:00:00+02:00
status: 1

jardin fleuriste
type: PreferredTerm
modified: 2014-12-31T10:44:43+01:00
created: 2011-09-01T00:00:00+02:00
status: 1

pente d'eau
type: PreferredTerm
modified: 2014-10-16T15:25:29+02:00
created: 2011-09-01T00:00:00+02:00
status: 1

usine d'horlogerie
type: PreferredTerm
modified: 2015-02-03T12:48:15+01:00
created: 2011-09-01T00:00:00+02:00
status: 1

usine de feutre
type: PreferredTerm
modified: 2015-04-30T15:35:56+02:00
created: 2011-09-01T00:00:00+02:00
status: 1

usine de céramique
type: PreferredTerm
modified: 2015-01-27T12:11:49+01:00
created: 2011-09-01T00:00:00+02:00
status: 1

ouvrage lié à l'alimentation en eau
type: PreferredTerm
modified: 2013-04-23T00:00:00+02:00
created: 2011-09-01T00:00:00+02:00
status: 1

entrepôt militaire de fourrage
type: SimpleNonPreferredTerm
modified: 2015-01-05T11:46:18+01:00
created: 2011-09-01T00:00:00+02:00
status: 1

magasin de fourrage
type: PreferredTerm
modified: 2015-01-05T11:46:18+01:00
created: 2011-09-01T00:00:00+02:00
status: 1

estacade
type: PreferredTerm
modified: 2014-12-02T12:22:36+01:00
created: 2011-09-01T00:00:00+02:00
status: 1

architecture de culture recherche sport ou loisir
type: PreferredTerm
modified: 2013-04-23T00:00:00+02:00
created: 2011-09-01T00:00:00+02:00
status: 1

usine de pelleterie
type: PreferredTerm
modified: 2015-04-28T16:46:30+02:00
created: 2011-09-01T00:00:00+02:00
status: 1

gare routière
type: PreferredTerm
modified: 2014-11-28T17:02:22+01:00
created: 2011-09-01T00:00:00+02:00
status: 1

ambulatories
type: PreferredTerm
modified: 2014-10-15T17:29:47+02:00
created: 2011-09-01T00:00:00+02:00
status: 1

deambulatorio
type: PreferredTerm
modified: 2014-10-15T17:29:47+02:00
created: 2011-09-01T00:00:00+02:00
status: 1

ambulatory (internal)
type: PreferredTerm
modified: 2014-10-15T17:29:47+02:00
created: 2011-09-01T00:00:00+02:00
status: 1

déambulatoire
type: PreferredTerm
modified: 2014-10-15T17:29:47+02:00
created: 2011-09-01T00:00:00+02:00
status: 1

usine génératrice d'énergie
type: PreferredTerm
modified: 2015-02-19T11:37:40+01:00
created: 2011-09-01T00:00:00+02:00
status: 1

atrium
type: PreferredTerm
modified: 2015-02-25T11:49:41+01:00
created: 2011-09-01T00:00:00+02:00
status: 1

lavabo del chiostro
type: PreferredTerm
modified: 2014-10-23T10:45:31+02:00
created: 2011-09-01T00:00:00+02:00
status: 1

cloister + lavaboes
type: PreferredTerm
modified: 2014-10-23T10:45:31+02:00
created: 2011-09-01T00:00:00+02:00
status: 1

lavabo de cloître
type: PreferredTerm
modified: 2014-10-23T10:45:31+02:00
created: 2011-09-01T00:00:00+02:00
status: 1

édicule de culture recherche sport ou loisir
type: PreferredTerm
modified: 2013-04-23T00:00:00+02:00
created: 2011-09-01T00:00:00+02:00
status: 1

usine de construction mécanique
type: PreferredTerm
modified: 2015-01-28T15:40:19+01:00
created: 2011-09-01T00:00:00+02:00
status: 1

belvédère
type: PreferredTerm
modified: 2015-02-25T11:53:49+01:00
created: 2011-09-01T00:00:00+02:00
status: 1

ensemble métallurgique
type: PreferredTerm
modified: 2015-05-04T15:30:40+02:00
created: 2011-09-01T00:00:00+02:00
status: 1

édifice d'enseignement
type: SimpleNonPreferredTerm
modified: 2014-12-01T15:26:22+01:00
created: 2011-09-01T00:00:00+02:00
status: 1

édifice scolaire
type: PreferredTerm
modified: 2014-12-01T15:26:22+01:00
created: 2011-09-01T00:00:00+02:00
status: 1

mur de soutènement
type: PreferredTerm
modified: 2015-02-25T16:23:28+01:00
created: 2011-09-01T00:00:00+02:00
status: 1

usine de chaux
type: PreferredTerm
modified: 2015-04-28T15:38:21+02:00
created: 2011-09-01T00:00:00+02:00
status: 1

berge aménagée
type: PreferredTerm
modified: 2014-10-16T14:40:42+02:00
created: 2011-09-01T00:00:00+02:00
status: 1

usine d'instruments de mesure
type: PreferredTerm
modified: 2015-04-28T15:43:03+02:00
created: 2011-09-01T00:00:00+02:00
status: 1

jardin de plantes médicinales
type: PreferredTerm
modified: 2014-10-14T11:58:26+02:00
created: 2011-09-01T00:00:00+02:00
status: 1

piste d'aviation
type: PreferredTerm
modified: 2014-10-16T15:26:27+02:00
created: 2011-09-01T00:00:00+02:00
status: 1

bief de dérivation
type: PreferredTerm
modified: 2014-12-02T12:23:22+01:00
created: 2011-09-01T00:00:00+02:00
status: 1

bief de moulin
type: SimpleNonPreferredTerm
modified: 2014-12-02T12:23:22+01:00
created: 2011-09-01T00:00:00+02:00
status: 1

briqueterie
type: PreferredTerm
modified: 2015-01-23T16:38:57+01:00
created: 2011-09-01T00:00:00+02:00
status: 1

usine de moirage
type: PreferredTerm
modified: 2013-04-23T00:00:00+02:00
created: 2011-09-01T00:00:00+02:00
status: 1

poste de garde
type: SimpleNonPreferredTerm
modified: 2015-01-05T11:45:13+01:00
created: 2011-09-01T00:00:00+02:00
status: 1

corps de garde
type: PreferredTerm
modified: 2015-01-05T11:45:13+01:00
created: 2011-09-01T00:00:00+02:00
status: 1

usine de traitement du poil animal
type: PreferredTerm
modified: 2013-04-23T00:00:00+02:00
created: 2011-09-01T00:00:00+02:00
status: 1

préau
type: PreferredTerm
modified: 2014-12-08T11:44:45+01:00
created: 2011-09-01T00:00:00+02:00
status: 1

station de tramway
type: PreferredTerm
modified: 2014-10-16T14:06:57+02:00
created: 2011-09-01T00:00:00+02:00
status: 1

cripta
type: PreferredTerm
modified: 2014-11-28T15:59:47+01:00
created: 2011-09-01T00:00:00+02:00
status: 1

crypt
type: PreferredTerm
modified: 2014-11-28T15:59:47+01:00
created: 2011-09-01T00:00:00+02:00
status: 1

crypte
type: PreferredTerm
modified: 2014-11-28T15:59:47+01:00
created: 2011-09-01T00:00:00+02:00
status: 1

crypts
type: PreferredTerm
modified: 2014-11-28T15:59:47+01:00
created: 2011-09-01T00:00:00+02:00
status: 1

moulin
type: PreferredTerm
modified: 2014-12-17T16:57:16+01:00
created: 2011-09-01T00:00:00+02:00
status: 1

moulin édicule
type: SimpleNonPreferredTerm
modified: 2014-12-17T16:57:16+01:00
created: 2011-09-01T00:00:00+02:00
status: 1

moulin à vent
type: SimpleNonPreferredTerm
modified: 2014-12-17T16:57:16+01:00
created: 2011-09-01T00:00:00+02:00
status: 1

moulin à eau
type: SimpleNonPreferredTerm
modified: 2014-12-17T16:57:16+01:00
created: 2011-09-01T00:00:00+02:00
status: 1

moulin à traction animale
type: SimpleNonPreferredTerm
modified: 2014-12-17T16:57:16+01:00
created: 2011-09-01T00:00:00+02:00
status: 1

usine de fabrication des métaux
type: PreferredTerm
modified: 2015-03-13T15:44:47+01:00
created: 2011-09-01T00:00:00+02:00
status: 1

dortoir
type: PreferredTerm
modified: 2014-10-15T13:59:31+02:00
created: 2011-09-01T00:00:00+02:00
status: 1

dormitory
type: PreferredTerm
modified: 2014-10-15T13:59:31+02:00
created: 2011-09-01T00:00:00+02:00
status: 1

dormitorio
type: PreferredTerm
modified: 2014-10-15T13:59:31+02:00
created: 2011-09-01T00:00:00+02:00
status: 1

dormitories (rooms)
type: PreferredTerm
modified: 2014-10-15T13:59:31+02:00
created: 2011-09-01T00:00:00+02:00
status: 1

cabine de bain
type: PreferredTerm
modified: 2014-12-12T11:09:32+01:00
created: 2011-09-01T00:00:00+02:00
status: 1

couverture et accessoire du toit
type: PreferredTerm
modified: 2015-02-24T17:05:42+01:00
created: 2011-09-01T00:00:00+02:00
status: 1

moulin à foulon
type: PreferredTerm
modified: 2015-03-18T15:59:12+01:00
created: 2011-09-01T00:00:00+02:00
status: 1

presbytère
type: PreferredTerm
modified: 2014-12-31T12:57:40+01:00
created: 2011-09-01T00:00:00+02:00
status: 1

maison curiale
type: SimpleNonPreferredTerm
modified: 2014-12-31T12:57:40+01:00
created: 2011-09-01T00:00:00+02:00
status: 1

cure
type: SimpleNonPreferredTerm
modified: 2014-12-31T12:57:40+01:00
created: 2011-09-01T00:00:00+02:00
status: 1

châtelet d'entrée
type: SimpleNonPreferredTerm
modified: 2015-01-05T13:01:34+01:00
created: 2011-09-01T00:00:00+02:00
status: 1

ouvrage d'entrée
type: PreferredTerm
modified: 2015-01-05T13:01:34+01:00
created: 2011-09-01T00:00:00+02:00
status: 1

châtelet
type: SimpleNonPreferredTerm
modified: 2015-01-05T13:01:34+01:00
created: 2011-09-01T00:00:00+02:00
status: 1

stationnement
type: PreferredTerm
modified: 2015-02-26T12:13:34+01:00
created: 2011-09-01T00:00:00+02:00
status: 1

parc de stationnement
type: SimpleNonPreferredTerm
modified: 2015-02-26T12:13:34+01:00
created: 2011-09-01T00:00:00+02:00
status: 1

parking
type: SimpleNonPreferredTerm
modified: 2015-02-26T12:13:34+01:00
created: 2011-09-01T00:00:00+02:00
status: 1

usine de construction métallique
type: PreferredTerm
modified: 2015-01-29T16:00:39+01:00
created: 2011-09-01T00:00:00+02:00
status: 1

rempart de ville
type: SimpleNonPreferredTerm
modified: 2015-01-05T12:10:11+01:00
created: 2011-09-01T00:00:00+02:00
status: 1

enceinte de ville
type: SimpleNonPreferredTerm
modified: 2015-01-05T12:10:11+01:00
created: 2011-09-01T00:00:00+02:00
status: 1

fortification d'agglomération
type: PreferredTerm
modified: 2015-01-05T12:10:11+01:00
created: 2011-09-01T00:00:00+02:00
status: 1

lucarne
type: PreferredTerm
modified: 2015-02-25T12:04:48+01:00
created: 2011-09-01T00:00:00+02:00
status: 1

local syndical
type: PreferredTerm
modified: 2015-02-25T16:14:42+01:00
created: 2011-09-01T00:00:00+02:00
status: 1

cloister
type: PreferredTerm
modified: 2014-11-28T15:09:55+01:00
created: 2011-09-01T00:00:00+02:00
status: 1

cloisters
type: PreferredTerm
modified: 2014-11-28T15:09:55+01:00
created: 2011-09-01T00:00:00+02:00
status: 1

cloître
type: PreferredTerm
modified: 2014-11-28T15:09:55+01:00
created: 2011-09-01T00:00:00+02:00
status: 1

chiostro
type: PreferredTerm
modified: 2014-11-28T15:09:55+01:00
created: 2011-09-01T00:00:00+02:00
status: 1

tapis roulant
type: PreferredTerm
modified: 2015-02-25T13:55:48+01:00
created: 2011-09-01T00:00:00+02:00
status: 1

station de métro
type: PreferredTerm
modified: 2014-11-28T16:59:09+01:00
created: 2011-09-01T00:00:00+02:00
status: 1

centrale hydroélectrique
type: PreferredTerm
modified: 2015-02-19T15:57:33+01:00
created: 2011-09-01T00:00:00+02:00
status: 1

devanture
type: PreferredTerm
modified: 2015-02-25T10:09:16+01:00
created: 2011-09-01T00:00:00+02:00
status: 1

devanture de boutique
type: SimpleNonPreferredTerm
modified: 2015-02-25T10:09:16+01:00
created: 2011-09-01T00:00:00+02:00
status: 1

mire astronomique
type: SimpleNonPreferredTerm
modified: 2014-12-12T11:22:41+01:00
created: 2011-09-01T00:00:00+02:00
status: 1

mire
type: PreferredTerm
modified: 2014-12-12T11:22:41+01:00
created: 2011-09-01T00:00:00+02:00
status: 1

mire géodésique
type: SimpleNonPreferredTerm
modified: 2014-12-12T11:22:41+01:00
created: 2013-12-09T15:47:40+01:00
status: 1

escalier de service
type: PreferredTerm
modified: 2015-02-25T12:53:38+01:00
created: 2011-09-01T00:00:00+02:00
status: 1

gué
type: PreferredTerm
modified: 2014-10-16T14:50:21+02:00
created: 2011-09-01T00:00:00+02:00
status: 1

gué carrossable
type: SimpleNonPreferredTerm
modified: 2014-10-16T14:50:21+02:00
created: 2011-09-01T00:00:00+02:00
status: 1

chaussée de rivière
type: SimpleNonPreferredTerm
modified: 2014-10-16T14:50:21+02:00
created: 2011-09-01T00:00:00+02:00
status: 1

poudrière
type: PreferredTerm
modified: 2015-01-05T11:49:21+01:00
created: 2011-09-01T00:00:00+02:00
status: 1

faïencerie
type: PreferredTerm
modified: 2015-01-23T17:02:22+01:00
created: 2011-09-01T00:00:00+02:00
status: 1

usine de blanchiment
type: PreferredTerm
modified: 2015-03-19T10:42:45+01:00
created: 2011-09-01T00:00:00+02:00
status: 1

centre de loisirs
type: PreferredTerm
modified: 2014-12-12T14:44:55+01:00
created: 2011-09-01T00:00:00+02:00
status: 1

silo
type: PreferredTerm
modified: 2015-02-26T12:08:17+01:00
created: 2011-09-01T00:00:00+02:00
status: 1

silo à grains
type: SimpleNonPreferredTerm
modified: 2015-02-26T12:08:17+01:00
created: 2011-09-01T00:00:00+02:00
status: 1

pavillon de chasse
type: SimpleNonPreferredTerm
modified: 2014-12-31T12:59:34+01:00
created: 2011-09-01T00:00:00+02:00
status: 1

rendez-vous de chasse
type: PreferredTerm
modified: 2014-12-31T12:59:34+01:00
created: 2011-09-01T00:00:00+02:00
status: 1

mur défensif
type: PreferredTerm
modified: 2015-01-05T12:58:36+01:00
created: 2011-09-01T00:00:00+02:00
status: 1

souche de cheminée
type: PreferredTerm
modified: 2015-02-24T17:09:58+01:00
created: 2011-09-01T00:00:00+02:00
status: 1

ceinture de forts
type: PreferredTerm
modified: 2015-01-05T12:11:00+01:00
created: 2011-09-01T00:00:00+02:00
status: 1

usine de construction navale
type: PreferredTerm
modified: 2015-01-29T16:21:21+01:00
created: 2011-09-01T00:00:00+02:00
status: 1

chantier naval
type: SimpleNonPreferredTerm
modified: 2015-01-29T16:21:21+01:00
created: 2011-09-01T00:00:00+02:00
status: 1

partie conventuelle
type: SimpleNonPreferredTerm
modified: 2014-11-28T14:23:34+01:00
created: 2011-09-01T00:00:00+02:00
status: 1

bâtiment conventuel
type: PreferredTerm
modified: 2014-11-28T14:23:34+01:00
created: 2011-09-01T00:00:00+02:00
status: 1

escalier isolé
type: SimpleNonPreferredTerm
modified: 2015-02-25T12:55:34+01:00
created: 2011-09-01T00:00:00+02:00
status: 1

escalier indépendant
type: PreferredTerm
modified: 2015-02-25T12:55:34+01:00
created: 2011-09-01T00:00:00+02:00
status: 1

plongeoir
type: PreferredTerm
modified: 2014-10-17T15:40:12+02:00
created: 2011-09-01T00:00:00+02:00
status: 1

halte ferroviaire
type: PreferredTerm
modified: 2014-10-16T14:04:36+02:00
created: 2011-09-01T00:00:00+02:00
status: 1

boutique
type: PreferredTerm
modified: 2014-12-05T11:40:45+01:00
created: 2011-09-01T00:00:00+02:00
status: 1

centrale électrique
type: PreferredTerm
modified: 2015-02-19T12:18:29+01:00
created: 2011-09-01T00:00:00+02:00
status: 1

magasin de munitions
type: PreferredTerm
modified: 2015-01-05T11:47:17+01:00
created: 2011-09-01T00:00:00+02:00
status: 1

entrepôt de munitions
type: SimpleNonPreferredTerm
modified: 2015-01-05T11:47:17+01:00
created: 2011-09-01T00:00:00+02:00
status: 1

dépôt de munitions
type: SimpleNonPreferredTerm
modified: 2015-01-05T11:47:17+01:00
created: 2011-09-01T00:00:00+02:00
status: 1

tuilerie
type: PreferredTerm
modified: 2015-01-27T15:18:51+01:00
created: 2011-09-01T00:00:00+02:00
status: 1

ensemble de culture recherche sport ou loisir
type: PreferredTerm
modified: 2013-04-23T00:00:00+02:00
created: 2011-09-01T00:00:00+02:00
status: 1

jetée
type: PreferredTerm
modified: 2014-12-02T12:21:53+01:00
created: 2011-09-01T00:00:00+02:00
status: 1

brise-lames
type: SimpleNonPreferredTerm
modified: 2014-12-02T12:21:53+01:00
created: 2011-09-01T00:00:00+02:00
status: 1

môle
type: SimpleNonPreferredTerm
modified: 2014-12-02T12:21:53+01:00
created: 2011-09-01T00:00:00+02:00
status: 1

séchoir à tabac
type: PreferredTerm
modified: 2015-02-26T12:06:14+01:00
created: 2011-09-01T00:00:00+02:00
status: 1

usine de sparterie
type: PreferredTerm
modified: 2015-03-18T15:19:44+01:00
created: 2011-09-01T00:00:00+02:00
status: 1

villa antique
type: PreferredTerm
modified: 2014-12-31T13:01:11+01:00
created: 2011-09-01T00:00:00+02:00
status: 1

ouvrage extérieur
type: PreferredTerm
modified: 2014-09-19T17:29:58+02:00
created: 2011-09-01T00:00:00+02:00
status: 1

ouvrage militaire
type: PreferredTerm
modified: 2015-01-05T13:34:30+01:00
created: 2011-09-01T00:00:00+02:00
status: 1

édicule militaire
type: SimpleNonPreferredTerm
modified: 2015-01-05T13:34:30+01:00
created: 2011-09-01T00:00:00+02:00
status: 1

funiculaire
type: PreferredTerm
modified: 2014-12-02T14:53:57+01:00
created: 2011-09-01T00:00:00+02:00
status: 1

flèche en couverture
type: PreferredTerm
modified: 2015-02-25T12:00:44+01:00
created: 2011-09-01T00:00:00+02:00
status: 1

ensemble industriel
type: PreferredTerm
modified: 2015-04-13T12:26:13+02:00
created: 2011-09-01T00:00:00+02:00
status: 1

partie d'édifice religieux
type: PreferredTerm
modified: 2013-04-23T00:00:00+02:00
created: 2011-09-01T00:00:00+02:00
status: 1

cloison
type: PreferredTerm
modified: 2015-02-25T10:28:01+01:00
created: 2011-09-01T00:00:00+02:00
status: 1

usine de construction aéronautique
type: PreferredTerm
modified: 2015-01-29T15:01:31+01:00
created: 2011-09-01T00:00:00+02:00
status: 1

ligne fortifiée
type: PreferredTerm
modified: 2015-01-05T12:13:19+01:00
created: 2011-09-01T00:00:00+02:00
status: 1

poste d'affût
type: PreferredTerm
modified: 2014-10-17T15:44:30+02:00
created: 2011-09-01T00:00:00+02:00
status: 1

degré
type: SimpleNonPreferredTerm
modified: 2015-02-25T12:48:41+01:00
created: 2011-09-01T00:00:00+02:00
status: 1

escalier
type: PreferredTerm
modified: 2015-02-25T12:48:41+01:00
created: 2011-09-01T00:00:00+02:00
status: 1

cage d'escalier
type: SimpleNonPreferredTerm
modified: 2015-02-25T12:48:41+01:00
created: 2011-09-01T00:00:00+02:00
status: 1

élévation extérieure
type: SimpleNonPreferredTerm
modified: 2015-02-25T13:59:46+01:00
created: 2011-09-01T00:00:00+02:00
status: 1

façade
type: SimpleNonPreferredTerm
modified: 2015-02-25T13:59:46+01:00
created: 2011-09-01T00:00:00+02:00
status: 1

élévation
type: PreferredTerm
modified: 2015-02-25T13:59:46+01:00
created: 2011-09-01T00:00:00+02:00
status: 1

gare de transbordement
type: PreferredTerm
modified: 2014-09-23T15:36:42+02:00
created: 2011-09-01T00:00:00+02:00
status: 1

usine de grès
type: PreferredTerm
modified: 2015-01-27T15:25:02+01:00
created: 2011-09-01T00:00:00+02:00
status: 1

éolienne
type: PreferredTerm
modified: 2014-12-02T12:09:19+01:00
created: 2011-09-01T00:00:00+02:00
status: 1

partie d'édifice domestique
type: PreferredTerm
modified: 2013-04-23T00:00:00+02:00
created: 2011-09-01T00:00:00+02:00
status: 1

porte de ville
type: PreferredTerm
modified: 2014-12-12T10:31:22+01:00
created: 2011-09-01T00:00:00+02:00
status: 1

usine d'apprêt des étoffes
type: PreferredTerm
modified: 2015-03-18T15:37:45+01:00
created: 2011-09-01T00:00:00+02:00
status: 1

séchoir à peaux
type: PreferredTerm
modified: 2015-02-26T12:04:16+01:00
created: 2011-09-01T00:00:00+02:00
status: 1

station radar
type: PreferredTerm
modified: 2015-01-05T11:50:15+01:00
created: 2011-09-01T00:00:00+02:00
status: 1

mur - garde-corps - clôture
type: PreferredTerm
modified: 2015-02-25T10:27:09+01:00
created: 2011-09-01T00:00:00+02:00
status: 1

lieu d'assemblée au désert
type: SimpleNonPreferredTerm
modified: 2014-10-15T13:34:48+02:00
created: 2011-09-01T00:00:00+02:00
status: 1

sanctuaire de plein air
type: PreferredTerm
modified: 2014-10-15T13:34:48+02:00
created: 2011-09-01T00:00:00+02:00
status: 1

établissement portuaire
type: PreferredTerm
modified: 2014-11-28T16:51:57+01:00
created: 2011-09-01T00:00:00+02:00
status: 1

lanternon
type: PreferredTerm
modified: 2015-02-25T12:03:13+01:00
created: 2011-09-01T00:00:00+02:00
status: 1

jardins ouvriers
type: PreferredTerm
modified: 2014-12-31T10:50:41+01:00
created: 2011-09-01T00:00:00+02:00
status: 1

credence
type: PreferredTerm
modified: 2014-10-15T17:32:23+02:00
created: 2011-09-01T00:00:00+02:00
status: 1

niche-crédence
type: PreferredTerm
modified: 2014-10-15T17:32:23+02:00
created: 2011-09-01T00:00:00+02:00
status: 1

tabernacolo
type: PreferredTerm
modified: 2014-10-15T17:32:23+02:00
created: 2011-09-01T00:00:00+02:00
status: 1

oppidum
type: PreferredTerm
modified: 2015-01-05T12:14:48+01:00
created: 2011-09-01T00:00:00+02:00
status: 1

usine de construction automobile
type: PreferredTerm
modified: 2015-04-28T15:23:56+02:00
created: 2011-09-01T00:00:00+02:00
status: 1

escalier d'honneur
type: PreferredTerm
modified: 2015-02-25T12:51:37+01:00
created: 2011-09-01T00:00:00+02:00
status: 1

table d'orientation
type: PreferredTerm
modified: 2014-10-09T13:07:00+02:00
created: 2011-09-01T00:00:00+02:00
status: 1

gare de chemin de fer
type: SimpleNonPreferredTerm
modified: 2014-11-28T16:55:48+01:00
created: 2011-09-01T00:00:00+02:00
status: 1

gare
type: PreferredTerm
modified: 2014-11-28T16:55:48+01:00
created: 2011-09-01T00:00:00+02:00
status: 1

architecture industrielle
type: PreferredTerm
modified: 2013-04-23T00:00:00+02:00
created: 2011-09-01T00:00:00+02:00
status: 1

toboggan de manutention
type: PreferredTerm
modified: 2014-10-22T12:58:46+02:00
created: 2011-09-01T00:00:00+02:00
status: 1

épi
type: PreferredTerm
modified: 2014-10-16T14:49:52+02:00
created: 2011-09-01T00:00:00+02:00
status: 1

usine de porcelaine
type: PreferredTerm
modified: 2015-01-27T15:48:43+01:00
created: 2011-09-01T00:00:00+02:00
status: 1

portique de jardin
type: PreferredTerm
modified: 2014-12-30T15:36:33+01:00
created: 2011-09-01T00:00:00+02:00
status: 1

séchoir à maïs
type: PreferredTerm
modified: 2015-02-26T12:01:16+01:00
created: 2011-09-01T00:00:00+02:00
status: 1

usine de traitement thermique des métaux
type: PreferredTerm
modified: 2015-03-16T11:54:38+01:00
created: 2011-09-01T00:00:00+02:00
status: 1

élévation intérieure
type: PreferredTerm
modified: 2015-02-25T14:01:29+01:00
created: 2011-09-01T00:00:00+02:00
status: 1

usine de bimbeloterie
type: PreferredTerm
modified: 2015-03-11T13:18:44+01:00
created: 2011-09-01T00:00:00+02:00
status: 1

ville neuve
type: PreferredTerm
modified: 2014-10-17T14:25:16+02:00
created: 2011-09-01T00:00:00+02:00
status: 1

bains douches
type: PreferredTerm
modified: 2014-10-10T10:24:51+02:00
created: 2011-09-01T00:00:00+02:00
status: 1

collège
type: PreferredTerm
modified: 2014-12-01T16:25:13+01:00
created: 2011-09-01T00:00:00+02:00
status: 1

barrage mobile
type: PreferredTerm
modified: 2014-12-01T14:04:06+01:00
created: 2011-09-01T00:00:00+02:00
status: 1

portereau
type: SimpleNonPreferredTerm
modified: 2014-12-01T14:04:06+01:00
created: 2011-09-01T00:00:00+02:00
status: 1

barrage à niveau constant
type: SimpleNonPreferredTerm
modified: 2014-12-01T14:04:06+01:00
created: 2011-09-01T00:00:00+02:00
status: 1

pertuis
type: SimpleNonPreferredTerm
modified: 2014-12-01T14:04:06+01:00
created: 2011-09-01T00:00:00+02:00
status: 1

base sous-marine
type: PreferredTerm
modified: 2014-10-14T15:58:40+02:00
created: 2011-09-01T00:00:00+02:00
status: 1

usine de caoutchouc
type: PreferredTerm
modified: 2015-02-09T12:42:41+01:00
created: 2011-09-01T00:00:00+02:00
status: 1

rampe de lancement
type: PreferredTerm
modified: 2014-10-21T14:04:05+02:00
created: 2011-09-01T00:00:00+02:00
status: 1

ascenseur
type: PreferredTerm
modified: 2015-02-25T12:40:42+01:00
created: 2011-09-01T00:00:00+02:00
status: 1

monte-charge
type: SimpleNonPreferredTerm
modified: 2015-02-25T12:40:42+01:00
created: 2011-09-01T00:00:00+02:00
status: 1

cage d'ascenseur
type: SimpleNonPreferredTerm
modified: 2015-02-25T12:40:42+01:00
created: 2011-09-01T00:00:00+02:00
status: 1

station d'épuration
type: PreferredTerm
modified: 2014-11-28T16:32:13+01:00
created: 2011-09-01T00:00:00+02:00
status: 1

bibliothèque
type: PreferredTerm
modified: 2014-12-12T14:32:30+01:00
created: 2011-09-01T00:00:00+02:00
status: 1

médiathèque
type: SimpleNonPreferredTerm
modified: 2014-12-12T14:32:30+01:00
created: 2011-09-01T00:00:00+02:00
status: 1

bastillon
type: PreferredTerm
modified: 2015-01-05T12:25:43+01:00
created: 2011-09-01T00:00:00+02:00
status: 1

relais de télécommunication
type: PreferredTerm
modified: 2014-10-16T15:34:30+02:00
created: 2011-09-01T00:00:00+02:00
status: 1

fenêtre
type: PreferredTerm
modified: 2015-02-24T16:47:04+01:00
created: 2011-09-01T00:00:00+02:00
status: 1

cirque
type: PreferredTerm
modified: 2014-12-19T11:14:16+01:00
created: 2011-09-01T00:00:00+02:00
status: 1

usine de matériel d'équipement industriel
type: PreferredTerm
modified: 2015-01-30T16:10:04+01:00
created: 2011-09-01T00:00:00+02:00
status: 1

auberge de jeunesse
type: PreferredTerm
modified: 2014-12-12T14:29:40+01:00
created: 2011-09-01T00:00:00+02:00
status: 1

ville satellite
type: PreferredTerm
modified: 2014-10-17T14:26:29+02:00
created: 2011-09-01T00:00:00+02:00
status: 1

balcon
type: PreferredTerm
modified: 2015-02-25T10:14:33+01:00
created: 2011-09-01T00:00:00+02:00
status: 1

bains publics
type: PreferredTerm
modified: 2014-12-18T15:10:53+01:00
created: 2011-09-01T00:00:00+02:00
status: 1

usine de tabletterie
type: PreferredTerm
modified: 2015-03-12T17:14:50+01:00
created: 2011-09-01T00:00:00+02:00
status: 1

tonnellerie
type: PreferredTerm
modified: 2015-03-11T12:51:29+01:00
created: 2011-09-01T00:00:00+02:00
status: 1

champ de bataille
type: PreferredTerm
modified: 2015-01-05T12:04:08+01:00
created: 2011-09-01T00:00:00+02:00
status: 1

usine d'acide sulfurique
type: PreferredTerm
modified: 2015-02-09T11:44:50+01:00
created: 2011-09-01T00:00:00+02:00
status: 1

coursière
type: PreferredTerm
modified: 2015-02-25T12:46:46+01:00
created: 2011-09-01T00:00:00+02:00
status: 1

lycée
type: PreferredTerm
modified: 2014-12-01T16:27:30+01:00
created: 2011-09-01T00:00:00+02:00
status: 1

couloir
type: PreferredTerm
modified: 2015-02-25T12:42:14+01:00
created: 2011-09-01T00:00:00+02:00
status: 1

aire de stockage du combustible
type: PreferredTerm
modified: 2015-04-30T16:23:22+02:00
created: 2011-09-01T00:00:00+02:00
status: 1

poste de guet
type: SimpleNonPreferredTerm
modified: 2015-01-05T13:33:16+01:00
created: 2011-09-01T00:00:00+02:00
status: 1

poste d'observation
type: PreferredTerm
modified: 2015-01-05T13:33:16+01:00
created: 2011-09-01T00:00:00+02:00
status: 1

observatoire d'artillerie
type: SimpleNonPreferredTerm
modified: 2015-01-05T13:33:16+01:00
created: 2011-09-01T00:00:00+02:00
status: 1

remonte-pente
type: SimpleNonPreferredTerm
modified: 2014-10-16T15:35:30+02:00
created: 2011-09-01T00:00:00+02:00
status: 1

remontée mécanique
type: PreferredTerm
modified: 2014-10-16T15:35:30+02:00
created: 2011-09-01T00:00:00+02:00
status: 1

édicule fortifié
type: SimpleNonPreferredTerm
modified: 2015-01-05T13:31:56+01:00
created: 2011-09-01T00:00:00+02:00
status: 1

ouvrage fortifié
type: PreferredTerm
modified: 2015-01-05T13:31:56+01:00
created: 2011-09-01T00:00:00+02:00
status: 1

opéra
type: PreferredTerm
modified: 2014-12-19T11:15:09+01:00
created: 2011-09-01T00:00:00+02:00
status: 1

baie
type: PreferredTerm
modified: 2015-02-24T16:40:39+01:00
created: 2011-09-01T00:00:00+02:00
status: 1

enclos
type: PreferredTerm
modified: 2015-02-25T14:28:53+01:00
created: 2011-09-01T00:00:00+02:00
status: 1

usine de contre-plaqué
type: PreferredTerm
modified: 2015-03-12T15:31:43+01:00
created: 2011-09-01T00:00:00+02:00
status: 1

usine électrométallurgique
type: PreferredTerm
modified: 2015-03-16T11:09:22+01:00
created: 2011-09-01T00:00:00+02:00
status: 1

faisanderie
type: PreferredTerm
modified: 2014-12-30T14:28:09+01:00
created: 2011-09-01T00:00:00+02:00
status: 1

établissement de bains
type: PreferredTerm
modified: 2014-09-08T11:48:18+02:00
created: 2011-09-01T00:00:00+02:00
status: 1

abbazia
type: PreferredTerm
modified: 2014-11-27T16:51:04+01:00
created: 2011-09-01T00:00:00+02:00
status: 1

abbey
type: PreferredTerm
modified: 2014-11-27T16:51:04+01:00
created: 2011-09-01T00:00:00+02:00
status: 1

abbeys
type: PreferredTerm
modified: 2014-11-27T16:51:04+01:00
created: 2011-09-01T00:00:00+02:00
status: 1

abbaye
type: PreferredTerm
modified: 2014-11-27T16:51:04+01:00
created: 2011-09-01T00:00:00+02:00
status: 1

ensemble castral
type: PreferredTerm
modified: 2015-01-05T12:06:33+01:00
created: 2011-09-01T00:00:00+02:00
status: 1

petit séminaire
type: PreferredTerm
modified: 2014-12-01T16:31:04+01:00
created: 2011-09-01T00:00:00+02:00
status: 1

aumônerie
type: PreferredTerm
modified: 2015-01-02T11:23:11+01:00
created: 2011-09-01T00:00:00+02:00
status: 1

ensemble domestique
type: PreferredTerm
modified: 2014-12-31T13:57:51+01:00
created: 2011-09-01T00:00:00+02:00
status: 1

quai
type: PreferredTerm
modified: 2014-12-02T14:44:08+01:00
created: 2011-09-01T00:00:00+02:00
status: 1

voussure
type: PreferredTerm
modified: 2015-02-24T17:34:58+01:00
created: 2011-09-01T00:00:00+02:00
status: 1

caisse d'épargne
type: PreferredTerm
modified: 2015-01-02T10:52:41+01:00
created: 2011-09-01T00:00:00+02:00
status: 1

ensemble religieux
type: PreferredTerm
modified: 2013-04-23T00:00:00+02:00
created: 2011-09-01T00:00:00+02:00
status: 1

religious communities
type: PreferredTerm
modified: 2013-04-23T00:00:00+02:00
created: 2011-09-01T00:00:00+02:00
status: 1

collège universitaire
type: PreferredTerm
modified: 2014-09-22T17:45:22+02:00
created: 2011-09-01T00:00:00+02:00
status: 1

usine de cycles
type: PreferredTerm
modified: 2015-01-29T16:33:57+01:00
created: 2011-09-01T00:00:00+02:00
status: 1

salle de concert
type: PreferredTerm
modified: 2014-12-19T11:16:17+01:00
created: 2011-09-01T00:00:00+02:00
status: 1

absidiole
type: PreferredTerm
modified: 2015-02-25T11:19:39+01:00
created: 2011-09-01T00:00:00+02:00
status: 1

centre culturel
type: PreferredTerm
modified: 2014-10-09T13:22:06+02:00
created: 2011-09-01T00:00:00+02:00
status: 1

maison de la culture
type: SimpleNonPreferredTerm
modified: 2014-10-09T13:22:06+02:00
created: 2011-09-01T00:00:00+02:00
status: 1

bow window
type: SimpleNonPreferredTerm
modified: 2015-02-25T14:02:49+01:00
created: 2011-09-01T00:00:00+02:00
status: 1

oriel
type: PreferredTerm
modified: 2015-02-25T14:02:49+01:00
created: 2011-09-01T00:00:00+02:00
status: 1

usine de boissellerie
type: PreferredTerm
modified: 2015-03-12T14:47:20+01:00
created: 2011-09-01T00:00:00+02:00
status: 1

usine de traitement de surface des métaux
type: PreferredTerm
modified: 2015-03-16T11:44:47+01:00
created: 2011-09-01T00:00:00+02:00
status: 1

porte de garde
type: PreferredTerm
modified: 2014-12-02T13:09:02+01:00
created: 2011-09-01T00:00:00+02:00
status: 1

monastère
type: SimpleNonPreferredTerm
modified: 2014-11-27T15:51:01+01:00
created: 2011-09-01T00:00:00+02:00
status: 1

établissement conventuel
type: PreferredTerm
modified: 2014-11-27T15:51:01+01:00
created: 2011-09-01T00:00:00+02:00
status: 1

casa religiosa
type: PreferredTerm
modified: 2014-11-27T15:51:01+01:00
created: 2011-09-01T00:00:00+02:00
status: 1

religious house
type: PreferredTerm
modified: 2014-11-27T15:51:01+01:00
created: 2011-09-01T00:00:00+02:00
status: 1

christian + religious communities
type: PreferredTerm
modified: 2014-11-27T15:51:01+01:00
created: 2011-09-01T00:00:00+02:00
status: 1

école technique
type: SimpleNonPreferredTerm
modified: 2014-12-01T15:56:24+01:00
created: 2011-09-01T00:00:00+02:00
status: 1

lycée technique
type: SimpleNonPreferredTerm
modified: 2014-12-01T15:56:24+01:00
created: 2011-09-01T00:00:00+02:00
status: 1

école professionnelle
type: PreferredTerm
modified: 2014-12-01T15:56:24+01:00
created: 2011-09-01T00:00:00+02:00
status: 1

fortification
type: PreferredTerm
modified: 2014-10-14T15:56:16+02:00
created: 2011-09-01T00:00:00+02:00
status: 1

ensemble fortifié
type: SimpleNonPreferredTerm
modified: 2014-10-14T15:56:16+02:00
created: 2011-09-01T00:00:00+02:00
status: 1

usine d'articles en caoutchouc
type: PreferredTerm
modified: 2015-02-09T15:40:56+01:00
created: 2011-09-01T00:00:00+02:00
status: 1

architecture domestique
type: PreferredTerm
modified: 2013-04-23T00:00:00+02:00
created: 2011-09-01T00:00:00+02:00
status: 1

atelier de charité
type: PreferredTerm
modified: 2014-10-14T15:21:23+02:00
created: 2011-09-01T00:00:00+02:00
status: 1

théâtre
type: PreferredTerm
modified: 2014-12-19T11:17:04+01:00
created: 2011-09-01T00:00:00+02:00
status: 1

éléments de circulation
type: PreferredTerm
modified: 2013-04-23T00:00:00+02:00
created: 2011-09-01T00:00:00+02:00
status: 1

banque de France
type: PreferredTerm
modified: 2015-01-02T10:50:02+01:00
created: 2011-09-01T00:00:00+02:00
status: 1

usine de matériel agricole
type: PreferredTerm
modified: 2015-01-29T16:51:15+01:00
created: 2011-09-01T00:00:00+02:00
status: 1

abside
type: PreferredTerm
modified: 2015-02-25T11:14:30+01:00
created: 2011-09-01T00:00:00+02:00
status: 1

architecture religieuse
type: PreferredTerm
modified: 2013-04-23T00:00:00+02:00
created: 2011-09-01T00:00:00+02:00
status: 1

religious
type: PreferredTerm
modified: 2013-04-23T00:00:00+02:00
created: 2011-09-01T00:00:00+02:00
status: 1

embarcadère
type: PreferredTerm
modified: 2014-12-02T14:50:02+01:00
created: 2011-09-01T00:00:00+02:00
status: 1

débarcadère
type: SimpleNonPreferredTerm
modified: 2014-12-02T14:50:02+01:00
created: 2011-09-01T00:00:00+02:00
status: 1

casino
type: PreferredTerm
modified: 2014-12-12T14:33:58+01:00
created: 2011-09-01T00:00:00+02:00
status: 1

salle de jeu
type: SimpleNonPreferredTerm
modified: 2014-12-12T14:33:58+01:00
created: 2011-09-01T00:00:00+02:00
status: 1

laboratoire
type: PreferredTerm
modified: 2014-12-19T10:19:45+01:00
created: 2011-09-01T00:00:00+02:00
status: 1

laboratoire d'essais
type: SimpleNonPreferredTerm
modified: 2014-12-19T10:19:45+01:00
created: 2011-09-01T00:00:00+02:00
status: 1

bassin d'essais
type: SimpleNonPreferredTerm
modified: 2014-12-19T10:19:45+01:00
created: 2011-09-01T00:00:00+02:00
status: 1

usine de fibre de bois
type: PreferredTerm
modified: 2015-04-29T16:59:53+02:00
created: 2011-09-01T00:00:00+02:00
status: 1

hypermarché
type: PreferredTerm
modified: 2014-10-09T11:33:50+02:00
created: 2011-09-01T00:00:00+02:00
status: 1

sous-sol
type: PreferredTerm
modified: 2015-02-25T14:39:43+01:00
created: 2011-09-01T00:00:00+02:00
status: 1

cave
type: SimpleNonPreferredTerm
modified: 2015-02-25T14:39:43+01:00
created: 2011-09-01T00:00:00+02:00
status: 1

édifice à fonction non identifiée
type: PreferredTerm
modified: 2015-02-25T12:37:25+01:00
created: 2011-09-01T00:00:00+02:00
status: 1

édifice non identifié
type: SimpleNonPreferredTerm
modified: 2015-02-25T12:37:25+01:00
created: 2011-09-01T00:00:00+02:00
status: 1

réseau de trolleybus
type: PreferredTerm
modified: 2014-10-17T10:18:12+02:00
created: 2011-09-01T00:00:00+02:00
status: 1

terrain de jeu
type: PreferredTerm
modified: 2014-10-09T13:18:40+02:00
created: 2011-09-01T00:00:00+02:00
status: 1

forge catalane
type: PreferredTerm
modified: 2015-04-30T14:55:59+02:00
created: 2011-09-01T00:00:00+02:00
status: 1

clairière ornementale
type: PreferredTerm
modified: 2014-12-30T16:35:07+01:00
created: 2011-09-01T00:00:00+02:00
status: 1

pavement
type: PreferredTerm
modified: 2015-01-08T10:10:44+01:00
created: 2011-09-01T00:00:00+02:00
status: 1

trottoir
type: PreferredTerm
modified: 2015-01-08T10:10:44+01:00
created: 2011-09-01T00:00:00+02:00
status: 1

édicule à fonction non identifiée
type: PreferredTerm
modified: 2015-02-25T12:35:40+01:00
created: 2011-09-01T00:00:00+02:00
status: 1

ouvrage non identifié
type: SimpleNonPreferredTerm
modified: 2015-02-25T12:35:40+01:00
created: 2011-09-01T00:00:00+02:00
status: 1

édicule non identifié
type: SimpleNonPreferredTerm
modified: 2015-02-25T12:35:40+01:00
created: 2011-09-01T00:00:00+02:00
status: 1

pavillon
type: PreferredTerm
modified: 2015-02-25T16:33:30+01:00
created: 2011-09-01T00:00:00+02:00
status: 1

école supérieure
type: PreferredTerm
modified: 2014-12-01T17:19:48+01:00
created: 2011-09-01T00:00:00+02:00
status: 1

darse
type: PreferredTerm
modified: 2014-10-16T14:38:12+02:00
created: 2011-09-01T00:00:00+02:00
status: 1

édifice financier public
type: PreferredTerm
modified: 2013-04-23T00:00:00+02:00
created: 2011-09-01T00:00:00+02:00
status: 1

bief de navigation
type: SimpleNonPreferredTerm
modified: 2014-12-01T13:52:09+01:00
created: 2011-09-01T00:00:00+02:00
status: 1

bief
type: PreferredTerm
modified: 2014-12-01T13:52:09+01:00
created: 2011-09-01T00:00:00+02:00
status: 1

ensemble textile
type: PreferredTerm
modified: 2015-05-04T15:35:57+02:00
created: 2011-09-01T00:00:00+02:00
status: 1

parfumerie
type: PreferredTerm
modified: 2015-02-06T16:07:46+01:00
created: 2011-09-01T00:00:00+02:00
status: 1

poste d'aiguillage
type: PreferredTerm
modified: 2014-12-02T14:47:37+01:00
created: 2011-09-01T00:00:00+02:00
status: 1

résidence universitaire
type: SimpleNonPreferredTerm
modified: 2014-12-31T13:56:08+01:00
created: 2011-09-01T00:00:00+02:00
status: 1

cité universitaire
type: PreferredTerm
modified: 2014-12-31T13:56:08+01:00
created: 2011-09-01T00:00:00+02:00
status: 1

école
type: PreferredTerm
modified: 2014-12-01T15:31:21+01:00
created: 2011-09-01T00:00:00+02:00
status: 1

cour
type: PreferredTerm
modified: 2015-02-25T11:45:35+01:00
created: 2011-09-01T00:00:00+02:00
status: 1

cour d'honneur
type: SimpleNonPreferredTerm
modified: 2015-02-25T11:45:35+01:00
created: 2011-09-01T00:00:00+02:00
status: 1

jardin d'enfants
type: SimpleNonPreferredTerm
modified: 2014-12-01T15:38:29+01:00
created: 2011-09-01T00:00:00+02:00
status: 1

école maternelle
type: PreferredTerm
modified: 2014-12-01T15:38:29+01:00
created: 2011-09-01T00:00:00+02:00
status: 1

bassin d'échouage
type: PreferredTerm
modified: 2014-09-23T16:17:57+02:00
created: 2011-09-01T00:00:00+02:00
status: 1

barrière d'octroi
type: PreferredTerm
modified: 2015-01-02T11:15:03+01:00
created: 2011-09-01T00:00:00+02:00
status: 1

institut de recherche
type: PreferredTerm
modified: 2014-12-19T10:17:46+01:00
created: 2011-09-01T00:00:00+02:00
status: 1

usine d'ébénisterie
type: PreferredTerm
modified: 2015-04-29T16:56:28+02:00
created: 2011-09-01T00:00:00+02:00
status: 1

piste de glisse
type: PreferredTerm
modified: 2014-10-09T13:13:15+02:00
created: 2011-09-01T00:00:00+02:00
status: 1

carré de jardin
type: PreferredTerm
modified: 2014-10-22T10:16:18+02:00
created: 2011-09-01T00:00:00+02:00
status: 1

haut fourneau
type: PreferredTerm
modified: 2015-03-16T10:49:54+01:00
created: 2011-09-01T00:00:00+02:00
status: 1

étage
type: PreferredTerm
modified: 2014-10-16T11:25:17+02:00
created: 2011-09-01T00:00:00+02:00
status: 1

sentier
type: PreferredTerm
modified: 2015-01-08T10:07:39+01:00
created: 2011-09-01T00:00:00+02:00
status: 1

path
type: PreferredTerm
modified: 2015-01-08T10:07:39+01:00
created: 2011-09-01T00:00:00+02:00
status: 1

mur végétal
type: PreferredTerm
modified: 2014-10-16T11:33:40+02:00
created: 2011-09-01T00:00:00+02:00
status: 1

magasin coopératif
type: PreferredTerm
modified: 2014-12-05T10:18:10+01:00
created: 2011-09-01T00:00:00+02:00
status: 1

école normale d'instituteurs
type: SimpleNonPreferredTerm
modified: 2014-12-01T17:17:53+01:00
created: 2011-09-01T00:00:00+02:00
status: 1

école normale
type: PreferredTerm
modified: 2014-12-01T17:17:53+01:00
created: 2011-09-01T00:00:00+02:00
status: 1

voie navigable
type: PreferredTerm
modified: 2014-12-01T13:50:44+01:00
created: 2011-09-01T00:00:00+02:00
status: 1

usine de produits chimiques
type: PreferredTerm
modified: 2015-02-06T15:35:02+01:00
created: 2011-09-01T00:00:00+02:00
status: 1

radoub
type: SimpleNonPreferredTerm
modified: 2014-12-01T14:07:35+01:00
created: 2011-09-01T00:00:00+02:00
status: 1

cale sèche
type: SimpleNonPreferredTerm
modified: 2014-12-01T14:07:35+01:00
created: 2011-09-01T00:00:00+02:00
status: 1

bassin de radoub
type: PreferredTerm
modified: 2014-12-01T14:07:35+01:00
created: 2011-09-01T00:00:00+02:00
status: 1

forme de radoub
type: SimpleNonPreferredTerm
modified: 2014-12-01T14:07:35+01:00
created: 2011-09-01T00:00:00+02:00
status: 1

puits d'aérage
type: PreferredTerm
modified: 2015-04-30T17:08:28+02:00
created: 2011-09-01T00:00:00+02:00
status: 1

vigie
type: SimpleNonPreferredTerm
modified: 2014-10-16T15:44:57+02:00
created: 2011-09-01T00:00:00+02:00
status: 1

tour de contrôle
type: PreferredTerm
modified: 2014-10-16T15:44:57+02:00
created: 2011-09-01T00:00:00+02:00
status: 1

trompe d'architecture
type: PreferredTerm
modified: 2015-02-24T17:26:10+01:00
created: 2011-09-01T00:00:00+02:00
status: 1

campement
type: PreferredTerm
modified: 2014-12-31T13:51:13+01:00
created: 2011-09-01T00:00:00+02:00
status: 1

ensemble d'industrie chimique
type: PreferredTerm
modified: 2015-05-04T14:44:35+02:00
created: 2011-09-01T00:00:00+02:00
status: 1

motorway
type: PreferredTerm
modified: 2015-01-07T12:25:08+01:00
created: 2011-09-01T00:00:00+02:00
status: 1

autoroute
type: PreferredTerm
modified: 2015-01-07T12:25:08+01:00
created: 2011-09-01T00:00:00+02:00
status: 1

voie rapide
type: SimpleNonPreferredTerm
modified: 2015-01-07T12:25:08+01:00
created: 2011-09-01T00:00:00+02:00
status: 1

raffinerie de pétrole
type: PreferredTerm
modified: 2015-02-06T16:37:57+01:00
created: 2011-09-01T00:00:00+02:00
status: 1

ensemble fiscal ou financier
type: PreferredTerm
modified: 2013-04-23T00:00:00+02:00
created: 2011-09-01T00:00:00+02:00
status: 1

bassin à flot
type: PreferredTerm
modified: 2014-12-01T14:06:25+01:00
created: 2011-09-01T00:00:00+02:00
status: 1

école primaire
type: PreferredTerm
modified: 2014-12-01T15:50:17+01:00
created: 2011-09-01T00:00:00+02:00
status: 1

salle de danse
type: SimpleNonPreferredTerm
modified: 2014-12-19T10:14:34+01:00
created: 2011-09-01T00:00:00+02:00
status: 1

établissement de danse
type: PreferredTerm
modified: 2014-12-19T10:14:34+01:00
created: 2011-09-01T00:00:00+02:00
status: 1

dancing
type: SimpleNonPreferredTerm
modified: 2014-12-19T10:14:34+01:00
created: 2011-09-01T00:00:00+02:00
status: 1

usine de meubles
type: PreferredTerm
modified: 2015-04-29T17:15:18+02:00
created: 2011-09-01T00:00:00+02:00
status: 1

scierie
type: PreferredTerm
modified: 2015-03-11T12:37:27+01:00
created: 2011-09-01T00:00:00+02:00
status: 1

bas fourneau
type: PreferredTerm
modified: 2015-04-30T14:48:22+02:00
created: 2011-09-01T00:00:00+02:00
status: 1

réseau métropolitain
type: PreferredTerm
modified: 2014-10-17T10:14:46+02:00
created: 2011-09-01T00:00:00+02:00
status: 1

métro
type: SimpleNonPreferredTerm
modified: 2014-10-17T10:14:46+02:00
created: 2011-09-01T00:00:00+02:00
status: 1

atelier d'artiste
type: PreferredTerm
modified: 2014-12-12T14:28:45+01:00
created: 2011-09-01T00:00:00+02:00
status: 1

route
type: PreferredTerm
modified: 2015-01-07T13:25:27+01:00
created: 2011-09-01T00:00:00+02:00
status: 1

road 1
type: PreferredTerm
modified: 2015-01-07T13:25:27+01:00
created: 2011-09-01T00:00:00+02:00
status: 1

partie d'édifice scolaire
type: PreferredTerm
modified: 2014-12-08T12:00:22+01:00
created: 2011-09-01T00:00:00+02:00
status: 1

colonie pénitentiaire
type: PreferredTerm
modified: 2015-01-05T10:57:23+01:00
created: 2011-09-01T00:00:00+02:00
status: 1

camp pénitentiaire
type: SimpleNonPreferredTerm
modified: 2015-01-05T10:57:23+01:00
created: 2011-09-01T00:00:00+02:00
status: 1

voie ferrée
type: PreferredTerm
modified: 2014-12-01T13:47:49+01:00
created: 2011-09-01T00:00:00+02:00
status: 1

chemin de fer
type: SimpleNonPreferredTerm
modified: 2014-12-01T13:47:49+01:00
created: 2011-09-01T00:00:00+02:00
status: 1

superette
type: PreferredTerm
modified: 2014-12-05T10:19:00+01:00
created: 2011-09-01T00:00:00+02:00
status: 1

ruelle
type: SimpleNonPreferredTerm
modified: 2015-01-08T10:00:45+01:00
created: 2011-09-01T00:00:00+02:00
status: 1

rue intérieure
type: SimpleNonPreferredTerm
modified: 2015-01-08T10:00:45+01:00
created: 2011-09-01T00:00:00+02:00
status: 1

rue à cours d'eau axial
type: SimpleNonPreferredTerm
modified: 2015-01-08T10:00:45+01:00
created: 2011-09-01T00:00:00+02:00
status: 1

rue piétonne
type: SimpleNonPreferredTerm
modified: 2015-01-08T10:00:45+01:00
created: 2011-09-01T00:00:00+02:00
status: 1

viale
type: PreferredTerm
modified: 2015-01-08T10:00:45+01:00
created: 2011-09-01T00:00:00+02:00
status: 1

rue couverte
type: SimpleNonPreferredTerm
modified: 2015-01-08T10:00:45+01:00
created: 2011-09-01T00:00:00+02:00
status: 1

rue
type: PreferredTerm
modified: 2015-01-08T10:00:45+01:00
created: 2011-09-01T00:00:00+02:00
status: 1

street
type: PreferredTerm
modified: 2015-01-08T10:00:45+01:00
created: 2011-09-01T00:00:00+02:00
status: 1

funérarium
type: PreferredTerm
modified: 2014-10-15T13:01:54+02:00
created: 2011-09-01T00:00:00+02:00
status: 1

abri
type: PreferredTerm
modified: 2014-12-31T12:11:26+01:00
created: 2011-09-01T00:00:00+02:00
status: 1

puits d'extraction
type: PreferredTerm
modified: 2015-04-08T15:34:58+02:00
created: 2011-09-01T00:00:00+02:00
status: 1

ensemble d'industrie du bois
type: PreferredTerm
modified: 2015-05-04T14:47:21+02:00
created: 2011-09-01T00:00:00+02:00
status: 1

pont mobile
type: PreferredTerm
modified: 2014-12-02T13:08:17+01:00
created: 2011-09-01T00:00:00+02:00
status: 1

pont basculant
type: SimpleNonPreferredTerm
modified: 2014-12-02T13:08:17+01:00
created: 2011-09-01T00:00:00+02:00
status: 1

pont tournant
type: SimpleNonPreferredTerm
modified: 2014-12-02T13:08:17+01:00
created: 2011-09-01T00:00:00+02:00
status: 1

pont transbordeur
type: SimpleNonPreferredTerm
modified: 2014-12-02T13:08:17+01:00
created: 2011-09-01T00:00:00+02:00
status: 1

puits de service
type: PreferredTerm
modified: 2015-04-08T15:41:55+02:00
created: 2011-09-01T00:00:00+02:00
status: 1

guest house
type: PreferredTerm
modified: 2014-11-28T14:55:56+01:00
created: 2011-09-01T00:00:00+02:00
status: 1

foresteria
type: PreferredTerm
modified: 2014-11-28T14:55:56+01:00
created: 2011-09-01T00:00:00+02:00
status: 1

hôtellerie
type: PreferredTerm
modified: 2014-11-28T14:55:56+01:00
created: 2011-09-01T00:00:00+02:00
status: 1

guesthouses
type: PreferredTerm
modified: 2014-11-28T14:55:56+01:00
created: 2011-09-01T00:00:00+02:00
status: 1

bassin de port
type: PreferredTerm
modified: 2014-12-01T14:05:20+01:00
created: 2011-09-01T00:00:00+02:00
status: 1

architecture fiscale ou financière
type: PreferredTerm
modified: 2013-04-23T00:00:00+02:00
created: 2011-09-01T00:00:00+02:00
status: 1

usine de cosmétiques
type: PreferredTerm
modified: 2015-02-06T16:20:55+01:00
created: 2011-09-01T00:00:00+02:00
status: 1

forge anglaise
type: PreferredTerm
modified: 2015-04-30T14:51:48+02:00
created: 2011-09-01T00:00:00+02:00
status: 1

établissement thermal
type: PreferredTerm
modified: 2014-12-19T10:11:20+01:00
created: 2011-09-01T00:00:00+02:00
status: 1

usine de menuiserie
type: PreferredTerm
modified: 2015-03-12T16:26:46+01:00
created: 2011-09-01T00:00:00+02:00
status: 1

école secondaire
type: PreferredTerm
modified: 2014-12-01T16:16:19+01:00
created: 2011-09-01T00:00:00+02:00
status: 1

cours
type: SimpleNonPreferredTerm
modified: 2015-01-07T13:22:44+01:00
created: 2011-09-01T00:00:00+02:00
status: 1

promenade de bord de mer
type: SimpleNonPreferredTerm
modified: 2015-01-07T13:22:44+01:00
created: 2011-09-01T00:00:00+02:00
status: 1

promenade
type: PreferredTerm
modified: 2015-01-07T13:22:44+01:00
created: 2011-09-01T00:00:00+02:00
status: 1

promenades
type: PreferredTerm
modified: 2015-01-07T13:22:43+01:00
created: 2011-09-01T00:00:00+02:00
status: 1

passeggiata
type: PreferredTerm
modified: 2015-01-07T13:22:43+01:00
created: 2011-09-01T00:00:00+02:00
status: 1

promenade
type: PreferredTerm
modified: 2015-01-07T13:22:44+01:00
created: 2011-09-01T00:00:00+02:00
status: 1

centre d'archives
type: PreferredTerm
modified: 2014-12-12T14:40:02+01:00
created: 2011-09-01T00:00:00+02:00
status: 1

camp de concentration
type: PreferredTerm
modified: 2015-01-05T10:55:46+01:00
created: 2011-09-01T00:00:00+02:00
status: 1

camp d'internement
type: SimpleNonPreferredTerm
modified: 2015-01-05T10:55:46+01:00
created: 2011-09-01T00:00:00+02:00
status: 1

fondations et sol
type: PreferredTerm
modified: 2015-02-25T10:22:43+01:00
created: 2011-09-01T00:00:00+02:00
status: 1

réseau routier
type: PreferredTerm
modified: 2014-10-17T10:12:45+02:00
created: 2011-09-01T00:00:00+02:00
status: 1

université
type: PreferredTerm
modified: 2014-12-01T17:22:10+01:00
created: 2011-09-01T00:00:00+02:00
status: 1

pièce
type: PreferredTerm
modified: 2015-02-25T16:40:10+01:00
created: 2011-09-01T00:00:00+02:00
status: 1

site d'écluse
type: PreferredTerm
modified: 2014-12-01T13:33:27+01:00
created: 2011-09-01T00:00:00+02:00
status: 1

supermarché
type: PreferredTerm
modified: 2014-12-05T10:23:02+01:00
created: 2011-09-01T00:00:00+02:00
status: 1

édifice d'habitation
type: SimpleNonPreferredTerm
modified: 2013-04-23T00:00:00+02:00
created: 2011-09-01T00:00:00+02:00
status: 1

édifice domestique
type: PreferredTerm
modified: 2013-04-23T00:00:00+02:00
created: 2011-09-01T00:00:00+02:00
status: 1

tour d'observation
type: SimpleNonPreferredTerm
modified: 2014-10-16T15:32:12+02:00
created: 2011-09-01T00:00:00+02:00
status: 1

poste de commande
type: PreferredTerm
modified: 2014-10-16T15:32:12+02:00
created: 2011-09-01T00:00:00+02:00
status: 1

ensemble d'industrie agro-alimentaire
type: PreferredTerm
modified: 2015-05-04T14:38:26+02:00
created: 2011-09-01T00:00:00+02:00
status: 1

ensemble d'industrie alimentaire
type: SimpleNonPreferredTerm
modified: 2015-05-04T14:38:26+02:00
created: 2011-09-01T00:00:00+02:00
status: 1

garderie d'enfants
type: PreferredTerm
modified: 2015-01-02T11:39:51+01:00
created: 2011-09-01T00:00:00+02:00
status: 1

crèche familiale
type: SimpleNonPreferredTerm
modified: 2015-01-02T11:39:51+01:00
created: 2013-12-20T16:39:34+01:00
status: 1

crèche collective
type: SimpleNonPreferredTerm
modified: 2015-01-02T11:39:51+01:00
created: 2011-09-01T00:00:00+02:00
status: 1

tour de forage
type: SimpleNonPreferredTerm
modified: 2015-03-27T11:46:36+01:00
created: 2011-09-01T00:00:00+02:00
status: 1

derrick
type: PreferredTerm
modified: 2015-03-27T11:46:36+01:00
created: 2011-09-01T00:00:00+02:00
status: 1

tour de télégraphe
type: SimpleNonPreferredTerm
modified: 2014-10-23T13:08:43+02:00
created: 2011-09-01T00:00:00+02:00
status: 1

station de télégraphe
type: PreferredTerm
modified: 2014-10-23T13:08:43+02:00
created: 2011-09-01T00:00:00+02:00
status: 1

usine d'extraction
type: PreferredTerm
modified: 2015-04-28T14:19:18+02:00
created: 2011-09-01T00:00:00+02:00
status: 1

usine de pâtes alimentaires
type: PreferredTerm
modified: 2015-02-04T15:37:23+01:00
created: 2011-09-01T00:00:00+02:00
status: 1

préfecture
type: PreferredTerm
modified: 2014-12-05T12:25:05+01:00
created: 2011-09-01T00:00:00+02:00
status: 1

rocher artificiel
type: PreferredTerm
modified: 2014-12-30T15:37:54+01:00
created: 2011-09-01T00:00:00+02:00
status: 1

établissement aéronautique
type: PreferredTerm
modified: 2014-10-23T11:58:55+02:00
created: 2011-09-01T00:00:00+02:00
status: 1

marché
type: PreferredTerm
modified: 2014-12-05T10:24:55+01:00
created: 2011-09-01T00:00:00+02:00
status: 1

aire des produits manufacturés
type: PreferredTerm
modified: 2015-03-24T15:15:01+01:00
created: 2011-09-01T00:00:00+02:00
status: 1

muette
type: PreferredTerm
modified: 2014-12-30T16:03:56+01:00
created: 2011-09-01T00:00:00+02:00
status: 1

chemin de croix extérieur
type: SimpleNonPreferredTerm
modified: 2015-02-24T12:12:46+01:00
created: 2011-09-01T00:00:00+02:00
status: 1

mont calvaire
type: PreferredTerm
modified: 2015-02-24T12:12:46+01:00
created: 2011-09-01T00:00:00+02:00
status: 1

via crucis
type: PreferredTerm
modified: 2015-02-24T12:12:46+01:00
created: 2011-09-01T00:00:00+02:00
status: 1

réseau de tramway
type: PreferredTerm
modified: 2014-10-17T10:13:52+02:00
created: 2011-09-01T00:00:00+02:00
status: 1

nymphée
type: PreferredTerm
modified: 2014-12-30T16:05:57+01:00
created: 2011-09-01T00:00:00+02:00
status: 1

établissement de vins spéciaux
type: PreferredTerm
modified: 2015-04-29T14:54:31+02:00
created: 2011-09-01T00:00:00+02:00
status: 1

grotte ornée
type: PreferredTerm
modified: 2014-10-23T10:23:41+02:00
created: 2011-09-01T00:00:00+02:00
status: 1

caverna decorata
type: PreferredTerm
modified: 2014-10-23T10:23:41+02:00
created: 2011-09-01T00:00:00+02:00
status: 1

cave + rock art
type: PreferredTerm
modified: 2014-10-23T10:23:41+02:00
created: 2011-09-01T00:00:00+02:00
status: 1

parterre d'eau
type: PreferredTerm
modified: 2014-12-31T10:23:26+01:00
created: 2011-09-01T00:00:00+02:00
status: 1

forêt
type: PreferredTerm
modified: 2014-12-30T16:24:26+01:00
created: 2011-09-01T00:00:00+02:00
status: 1

café
type: PreferredTerm
modified: 2014-12-04T16:00:12+01:00
created: 2011-09-01T00:00:00+02:00
status: 1

bar
type: SimpleNonPreferredTerm
modified: 2014-12-04T16:00:12+01:00
created: 2011-09-01T00:00:00+02:00
status: 1

usine de papeterie
type: PreferredTerm
modified: 2015-04-28T15:52:23+02:00
created: 2011-09-01T00:00:00+02:00
status: 1

loge maçonnique
type: SimpleNonPreferredTerm
modified: 2014-12-12T11:04:07+01:00
created: 2011-09-01T00:00:00+02:00
status: 1

temple maçonnique
type: PreferredTerm
modified: 2014-12-12T11:04:07+01:00
created: 2011-09-01T00:00:00+02:00
status: 1

cuvage
type: PreferredTerm
modified: 2014-12-30T14:14:41+01:00
created: 2011-09-01T00:00:00+02:00
status: 1

station de villégiature
type: PreferredTerm
modified: 2015-01-07T11:38:22+01:00
created: 2011-09-01T00:00:00+02:00
status: 1

réservoir industriel
type: PreferredTerm
modified: 2015-04-09T11:23:52+02:00
created: 2011-09-01T00:00:00+02:00
status: 1

bureau de douane
type: PreferredTerm
modified: 2015-01-02T11:04:43+01:00
created: 2011-09-01T00:00:00+02:00
status: 1

douane
type: SimpleNonPreferredTerm
modified: 2015-01-02T11:04:43+01:00
created: 2011-09-01T00:00:00+02:00
status: 1

hôtel des douanes
type: SimpleNonPreferredTerm
modified: 2015-01-02T11:04:43+01:00
created: 2011-09-01T00:00:00+02:00
status: 1

terrain de sport
type: SimpleNonPreferredTerm
modified: 2014-12-18T15:08:32+01:00
created: 2011-09-01T00:00:00+02:00
status: 1

terrain de rugby
type: SimpleNonPreferredTerm
modified: 2014-12-18T15:08:32+01:00
created: 2011-09-01T00:00:00+02:00
status: 1

stade
type: PreferredTerm
modified: 2014-12-18T15:08:32+01:00
created: 2011-09-01T00:00:00+02:00
status: 1

stade d'athlétisme
type: SimpleNonPreferredTerm
modified: 2014-12-18T15:08:32+01:00
created: 2011-09-01T00:00:00+02:00
status: 1

stade de football
type: SimpleNonPreferredTerm
modified: 2014-12-18T15:08:32+01:00
created: 2011-09-01T00:00:00+02:00
status: 1

centre-ville
type: PreferredTerm
modified: 2015-01-08T10:37:56+01:00
created: 2011-09-01T00:00:00+02:00
status: 1

cokerie
type: PreferredTerm
modified: 2015-03-27T11:24:30+01:00
created: 2011-09-01T00:00:00+02:00
status: 1

sémaphore
type: PreferredTerm
modified: 2014-12-02T15:03:25+01:00
created: 2011-09-01T00:00:00+02:00
status: 1

établissement pour les handicapés physiques
type: PreferredTerm
modified: 2014-10-20T09:52:09+02:00
created: 2011-09-01T00:00:00+02:00
status: 1

court de tennis
type: PreferredTerm
modified: 2014-10-09T13:40:17+02:00
created: 2011-09-01T00:00:00+02:00
status: 1

ambassade
type: PreferredTerm
modified: 2014-10-09T11:54:39+02:00
created: 2011-09-01T00:00:00+02:00
status: 1

sous-préfecture
type: PreferredTerm
modified: 2014-12-05T12:26:49+01:00
created: 2011-09-01T00:00:00+02:00
status: 1

rotonde de jardin
type: PreferredTerm
modified: 2014-12-30T15:39:08+01:00
created: 2011-09-01T00:00:00+02:00
status: 1

usine de moutarde
type: PreferredTerm
modified: 2015-04-29T15:38:01+02:00
created: 2011-09-01T00:00:00+02:00
status: 1

bordel
type: SimpleNonPreferredTerm
modified: 2014-10-06T15:25:15+02:00
created: 2011-09-01T00:00:00+02:00
status: 1

maison close
type: PreferredTerm
modified: 2014-10-06T15:25:15+02:00
created: 2011-09-01T00:00:00+02:00
status: 1

carrière
type: PreferredTerm
modified: 2015-01-15T16:39:54+01:00
created: 2011-09-01T00:00:00+02:00
status: 1

aérogare
type: PreferredTerm
modified: 2014-11-28T16:14:35+01:00
created: 2011-09-01T00:00:00+02:00
status: 1

ménagerie
type: PreferredTerm
modified: 2014-12-30T16:02:00+01:00
created: 2011-09-01T00:00:00+02:00
status: 1

atelier de conditionnement
type: PreferredTerm
modified: 2015-03-24T15:57:43+01:00
created: 2011-09-01T00:00:00+02:00
status: 1

ensemble cathédral
type: SimpleNonPreferredTerm
modified: 2014-10-23T10:35:27+02:00
created: 2011-09-01T00:00:00+02:00
status: 1

closes
type: PreferredTerm
modified: 2014-10-23T10:35:27+02:00
created: 2011-09-01T00:00:00+02:00
status: 1

groupe cathédral
type: SimpleNonPreferredTerm
modified: 2014-10-23T10:35:27+02:00
created: 2011-09-01T00:00:00+02:00
status: 1

groupe épiscopal
type: PreferredTerm
modified: 2014-10-23T10:35:27+02:00
created: 2011-09-01T00:00:00+02:00
status: 1

cathedral close
type: PreferredTerm
modified: 2014-10-23T10:35:27+02:00
created: 2011-09-01T00:00:00+02:00
status: 1

coopérative vinicole
type: SimpleNonPreferredTerm
modified: 2015-04-29T14:50:28+02:00
created: 2011-09-01T00:00:00+02:00
status: 1

établissement vinicole
type: PreferredTerm
modified: 2015-04-29T14:50:28+02:00
created: 2011-09-01T00:00:00+02:00
status: 1

réseau ferré
type: PreferredTerm
modified: 2014-10-17T10:10:26+02:00
created: 2011-09-01T00:00:00+02:00
status: 1

peulvan
type: SimpleNonPreferredTerm
modified: 2015-02-24T16:20:16+01:00
created: 2011-09-01T00:00:00+02:00
status: 1

peulven
type: SimpleNonPreferredTerm
modified: 2015-02-24T16:20:16+01:00
created: 2011-09-01T00:00:00+02:00
status: 1

statue-menhir
type: SimpleNonPreferredTerm
modified: 2015-02-24T16:20:16+01:00
created: 2011-09-01T00:00:00+02:00
status: 1

menhir
type: PreferredTerm
modified: 2015-02-24T16:20:16+01:00
created: 2011-09-01T00:00:00+02:00
status: 1

standing stone 2
type: PreferredTerm
modified: 2015-02-24T16:20:16+01:00
created: 2011-09-01T00:00:00+02:00
status: 1

menhir
type: PreferredTerm
modified: 2015-02-24T16:20:16+01:00
created: 2011-09-01T00:00:00+02:00
status: 1

édicule de l'administration ou de la vie publique
type: PreferredTerm
modified: 2013-04-23T00:00:00+02:00
created: 2011-09-01T00:00:00+02:00
status: 1

buvette
type: PreferredTerm
modified: 2014-10-06T13:07:03+02:00
created: 2011-09-01T00:00:00+02:00
status: 1

étable
type: PreferredTerm
modified: 2014-12-30T14:25:48+01:00
created: 2011-09-01T00:00:00+02:00
status: 1

station climatique
type: PreferredTerm
modified: 2014-10-17T10:45:04+02:00
created: 2011-09-01T00:00:00+02:00
status: 1

centre aéré
type: PreferredTerm
modified: 2014-10-17T15:50:02+02:00
created: 2011-09-01T00:00:00+02:00
status: 1

lieu de prière
type: PreferredTerm
modified: 2014-10-15T13:51:16+02:00
created: 2011-09-01T00:00:00+02:00
status: 1

miroir d'eau
type: PreferredTerm
modified: 2014-12-31T10:21:54+01:00
created: 2011-09-01T00:00:00+02:00
status: 1

groupe d'arbres
type: PreferredTerm
modified: 2014-12-30T16:25:42+01:00
created: 2011-09-01T00:00:00+02:00
status: 1

cartonnerie
type: PreferredTerm
modified: 2015-04-28T15:59:08+02:00
created: 2011-09-01T00:00:00+02:00
status: 1

puits de sondage
type: PreferredTerm
modified: 2013-04-23T00:00:00+02:00
created: 2011-09-01T00:00:00+02:00
status: 1

bureau d'octroi
type: PreferredTerm
modified: 2015-01-02T11:03:28+01:00
created: 2011-09-01T00:00:00+02:00
status: 1

espace public à usage privé
type: PreferredTerm
modified: 2015-01-07T12:03:26+01:00
created: 2011-09-01T00:00:00+02:00
status: 1

usoir
type: SimpleNonPreferredTerm
modified: 2015-01-07T12:03:26+01:00
created: 2011-09-01T00:00:00+02:00
status: 1

foro
type: PreferredTerm
modified: 2014-10-17T15:00:26+02:00
created: 2011-09-01T00:00:00+02:00
status: 1

forum
type: PreferredTerm
modified: 2014-10-17T15:00:26+02:00
created: 2011-09-01T00:00:00+02:00
status: 1

forum
type: PreferredTerm
modified: 2014-10-17T15:00:25+02:00
created: 2011-09-01T00:00:00+02:00
status: 1

ouvroir
type: PreferredTerm
modified: 2015-01-02T11:30:11+01:00
created: 2011-09-01T00:00:00+02:00
status: 1

téléférique
type: SimpleNonPreferredTerm
modified: 2014-12-02T15:00:04+01:00
created: 2011-09-01T00:00:00+02:00
status: 1

téléphérique
type: PreferredTerm
modified: 2014-12-02T15:00:04+01:00
created: 2011-09-01T00:00:00+02:00
status: 1

siège social
type: SimpleNonPreferredTerm
modified: 2015-03-27T15:53:51+01:00
created: 2011-09-01T00:00:00+02:00
status: 1

établissement administratif d'entreprise
type: PreferredTerm
modified: 2015-03-27T15:53:51+01:00
created: 2011-09-01T00:00:00+02:00
status: 1

élément d'architecture
type: SimpleNonPreferredTerm
modified: 2013-04-23T00:00:00+02:00
created: 2011-09-01T00:00:00+02:00
status: 1

salle du conseil
type: Concept
modified: 2015-02-26T11:44:11+01:00
in scheme: Thésaurus de la désignation des œuvres architecturales et des espaces aménagés
broader: partie ou élément commun à tous les types d'architecture et aux espaces aménagés
created: 2013-10-15T18:40:27+02:00
definition: Salle de réunion, parfois d’apparat, où se réunie le conseil d’administration d’une institution (entreprise, association, établissement public, université, etc.) et dans une mairie le conseil municipal.
status: 1

partie ou élément commun à tous les types d'architecture et aux espaces aménagés
type: PreferredTerm
modified: 2013-04-23T00:00:00+02:00
created: 2011-09-01T00:00:00+02:00
status: 1

poterie
type: PreferredTerm
modified: 2014-10-06T15:28:44+02:00
created: 2011-09-01T00:00:00+02:00
status: 1

amphithéâtre
type: PreferredTerm
modified: 2014-12-19T11:03:28+01:00
created: 2011-09-01T00:00:00+02:00
status: 1

atelier de fabrication
type: PreferredTerm
modified: 2015-03-24T16:19:25+01:00
created: 2011-09-01T00:00:00+02:00
status: 1

dépôt d'autobus
type: PreferredTerm
modified: 2014-11-28T16:10:53+01:00
created: 2011-09-01T00:00:00+02:00
status: 1

maison rustique
type: PreferredTerm
modified: 2014-12-30T16:00:16+01:00
created: 2011-09-01T00:00:00+02:00
status: 1

ardoisière
type: PreferredTerm
modified: 2015-01-21T15:30:46+01:00
created: 2011-09-01T00:00:00+02:00
status: 1

conseil général
type: SimpleNonPreferredTerm
modified: 2014-12-05T12:29:40+01:00
created: 2011-09-01T00:00:00+02:00
status: 1

hôtel de département
type: PreferredTerm
modified: 2014-12-05T12:29:40+01:00
created: 2011-09-01T00:00:00+02:00
status: 1

édifice public
type: SimpleNonPreferredTerm
modified: 2013-04-23T00:00:00+02:00
created: 2011-09-01T00:00:00+02:00
status: 1

édifice de l'administration ou de la vie publique
type: PreferredTerm
modified: 2013-04-23T00:00:00+02:00
created: 2011-09-01T00:00:00+02:00
status: 1

bergerie
type: PreferredTerm
modified: 2014-12-30T14:16:51+01:00
created: 2011-09-01T00:00:00+02:00
status: 1

foyer paroissial
type: SimpleNonPreferredTerm
modified: 2014-11-28T13:01:47+01:00
created: 2011-09-01T00:00:00+02:00
status: 1

centre paroissial
type: PreferredTerm
modified: 2014-11-28T13:01:47+01:00
created: 2011-09-01T00:00:00+02:00
status: 1

colonie de vacances
type: PreferredTerm
modified: 2014-12-12T14:49:39+01:00
created: 2011-09-01T00:00:00+02:00
status: 1

cibournié
type: SimpleNonPreferredTerm
modified: 2015-02-24T16:18:20+01:00
created: 2011-09-01T00:00:00+02:00
status: 1

arca
type: SimpleNonPreferredTerm
modified: 2015-02-24T16:18:20+01:00
created: 2011-09-01T00:00:00+02:00
status: 1

megalithic chamber tomb
type: PreferredTerm
modified: 2015-02-24T16:18:20+01:00
created: 2011-09-01T00:00:00+02:00
status: 1

dolmen
type: PreferredTerm
modified: 2015-02-24T16:18:20+01:00
created: 2011-09-01T00:00:00+02:00
status: 1

caxa
type: SimpleNonPreferredTerm
modified: 2015-02-24T16:18:20+01:00
created: 2011-09-01T00:00:00+02:00
status: 1

dolmen
type: PreferredTerm
modified: 2015-02-24T16:18:20+01:00
created: 2011-09-01T00:00:00+02:00
status: 1

chambered tomb
type: PreferredTerm
modified: 2015-02-24T16:18:20+01:00
created: 2011-09-01T00:00:00+02:00
status: 1

abri d'horloge
type: PreferredTerm
modified: 2014-10-17T15:20:47+02:00
created: 2011-09-01T00:00:00+02:00
status: 1

station de sports d'hiver
type: PreferredTerm
modified: 2015-01-07T11:36:58+01:00
created: 2011-09-01T00:00:00+02:00
status: 1

moschea
type: PreferredTerm
modified: 2014-11-28T12:54:02+01:00
created: 2011-09-01T00:00:00+02:00
status: 1

mosque
type: PreferredTerm
modified: 2014-11-28T12:54:02+01:00
created: 2011-09-01T00:00:00+02:00
status: 1

mosques
type: PreferredTerm
modified: 2014-11-28T12:54:02+01:00
created: 2011-09-01T00:00:00+02:00
status: 1

mosquée
type: PreferredTerm
modified: 2014-11-28T12:54:02+01:00
created: 2011-09-01T00:00:00+02:00
status: 1

goulette de jardin
type: PreferredTerm
modified: 2014-09-30T15:16:02+02:00
created: 2011-09-01T00:00:00+02:00
status: 1

réseau de transport par câble
type: PreferredTerm
modified: 2014-10-17T10:09:28+02:00
created: 2011-09-01T00:00:00+02:00
status: 1

bois de jardin
type: PreferredTerm
modified: 2014-10-14T10:41:38+02:00
created: 2011-09-01T00:00:00+02:00
status: 1

marina
type: PreferredTerm
modified: 2015-01-08T10:41:57+01:00
created: 2011-09-01T00:00:00+02:00
status: 1

marina
type: PreferredTerm
modified: 2015-01-08T10:41:57+01:00
created: 2011-09-01T00:00:00+02:00
status: 1

salle des machines
type: PreferredTerm
modified: 2015-04-09T16:23:05+02:00
created: 2011-09-01T00:00:00+02:00
status: 1

crédit municipal
type: SimpleNonPreferredTerm
modified: 2015-01-02T11:00:51+01:00
created: 2011-09-01T00:00:00+02:00
status: 1

mont-de-piété
type: PreferredTerm
modified: 2015-01-02T11:00:51+01:00
created: 2011-09-01T00:00:00+02:00
status: 1

piscine
type: PreferredTerm
modified: 2014-12-18T15:06:25+01:00
created: 2011-09-01T00:00:00+02:00
status: 1

entrepôt commercial
type: PreferredTerm
modified: 2014-12-04T16:02:29+01:00
created: 2011-09-01T00:00:00+02:00
status: 1

square
type: PreferredTerm
modified: 2015-01-07T12:21:54+01:00
created: 2011-09-01T00:00:00+02:00
status: 1

squares (open spaces)
type: PreferredTerm
modified: 2015-01-07T12:21:54+01:00
created: 2011-09-01T00:00:00+02:00
status: 1

place
type: PreferredTerm
modified: 2015-01-07T12:21:54+01:00
created: 2011-09-01T00:00:00+02:00
status: 1

piazza
type: PreferredTerm
modified: 2015-01-07T12:21:54+01:00
created: 2011-09-01T00:00:00+02:00
status: 1

moulin à papier
type: PreferredTerm
modified: 2015-04-28T16:06:23+02:00
created: 2011-09-01T00:00:00+02:00
status: 1

entrepôt industriel
type: PreferredTerm
modified: 2015-04-30T16:55:09+02:00
created: 2011-09-01T00:00:00+02:00
status: 1

esplanade
type: PreferredTerm
modified: 2015-01-07T12:07:34+01:00
created: 2011-09-01T00:00:00+02:00
status: 1

champ de Mars
type: SimpleNonPreferredTerm
modified: 2015-01-07T12:07:34+01:00
created: 2011-09-01T00:00:00+02:00
status: 1

foyer
type: PreferredTerm
modified: 2015-01-02T11:37:23+01:00
created: 2011-09-01T00:00:00+02:00
status: 1

foyer de jeunes filles
type: SimpleNonPreferredTerm
modified: 2015-01-02T11:37:23+01:00
created: 2011-09-01T00:00:00+02:00
status: 1

foyer de travailleurs
type: SimpleNonPreferredTerm
modified: 2015-01-02T11:37:23+01:00
created: 2011-09-01T00:00:00+02:00
status: 1

atelier de réparation
type: PreferredTerm
modified: 2015-03-25T11:11:43+01:00
created: 2011-09-01T00:00:00+02:00
status: 1

ensemble non identifié
type: SimpleNonPreferredTerm
modified: 2015-02-25T14:33:34+01:00
created: 2011-09-01T00:00:00+02:00
status: 1

ensemble à fonction non identifiée
type: PreferredTerm
modified: 2015-02-25T14:33:34+01:00
created: 2011-09-01T00:00:00+02:00
status: 1

halles
type: SimpleNonPreferredTerm
modified: 2014-12-05T10:26:23+01:00
created: 2011-09-01T00:00:00+02:00
status: 1

marché couvert
type: PreferredTerm
modified: 2014-12-05T10:26:23+01:00
created: 2011-09-01T00:00:00+02:00
status: 1

cité administrative
type: SimpleNonPreferredTerm
modified: 2014-10-17T15:35:51+02:00
created: 2011-09-01T00:00:00+02:00
status: 1

centre administratif
type: PreferredTerm
modified: 2014-10-17T15:35:51+02:00
created: 2011-09-01T00:00:00+02:00
status: 1

hameau de jardin
type: PreferredTerm
modified: 2014-10-14T09:51:13+02:00
created: 2011-09-01T00:00:00+02:00
status: 1

réseau de transport aérien
type: PreferredTerm
modified: 2014-10-17T10:08:05+02:00
created: 2011-09-01T00:00:00+02:00
status: 1

carrière souterraine
type: PreferredTerm
modified: 2015-01-21T15:22:54+01:00
created: 2011-09-01T00:00:00+02:00
status: 1

étable à chevaux
type: PreferredTerm
modified: 2014-12-30T14:18:55+01:00
created: 2011-09-01T00:00:00+02:00
status: 1

dépôt de tramways
type: PreferredTerm
modified: 2014-11-28T16:10:02+01:00
created: 2011-09-01T00:00:00+02:00
status: 1

charpente d'assemblage
type: SimpleNonPreferredTerm
modified: 2015-02-24T17:02:24+01:00
created: 2011-09-01T00:00:00+02:00
status: 1

charpente de toit
type: PreferredTerm
modified: 2015-02-24T17:02:24+01:00
created: 2011-09-01T00:00:00+02:00
status: 1

charpente à la Philibert de L'Orme
type: SimpleNonPreferredTerm
modified: 2015-02-24T17:02:24+01:00
created: 2011-09-01T00:00:00+02:00
status: 1

station balnéaire
type: PreferredTerm
modified: 2015-01-07T11:33:57+01:00
created: 2011-09-01T00:00:00+02:00
status: 1

édifice sportif
type: PreferredTerm
modified: 2014-12-12T14:42:11+01:00
created: 2011-09-01T00:00:00+02:00
status: 1

salon de thé
type: PreferredTerm
modified: 2014-12-04T16:00:48+01:00
created: 2011-09-01T00:00:00+02:00
status: 1

hôtel de région
type: PreferredTerm
modified: 2014-10-09T12:17:37+02:00
created: 2011-09-01T00:00:00+02:00
status: 1

conseil régional
type: SimpleNonPreferredTerm
modified: 2014-10-09T12:17:37+02:00
created: 2011-09-01T00:00:00+02:00
status: 1

salle de spectacle
type: PreferredTerm
modified: 2014-12-19T10:58:22+01:00
created: 2011-09-01T00:00:00+02:00
status: 1

lieu de spectacle
type: SimpleNonPreferredTerm
modified: 2014-12-19T10:58:22+01:00
created: 2011-09-01T00:00:00+02:00
status: 1

banc public
type: PreferredTerm
modified: 2015-02-24T11:39:36+01:00
created: 2011-09-01T00:00:00+02:00
status: 1

gallery grave
type: PreferredTerm
modified: 2015-02-24T16:14:40+01:00
created: 2011-09-01T00:00:00+02:00
status: 1

gallery graves
type: PreferredTerm
modified: 2015-02-24T16:14:40+01:00
created: 2011-09-01T00:00:00+02:00
status: 1

allée couverte
type: PreferredTerm
modified: 2015-02-24T16:14:40+01:00
created: 2011-09-01T00:00:00+02:00
status: 1

sinagoga
type: PreferredTerm
modified: 2014-11-28T12:56:59+01:00
created: 2011-09-01T00:00:00+02:00
status: 1

synagogue
type: PreferredTerm
modified: 2014-11-28T12:56:59+01:00
created: 2011-09-01T00:00:00+02:00
status: 1

synagogues
type: PreferredTerm
modified: 2014-11-28T12:56:59+01:00
created: 2011-09-01T00:00:00+02:00
status: 1

synagogue
type: PreferredTerm
modified: 2014-11-28T12:56:59+01:00
created: 2011-09-01T00:00:00+02:00
status: 1

canal de jardin
type: PreferredTerm
modified: 2014-12-31T10:18:14+01:00
created: 2011-09-01T00:00:00+02:00
status: 1

bosquet
type: PreferredTerm
modified: 2014-12-30T16:20:49+01:00
created: 2011-09-01T00:00:00+02:00
status: 1

ensemble cultuel
type: PreferredTerm
modified: 2014-09-30T17:25:00+02:00
created: 2011-09-01T00:00:00+02:00
status: 1

édifice fiscal
type: PreferredTerm
modified: 2015-01-02T11:14:02+01:00
created: 2011-09-01T00:00:00+02:00
status: 1

perception
type: SimpleNonPreferredTerm
modified: 2015-01-02T11:14:02+01:00
created: 2011-09-01T00:00:00+02:00
status: 1

hôtel des impôts
type: SimpleNonPreferredTerm
modified: 2015-01-02T11:14:02+01:00
created: 2011-09-01T00:00:00+02:00
status: 1

technopole
type: PreferredTerm
modified: 2014-10-17T15:01:57+02:00
created: 2011-09-01T00:00:00+02:00
status: 1

science park
type: PreferredTerm
modified: 2014-10-17T15:01:57+02:00
created: 2011-09-01T00:00:00+02:00
status: 1

salle d'armes
type: PreferredTerm
modified: 2014-10-10T10:15:35+02:00
created: 2011-09-01T00:00:00+02:00
status: 1

dalle
type: PreferredTerm
modified: 2014-10-17T14:35:20+02:00
created: 2011-09-01T00:00:00+02:00
status: 1

usine à papier
type: PreferredTerm
modified: 2015-04-28T16:13:51+02:00
created: 2011-09-01T00:00:00+02:00
status: 1

gazomètre
type: PreferredTerm
modified: 2015-04-09T11:37:59+02:00
created: 2011-09-01T00:00:00+02:00
status: 1

mail
type: PreferredTerm
modified: 2014-12-30T15:07:17+01:00
created: 2011-09-01T00:00:00+02:00
status: 1

réseau de navigation fluviale
type: PreferredTerm
modified: 2014-10-17T10:05:24+02:00
created: 2011-09-01T00:00:00+02:00
status: 1

rocaille de jardin
type: PreferredTerm
modified: 2014-12-30T16:52:59+01:00
created: 2011-09-01T00:00:00+02:00
status: 1

auditorium
type: PreferredTerm
modified: 2014-10-10T12:00:55+02:00
created: 2011-09-01T00:00:00+02:00
status: 1

édifice du génie civil
type: PreferredTerm
modified: 2013-04-23T00:00:00+02:00
created: 2011-09-01T00:00:00+02:00
status: 1

ponts et chaussées
type: SimpleNonPreferredTerm
modified: 2013-04-23T00:00:00+02:00
created: 2011-09-01T00:00:00+02:00
status: 1

cheminée d'usine
type: PreferredTerm
modified: 2015-03-26T14:25:56+01:00
created: 2011-09-01T00:00:00+02:00
status: 1

poste aux chevaux
type: SimpleNonPreferredTerm
modified: 2014-12-05T10:48:39+01:00
created: 2011-09-01T00:00:00+02:00
status: 1

relais de poste
type: PreferredTerm
modified: 2014-12-05T10:48:39+01:00
created: 2011-09-01T00:00:00+02:00
status: 1

bassin de décantation
type: PreferredTerm
modified: 2015-04-30T16:26:38+02:00
created: 2011-09-01T00:00:00+02:00
status: 1

établissement hospitalier
type: SimpleNonPreferredTerm
modified: 2015-01-02T12:25:34+01:00
created: 2011-09-01T00:00:00+02:00
status: 1

édifice hospitalier
type: PreferredTerm
modified: 2015-01-02T12:25:34+01:00
created: 2011-09-01T00:00:00+02:00
status: 1

lice
type: PreferredTerm
modified: 2015-01-07T12:08:53+01:00
created: 2011-09-01T00:00:00+02:00
status: 1

quinconce
type: PreferredTerm
modified: 2014-10-14T10:47:20+02:00
created: 2011-09-01T00:00:00+02:00
status: 1

cour des comptes
type: PreferredTerm
modified: 2015-01-02T10:55:56+01:00
created: 2011-09-01T00:00:00+02:00
status: 1

tour de réfrigération
type: PreferredTerm
modified: 2015-04-15T12:12:55+02:00
created: 2011-09-01T00:00:00+02:00
status: 1

confiserie
type: PreferredTerm
modified: 2015-04-29T14:46:15+02:00
created: 2011-09-01T00:00:00+02:00
status: 1

bourse
type: PreferredTerm
modified: 2014-12-04T15:46:03+01:00
created: 2011-09-01T00:00:00+02:00
status: 1

temple païen
type: SimpleNonPreferredTerm
modified: 2014-11-28T13:00:02+01:00
created: 2011-09-01T00:00:00+02:00
status: 1

ancient + temples
type: PreferredTerm
modified: 2014-11-28T13:00:02+01:00
created: 2011-09-01T00:00:00+02:00
status: 1

temple antique
type: PreferredTerm
modified: 2014-11-28T13:00:02+01:00
created: 2011-09-01T00:00:00+02:00
status: 1

temple
type: PreferredTerm
modified: 2014-11-28T13:00:02+01:00
created: 2011-09-01T00:00:00+02:00
status: 1

tempio pagano
type: PreferredTerm
modified: 2014-11-28T13:00:02+01:00
created: 2011-09-01T00:00:00+02:00
status: 1

fanum
type: SimpleNonPreferredTerm
modified: 2014-11-28T13:00:02+01:00
created: 2011-09-01T00:00:00+02:00
status: 1

villaggio
type: PreferredTerm
modified: 2015-01-07T11:42:26+01:00
created: 2011-09-01T00:00:00+02:00
status: 1

village
type: PreferredTerm
modified: 2015-01-07T11:42:26+01:00
created: 2011-09-01T00:00:00+02:00
status: 1

villages
type: PreferredTerm
modified: 2015-01-07T11:42:26+01:00
created: 2011-09-01T00:00:00+02:00
status: 1

village
type: PreferredTerm
modified: 2015-01-07T11:42:26+01:00
created: 2011-09-01T00:00:00+02:00
status: 1

alignement de menhir
type: SimpleNonPreferredTerm
modified: 2015-02-24T16:12:10+01:00
created: 2011-09-01T00:00:00+02:00
status: 1

alineamento
type: PreferredTerm
modified: 2015-02-24T16:12:10+01:00
created: 2011-09-01T00:00:00+02:00
status: 1

cromlech
type: SimpleNonPreferredTerm
modified: 2015-02-24T16:12:10+01:00
created: 2011-09-01T00:00:00+02:00
status: 1

stone alignment
type: PreferredTerm
modified: 2015-02-24T16:12:10+01:00
created: 2011-09-01T00:00:00+02:00
status: 1

alignement
type: PreferredTerm
modified: 2015-02-24T16:12:10+01:00
created: 2011-09-01T00:00:00+02:00
status: 1

horloge édicule
type: SimpleNonPreferredTerm
modified: 2015-02-24T11:22:03+01:00
created: 2011-09-01T00:00:00+02:00
status: 1

horloge architecturale
type: SimpleNonPreferredTerm
modified: 2015-02-24T11:22:03+01:00
created: 2011-09-01T00:00:00+02:00
status: 1

horloge publique
type: PreferredTerm
modified: 2015-02-24T11:22:03+01:00
created: 2011-09-01T00:00:00+02:00
status: 1

réseau unitaire
type: SimpleNonPreferredTerm
modified: 2014-10-17T10:16:06+02:00
created: 2011-09-01T00:00:00+02:00
status: 1

réseau d'égout
type: PreferredTerm
modified: 2014-10-17T10:16:06+02:00
created: 2011-09-01T00:00:00+02:00
status: 1

allée couverte de jardin
type: PreferredTerm
modified: 2014-12-30T15:02:11+01:00
created: 2011-09-01T00:00:00+02:00
status: 1

salle
type: PreferredTerm
modified: 2014-12-31T16:27:17+01:00
created: 2011-09-01T00:00:00+02:00
status: 1

salle de verdure
type: PreferredTerm
modified: 2014-12-30T16:55:32+01:00
created: 2011-09-01T00:00:00+02:00
status: 1

réseau de transport
type: PreferredTerm
modified: 2014-10-17T10:11:14+02:00
created: 2011-09-01T00:00:00+02:00
status: 1

place de taureaux
type: SimpleNonPreferredTerm
modified: 2014-12-19T11:04:27+01:00
created: 2011-09-01T00:00:00+02:00
status: 1

arène
type: PreferredTerm
modified: 2014-12-19T11:04:27+01:00
created: 2011-09-01T00:00:00+02:00
status: 1

refuge
type: SimpleNonPreferredTerm
modified: 2014-12-05T10:38:16+01:00
created: 2011-09-01T00:00:00+02:00
status: 1

refuge de montagne
type: PreferredTerm
modified: 2014-12-05T10:38:16+01:00
created: 2011-09-01T00:00:00+02:00
status: 1

central téléphonique
type: PreferredTerm
modified: 2014-11-28T16:08:00+01:00
created: 2011-09-01T00:00:00+02:00
status: 1

lavoir
type: PreferredTerm
modified: 2014-12-05T11:51:11+01:00
created: 2011-09-01T00:00:00+02:00
status: 1

centre médical
type: SimpleNonPreferredTerm
modified: 2015-01-02T11:57:19+01:00
created: 2011-09-01T00:00:00+02:00
status: 1

établissement médical
type: PreferredTerm
modified: 2015-01-02T11:57:19+01:00
created: 2011-09-01T00:00:00+02:00
status: 1

institut médical
type: SimpleNonPreferredTerm
modified: 2015-01-02T11:57:19+01:00
created: 2011-09-01T00:00:00+02:00
status: 1

bassin de retenue
type: PreferredTerm
modified: 2015-03-25T11:58:56+01:00
created: 2011-09-01T00:00:00+02:00
status: 1

parvis
type: PreferredTerm
modified: 2015-01-07T12:14:21+01:00
created: 2011-09-01T00:00:00+02:00
status: 1

parvis
type: PreferredTerm
modified: 2015-01-07T12:14:21+01:00
created: 2011-09-01T00:00:00+02:00
status: 1

parvises
type: PreferredTerm
modified: 2015-01-07T12:14:21+01:00
created: 2011-09-01T00:00:00+02:00
status: 1

sagrato
type: PreferredTerm
modified: 2015-01-07T12:14:21+01:00
created: 2011-09-01T00:00:00+02:00
status: 1

école d'agriculture
type: PreferredTerm
modified: 2014-12-01T16:00:38+01:00
created: 2011-09-01T00:00:00+02:00
status: 1

topiaire
type: PreferredTerm
modified: 2014-12-30T16:31:06+01:00
created: 2011-09-01T00:00:00+02:00
status: 1

cidrerie
type: PreferredTerm
modified: 2015-01-07T12:52:59+01:00
created: 2011-09-01T00:00:00+02:00
status: 1

terril
type: PreferredTerm
modified: 2015-04-09T16:09:13+02:00
created: 2011-09-01T00:00:00+02:00
status: 1

hôtel des monnaies
type: PreferredTerm
modified: 2015-01-02T10:57:35+01:00
created: 2011-09-01T00:00:00+02:00
status: 1

boulangerie
type: PreferredTerm
modified: 2014-12-04T15:43:04+01:00
created: 2011-09-01T00:00:00+02:00
status: 1

ensemble du génie civil
type: PreferredTerm
modified: 2013-04-23T00:00:00+02:00
created: 2011-09-01T00:00:00+02:00
status: 1

aire à battre
type: PreferredTerm
modified: 2014-12-30T14:12:15+01:00
created: 2011-09-01T00:00:00+02:00
status: 1

ville d'eau
type: SimpleNonPreferredTerm
modified: 2014-10-17T14:20:42+02:00
created: 2011-09-01T00:00:00+02:00
status: 1

spa
type: PreferredTerm
modified: 2014-10-17T14:20:42+02:00
created: 2011-09-01T00:00:00+02:00
status: 1

station thermale
type: PreferredTerm
modified: 2014-10-17T14:20:42+02:00
created: 2011-09-01T00:00:00+02:00
status: 1

agglomération cultuelle
type: PreferredTerm
modified: 2013-04-23T00:00:00+02:00
created: 2011-09-01T00:00:00+02:00
status: 1

usine de traitement du bois
type: PreferredTerm
modified: 2015-04-29T17:18:57+02:00
created: 2011-09-01T00:00:00+02:00
status: 1

megalithic monuments
type: PreferredTerm
modified: 2015-02-24T16:05:51+01:00
created: 2011-09-01T00:00:00+02:00
status: 1

standing stone 1
type: PreferredTerm
modified: 2015-02-24T16:05:51+01:00
created: 2011-09-01T00:00:00+02:00
status: 1

mégalithe
type: PreferredTerm
modified: 2015-02-24T16:05:51+01:00
created: 2011-09-01T00:00:00+02:00
status: 1

megalite
type: PreferredTerm
modified: 2015-02-24T16:05:51+01:00
created: 2011-09-01T00:00:00+02:00
status: 1

toilettes publiques
type: PreferredTerm
modified: 2014-12-05T12:05:53+01:00
created: 2011-09-01T00:00:00+02:00
status: 1

latrines
type: SimpleNonPreferredTerm
modified: 2014-12-05T12:05:53+01:00
created: 2011-09-01T00:00:00+02:00
status: 1

vespasienne
type: SimpleNonPreferredTerm
modified: 2014-12-05T12:05:53+01:00
created: 2011-09-01T00:00:00+02:00
status: 1

plate-bande de jardin
type: PreferredTerm
modified: 2014-10-14T10:54:19+02:00
created: 2011-09-01T00:00:00+02:00
status: 1

réseau téléphonique
type: PreferredTerm
modified: 2014-10-17T10:02:31+02:00
created: 2011-09-01T00:00:00+02:00
status: 1

salle à manger
type: PreferredTerm
modified: 2014-12-31T16:28:49+01:00
created: 2011-09-01T00:00:00+02:00
status: 1

salle de cinéma
type: SimpleNonPreferredTerm
modified: 2014-12-19T11:08:31+01:00
created: 2011-09-01T00:00:00+02:00
status: 1

cinéma
type: PreferredTerm
modified: 2014-12-19T11:08:31+01:00
created: 2011-09-01T00:00:00+02:00
status: 1

salle des pas perdus
type: PreferredTerm
modified: 2015-02-25T13:53:33+01:00
created: 2011-09-01T00:00:00+02:00
status: 1

allée de jardin
type: SimpleNonPreferredTerm
modified: 2014-12-30T15:11:02+01:00
created: 2011-09-01T00:00:00+02:00
status: 1

allée
type: PreferredTerm
modified: 2014-12-30T15:11:02+01:00
created: 2011-09-01T00:00:00+02:00
status: 1

remise à bateau
type: PreferredTerm
modified: 2014-12-31T15:58:20+01:00
created: 2011-09-01T00:00:00+02:00
status: 1

vélodrome
type: PreferredTerm
modified: 2014-12-18T15:09:37+01:00
created: 2011-09-01T00:00:00+02:00
status: 1

piazza d'armi
type: PreferredTerm
modified: 2015-01-07T12:19:59+01:00
created: 2011-09-01T00:00:00+02:00
status: 1

parade grounds
type: PreferredTerm
modified: 2015-01-07T12:19:59+01:00
created: 2011-09-01T00:00:00+02:00
status: 1

parade ground
type: PreferredTerm
modified: 2015-01-07T12:19:59+01:00
created: 2011-09-01T00:00:00+02:00
status: 1

place d'armes
type: PreferredTerm
modified: 2015-01-07T12:19:59+01:00
created: 2011-09-01T00:00:00+02:00
status: 1

tour d'extraction
type: PreferredTerm
modified: 2015-04-30T16:48:47+02:00
created: 2011-09-01T00:00:00+02:00
status: 1

bâtiment administratif d'entreprise
type: PreferredTerm
modified: 2015-03-25T12:09:40+01:00
created: 2011-09-01T00:00:00+02:00
status: 1

maison de retraite
type: PreferredTerm
modified: 2015-01-02T11:49:27+01:00
created: 2011-09-01T00:00:00+02:00
status: 1

studio d'enregistrement
type: PreferredTerm
modified: 2014-10-10T11:47:42+02:00
created: 2011-09-01T00:00:00+02:00
status: 1

new towns
type: PreferredTerm
modified: 2015-01-07T11:46:18+01:00
created: 2011-09-01T00:00:00+02:00
status: 1

new town
type: PreferredTerm
modified: 2015-01-07T11:46:18+01:00
created: 2011-09-01T00:00:00+02:00
status: 1

ville nouvelle
type: PreferredTerm
modified: 2015-01-07T11:46:18+01:00
created: 2011-09-01T00:00:00+02:00
status: 1

martyrium
type: SimpleNonPreferredTerm
modified: 2015-02-24T16:04:20+01:00
created: 2011-09-01T00:00:00+02:00
status: 1

mausoleum
type: PreferredTerm
modified: 2015-02-24T16:04:20+01:00
created: 2011-09-01T00:00:00+02:00
status: 1

mausolée
type: PreferredTerm
modified: 2015-02-24T16:04:20+01:00
created: 2011-09-01T00:00:00+02:00
status: 1

mausoleums
type: PreferredTerm
modified: 2015-02-24T16:04:20+01:00
created: 2011-09-01T00:00:00+02:00
status: 1

mausoleo
type: PreferredTerm
modified: 2015-02-24T16:04:20+01:00
created: 2011-09-01T00:00:00+02:00
status: 1

salle des coffres
type: PreferredTerm
modified: 2014-10-06T15:52:37+02:00
created: 2013-10-15T18:28:30+02:00
status: 1

débit de boissons
type: PreferredTerm
modified: 2014-12-04T15:47:08+01:00
created: 2011-09-01T00:00:00+02:00
status: 1

usine de transformation du liège
type: PreferredTerm
modified: 2015-04-29T17:21:27+02:00
created: 2011-09-01T00:00:00+02:00
status: 1

réseau hydraulique
type: PreferredTerm
modified: 2014-10-17T10:12:12+02:00
created: 2011-09-01T00:00:00+02:00
status: 1

réseau des eaux
type: SimpleNonPreferredTerm
modified: 2014-10-17T10:12:12+02:00
created: 2011-09-01T00:00:00+02:00
status: 1

clôture et circulation de jardin
type: PreferredTerm
modified: 2013-04-23T00:00:00+02:00
created: 2011-09-01T00:00:00+02:00
status: 1

labyrinthe
type: PreferredTerm
modified: 2014-12-30T16:28:01+01:00
created: 2011-09-01T00:00:00+02:00
status: 1

aire à battre couverte
type: PreferredTerm
modified: 2014-12-30T14:13:01+01:00
created: 2011-09-01T00:00:00+02:00
status: 1

distillerie
type: PreferredTerm
modified: 2015-01-08T15:45:03+01:00
created: 2011-09-01T00:00:00+02:00
status: 1

music-hall
type: SimpleNonPreferredTerm
modified: 2014-12-19T11:06:51+01:00
created: 2011-09-01T00:00:00+02:00
status: 1

cabaret
type: PreferredTerm
modified: 2014-12-19T11:06:51+01:00
created: 2011-09-01T00:00:00+02:00
status: 1

café-concert
type: SimpleNonPreferredTerm
modified: 2014-12-19T11:06:51+01:00
created: 2011-09-01T00:00:00+02:00
status: 1

chaîne d'écluses
type: PreferredTerm
modified: 2014-10-23T12:23:04+02:00
created: 2011-09-01T00:00:00+02:00
status: 1

escalier d'eau
type: SimpleNonPreferredTerm
modified: 2014-10-23T12:23:04+02:00
created: 2011-09-01T00:00:00+02:00
status: 1

architecture judiciaire pénitentiaire ou de police
type: PreferredTerm
modified: 2013-04-23T00:00:00+02:00
created: 2011-09-01T00:00:00+02:00
status: 1

salle de bains
type: PreferredTerm
modified: 2014-12-31T16:31:04+01:00
created: 2011-09-01T00:00:00+02:00
status: 1

prairie ornementale
type: PreferredTerm
modified: 2014-12-30T16:51:17+01:00
created: 2011-09-01T00:00:00+02:00
status: 1

rampe d'accès indépendante
type: SimpleNonPreferredTerm
modified: 2015-02-25T13:51:34+01:00
created: 2011-09-01T00:00:00+02:00
status: 1

rampe d'accès
type: PreferredTerm
modified: 2015-02-25T13:51:34+01:00
created: 2011-09-01T00:00:00+02:00
status: 1

réduit
type: PreferredTerm
modified: 2015-01-05T13:29:39+01:00
created: 2011-09-01T00:00:00+02:00
status: 1

chevalement
type: PreferredTerm
modified: 2015-04-30T16:48:10+02:00
created: 2011-09-01T00:00:00+02:00
status: 1

hospice
type: PreferredTerm
modified: 2015-01-02T11:46:32+01:00
created: 2011-09-01T00:00:00+02:00
status: 1

hospice de vieillards
type: SimpleNonPreferredTerm
modified: 2015-01-02T11:46:32+01:00
created: 2011-09-01T00:00:00+02:00
status: 1

ruelle d'écoulement
type: PreferredTerm
modified: 2014-09-24T12:53:48+02:00
created: 2011-09-01T00:00:00+02:00
status: 1

transporteur automatique par câbles
type: PreferredTerm
modified: 2015-04-30T17:15:25+02:00
created: 2011-09-01T00:00:00+02:00
status: 1

baraquement
type: PreferredTerm
modified: 2014-12-31T12:00:41+01:00
created: 2013-10-15T18:00:12+02:00
status: 1

cenotaph
type: PreferredTerm
modified: 2015-02-24T14:37:18+01:00
created: 2011-09-01T00:00:00+02:00
status: 1

cénotaphe
type: PreferredTerm
modified: 2015-02-24T14:37:18+01:00
created: 2011-09-01T00:00:00+02:00
status: 1

rivière artificielle
type: PreferredTerm
modified: 2014-12-31T10:24:53+01:00
created: 2011-09-01T00:00:00+02:00
status: 1

massif d'arbres
type: PreferredTerm
modified: 2014-09-18T10:55:32+02:00
created: 2011-09-01T00:00:00+02:00
status: 1

aire à sécher
type: PreferredTerm
modified: 2014-10-06T12:10:31+02:00
created: 2011-09-01T00:00:00+02:00
status: 1

système d'adduction des eaux
type: SimpleNonPreferredTerm
modified: 2014-10-17T10:17:00+02:00
created: 2011-09-01T00:00:00+02:00
status: 1

réseau d'adduction des eaux
type: PreferredTerm
modified: 2014-10-17T10:17:00+02:00
created: 2011-09-01T00:00:00+02:00
status: 1

usine de bouchons
type: PreferredTerm
modified: 2015-04-29T17:25:02+02:00
created: 2011-09-01T00:00:00+02:00
status: 1

ville
type: PreferredTerm
modified: 2015-01-07T11:48:48+01:00
created: 2011-09-01T00:00:00+02:00
status: 1

città
type: PreferredTerm
modified: 2015-01-07T11:48:48+01:00
created: 2011-09-01T00:00:00+02:00
status: 1

cities + towns
type: PreferredTerm
modified: 2015-01-07T11:48:48+01:00
created: 2011-09-01T00:00:00+02:00
status: 1

civitas
type: SimpleNonPreferredTerm
modified: 2015-01-07T11:48:48+01:00
created: 2011-09-01T00:00:00+02:00
status: 1

town
type: PreferredTerm
modified: 2015-01-07T11:48:48+01:00
created: 2011-09-01T00:00:00+02:00
status: 1

conserverie
type: PreferredTerm
modified: 2015-01-07T16:16:50+01:00
created: 2011-09-01T00:00:00+02:00
status: 1

gare d'eau
type: PreferredTerm
modified: 2014-12-01T13:53:41+01:00
created: 2011-09-01T00:00:00+02:00
status: 1

bourse de commerce
type: PreferredTerm
modified: 2014-10-06T13:02:34+02:00
created: 2011-09-01T00:00:00+02:00
status: 1

pépinière
type: PreferredTerm
modified: 2014-12-31T10:53:04+01:00
created: 2011-09-01T00:00:00+02:00
status: 1

glacière
type: PreferredTerm
modified: 2014-12-30T15:58:21+01:00
created: 2011-09-01T00:00:00+02:00
status: 1

maison consulaire
type: PreferredTerm
modified: 2014-12-12T10:44:48+01:00
created: 2011-09-01T00:00:00+02:00
status: 1

monument funéraire
type: PreferredTerm
modified: 2015-02-24T14:30:31+01:00
created: 2011-09-01T00:00:00+02:00
status: 1

entrée de port
type: PreferredTerm
modified: 2013-04-23T00:00:00+02:00
created: 2011-09-01T00:00:00+02:00
status: 1

verrerie
type: PreferredTerm
modified: 2015-03-23T15:31:31+01:00
created: 2011-09-01T00:00:00+02:00
status: 1

usine d'articles en matière plastique
type: PreferredTerm
modified: 2015-04-29T16:15:41+02:00
created: 2011-09-01T00:00:00+02:00
status: 1

brasserie
type: PreferredTerm
modified: 2015-01-07T11:53:42+01:00
created: 2011-09-01T00:00:00+02:00
status: 1

cité pavillonnaire
type: PreferredTerm
modified: 2014-10-17T15:06:15+02:00
created: 2011-09-01T00:00:00+02:00
status: 1

bassin de natation
type: PreferredTerm
modified: 2014-10-10T12:19:28+02:00
created: 2011-09-01T00:00:00+02:00
status: 1

vivier
type: PreferredTerm
modified: 2014-12-30T14:55:24+01:00
created: 2011-09-01T00:00:00+02:00
status: 1

crossing towers
type: PreferredTerm
modified: 2014-10-15T17:37:02+02:00
created: 2011-09-01T00:00:00+02:00
status: 1

crossing tower
type: PreferredTerm
modified: 2014-10-15T17:37:02+02:00
created: 2011-09-01T00:00:00+02:00
status: 1

tiburio + lanterna
type: PreferredTerm
modified: 2014-10-15T17:37:02+02:00
created: 2011-09-01T00:00:00+02:00
status: 1

tour lanterne
type: PreferredTerm
modified: 2014-10-15T17:37:02+02:00
created: 2011-09-01T00:00:00+02:00
status: 1

usine de boulangerie
type: PreferredTerm
modified: 2015-01-21T15:05:05+01:00
created: 2011-09-01T00:00:00+02:00
status: 1

obelisco
type: PreferredTerm
modified: 2015-02-24T16:37:11+01:00
created: 2011-09-01T00:00:00+02:00
status: 1

obélisque de jardin
type: SimpleNonPreferredTerm
modified: 2015-02-24T16:37:11+01:00
created: 2011-09-01T00:00:00+02:00
status: 1

obelisks
type: PreferredTerm
modified: 2015-02-24T16:37:11+01:00
created: 2011-09-01T00:00:00+02:00
status: 1

obelisk
type: PreferredTerm
modified: 2015-02-24T16:37:11+01:00
created: 2011-09-01T00:00:00+02:00
status: 1

obélisque
type: PreferredTerm
modified: 2015-02-24T16:37:11+01:00
created: 2011-09-01T00:00:00+02:00
status: 1

road 2
type: PreferredTerm
modified: 2014-10-17T14:28:43+02:00
created: 2011-09-01T00:00:00+02:00
status: 1

voie
type: PreferredTerm
modified: 2014-10-17T14:28:43+02:00
created: 2011-09-01T00:00:00+02:00
status: 1

logis prieural
type: PreferredTerm
modified: 2014-11-28T15:00:09+01:00
created: 2011-09-01T00:00:00+02:00
status: 1

alloggio del priore
type: PreferredTerm
modified: 2014-11-28T15:00:09+01:00
created: 2011-09-01T00:00:00+02:00
status: 1

prior's house
type: PreferredTerm
modified: 2014-11-28T15:00:09+01:00
created: 2011-09-01T00:00:00+02:00
status: 1

tour porche
type: PreferredTerm
modified: 2015-02-25T13:48:27+01:00
created: 2011-09-01T00:00:00+02:00
status: 1

sellerie
type: PreferredTerm
modified: 2014-12-31T16:02:05+01:00
created: 2011-09-01T00:00:00+02:00
status: 1

usine de passementerie
type: PreferredTerm
modified: 2015-03-18T15:10:47+01:00
created: 2011-09-01T00:00:00+02:00
status: 1

usine de matériel photocinématographique
type: PreferredTerm
modified: 2015-04-28T15:50:40+02:00
created: 2011-09-01T00:00:00+02:00
status: 1

manoir
type: PreferredTerm
modified: 2014-12-31T12:40:04+01:00
created: 2011-09-01T00:00:00+02:00
status: 1

maison noble
type: SimpleNonPreferredTerm
modified: 2014-12-31T12:40:04+01:00
created: 2011-09-01T00:00:00+02:00
status: 1

maison seigneuriale
type: SimpleNonPreferredTerm
modified: 2014-12-31T12:40:04+01:00
created: 2011-09-01T00:00:00+02:00
status: 1

ensemble judiciaire pénitentiaire ou de police
type: PreferredTerm
modified: 2013-04-23T00:00:00+02:00
created: 2011-09-01T00:00:00+02:00
status: 1

ouvrage Maginot
type: PreferredTerm
modified: 2015-01-05T13:16:29+01:00
created: 2011-09-01T00:00:00+02:00
status: 1

séchoir à châtaignes
type: PreferredTerm
modified: 2015-02-26T11:50:25+01:00
created: 2011-09-01T00:00:00+02:00
status: 1

moulin à tan
type: PreferredTerm
modified: 2014-12-08T15:19:56+01:00
created: 2011-09-01T00:00:00+02:00
status: 1

salon
type: PreferredTerm
modified: 2014-12-31T16:33:56+01:00
created: 2011-09-01T00:00:00+02:00
status: 1

jardin fruitier
type: SimpleNonPreferredTerm
modified: 2014-12-31T10:54:38+01:00
created: 2011-09-01T00:00:00+02:00
status: 1

verger
type: PreferredTerm
modified: 2014-12-31T10:54:38+01:00
created: 2011-09-01T00:00:00+02:00
status: 1

station de captage
type: PreferredTerm
modified: 2014-12-02T12:46:28+01:00
created: 2011-09-01T00:00:00+02:00
status: 1

architecture agricole
type: PreferredTerm
modified: 2014-09-02T17:08:32+02:00
created: 2011-09-01T00:00:00+02:00
status: 1

porte monumentale
type: PreferredTerm
modified: 2014-10-17T15:29:08+02:00
created: 2011-09-01T00:00:00+02:00
status: 1

usine de poterie
type: PreferredTerm
modified: 2015-01-27T16:00:57+01:00
created: 2011-09-01T00:00:00+02:00
status: 1

usine d'éléments en matière plastique pour le bâtiment
type: PreferredTerm
modified: 2015-04-29T16:18:43+02:00
created: 2011-09-01T00:00:00+02:00
status: 1

tour porte
type: PreferredTerm
modified: 2015-02-25T13:46:24+01:00
created: 2011-09-01T00:00:00+02:00
status: 1

lotissement concerté
type: PreferredTerm
modified: 2015-01-09T11:28:29+01:00
created: 2011-09-01T00:00:00+02:00
status: 1

lanterna mortuaria
type: PreferredTerm
modified: 2015-02-24T12:10:38+01:00
created: 2011-09-01T00:00:00+02:00
status: 1

lanterne des morts
type: PreferredTerm
modified: 2015-02-24T12:10:38+01:00
created: 2011-09-01T00:00:00+02:00
status: 1

poor souls light
type: PreferredTerm
modified: 2015-02-24T12:10:38+01:00
created: 2011-09-01T00:00:00+02:00
status: 1

lanterns of the dead
type: PreferredTerm
modified: 2015-02-24T12:10:38+01:00
created: 2011-09-01T00:00:00+02:00
status: 1

rucher
type: PreferredTerm
modified: 2014-12-30T14:52:39+01:00
created: 2011-09-01T00:00:00+02:00
status: 1

partie d'édifice de culture recherche sport ou loisir
type: PreferredTerm
modified: 2013-04-23T00:00:00+02:00
created: 2011-09-01T00:00:00+02:00
status: 1

usine de produits agro-alimentaires
type: PreferredTerm
modified: 2014-12-16T16:37:49+01:00
created: 2011-09-01T00:00:00+02:00
status: 1

usine de produits alimentaires
type: SimpleNonPreferredTerm
modified: 2014-12-16T16:37:49+01:00
created: 2011-09-01T00:00:00+02:00
status: 1

transept
type: PreferredTerm
modified: 2014-10-15T17:37:36+02:00
created: 2011-09-01T00:00:00+02:00
status: 1

transepts
type: PreferredTerm
modified: 2014-10-15T17:37:36+02:00
created: 2011-09-01T00:00:00+02:00
status: 1

transetto
type: PreferredTerm
modified: 2014-10-15T17:37:36+02:00
created: 2011-09-01T00:00:00+02:00
status: 1

transept
type: PreferredTerm
modified: 2014-10-15T17:37:36+02:00
created: 2011-09-01T00:00:00+02:00
status: 1

usine de boissons non alcoolisées
type: PreferredTerm
modified: 2015-04-29T15:21:55+02:00
created: 2011-09-01T00:00:00+02:00
status: 1

war memorial
type: PreferredTerm
modified: 2015-02-24T13:02:25+01:00
created: 2011-09-01T00:00:00+02:00
status: 1

monument aux morts
type: PreferredTerm
modified: 2015-02-24T13:02:25+01:00
created: 2011-09-01T00:00:00+02:00
status: 1

monumento ai caduti
type: PreferredTerm
modified: 2015-02-24T13:02:25+01:00
created: 2011-09-01T00:00:00+02:00
status: 1

war memorials
type: PreferredTerm
modified: 2015-02-24T13:02:25+01:00
created: 2011-09-01T00:00:00+02:00
status: 1

bridleway
type: PreferredTerm
modified: 2015-01-07T12:24:18+01:00
created: 2011-09-01T00:00:00+02:00
status: 1

allée cavalière
type: PreferredTerm
modified: 2015-01-07T12:24:18+01:00
created: 2011-09-01T00:00:00+02:00
status: 1

partie d'église
type: PreferredTerm
modified: 2013-04-23T00:00:00+02:00
created: 2011-09-01T00:00:00+02:00
status: 1

bagne
type: PreferredTerm
modified: 2015-01-05T10:50:45+01:00
created: 2011-09-01T00:00:00+02:00
status: 1

pénitentier
type: SimpleNonPreferredTerm
modified: 2015-01-05T10:50:45+01:00
created: 2011-09-01T00:00:00+02:00
status: 1

tissage
type: PreferredTerm
modified: 2015-03-18T14:50:31+01:00
created: 2011-09-01T00:00:00+02:00
status: 1

entrepôt domestique
type: SimpleNonPreferredTerm
modified: 2014-12-31T16:00:16+01:00
created: 2011-09-01T00:00:00+02:00
status: 1

resserre
type: PreferredTerm
modified: 2014-12-31T16:00:16+01:00
created: 2011-09-01T00:00:00+02:00
status: 1

porche
type: PreferredTerm
modified: 2015-02-25T10:16:33+01:00
created: 2011-09-01T00:00:00+02:00
status: 1

séchoir à chicorée
type: PreferredTerm
modified: 2015-02-26T11:51:45+01:00
created: 2011-09-01T00:00:00+02:00
status: 1

jardin en couverture
type: PreferredTerm
modified: 2014-10-14T11:52:18+02:00
created: 2011-09-01T00:00:00+02:00
status: 1

mégisserie
type: PreferredTerm
modified: 2015-04-28T16:37:21+02:00
created: 2011-09-01T00:00:00+02:00
status: 1

maison forte
type: PreferredTerm
modified: 2014-12-31T12:38:43+01:00
created: 2011-09-01T00:00:00+02:00
status: 1

usine de lunetterie
type: PreferredTerm
modified: 2015-04-28T15:47:16+02:00
created: 2011-09-01T00:00:00+02:00
status: 1

moulinerie
type: PreferredTerm
modified: 2015-04-30T15:33:43+02:00
created: 2011-09-01T00:00:00+02:00
status: 1

logis
type: PreferredTerm
modified: 2014-10-20T10:41:39+02:00
created: 2011-09-01T00:00:00+02:00
status: 1

usine d'emballages en matière plastique
type: PreferredTerm
modified: 2015-02-11T14:32:56+01:00
created: 2011-09-01T00:00:00+02:00
status: 1

passage d'entrée
type: PreferredTerm
modified: 2015-02-25T13:42:15+01:00
created: 2011-09-01T00:00:00+02:00
status: 1

usine marémotrice
type: PreferredTerm
modified: 2015-02-19T16:04:39+01:00
created: 2011-09-01T00:00:00+02:00
status: 1

ensemble agricole
type: PreferredTerm
modified: 2014-12-30T14:08:39+01:00
created: 2011-09-01T00:00:00+02:00
status: 1

tour de jardin
type: PreferredTerm
modified: 2014-12-30T15:48:20+01:00
created: 2011-09-01T00:00:00+02:00
status: 1

chocolaterie
type: PreferredTerm
modified: 2015-01-07T12:38:48+01:00
created: 2011-09-01T00:00:00+02:00
status: 1

ensemble artisanal commercial ou tertiaire
type: PreferredTerm
modified: 2013-04-23T00:00:00+02:00
created: 2011-09-01T00:00:00+02:00
status: 1

découvert de jardin
type: PreferredTerm
modified: 2013-12-09T16:53:23+01:00
created: 2011-09-01T00:00:00+02:00
status: 1

grotte sépulcrale
type: PreferredTerm
modified: 2015-02-24T16:01:07+01:00
created: 2011-09-01T00:00:00+02:00
status: 1

plancher
type: PreferredTerm
modified: 2015-02-25T11:35:04+01:00
created: 2011-09-01T00:00:00+02:00
status: 1

biscuiterie
type: PreferredTerm
modified: 2015-01-21T15:03:52+01:00
created: 2011-09-01T00:00:00+02:00
status: 1

commemorative monument 2
type: PreferredTerm
modified: 2013-04-23T00:00:00+02:00
created: 2011-09-01T00:00:00+02:00
status: 1

mausolée urbain
type: SimpleNonPreferredTerm
modified: 2013-04-23T00:00:00+02:00
created: 2011-09-01T00:00:00+02:00
status: 1

édicule commémoratif
type: PreferredTerm
modified: 2013-04-23T00:00:00+02:00
created: 2011-09-01T00:00:00+02:00
status: 1

archevêché
type: SimpleNonPreferredTerm
modified: 2014-12-31T12:47:02+01:00
created: 2011-09-01T00:00:00+02:00
status: 1

palais épiscopal
type: PreferredTerm
modified: 2014-12-31T12:47:02+01:00
created: 2011-09-01T00:00:00+02:00
status: 1

évêché
type: SimpleNonPreferredTerm
modified: 2014-12-31T12:47:02+01:00
created: 2011-09-01T00:00:00+02:00
status: 1

chamoiserie
type: PreferredTerm
modified: 2015-04-28T16:34:53+02:00
created: 2011-09-01T00:00:00+02:00
status: 1

séchoir
type: PreferredTerm
modified: 2015-02-26T11:47:34+01:00
created: 2011-09-01T00:00:00+02:00
status: 1

eaux de jardin
type: PreferredTerm
modified: 2013-04-23T00:00:00+02:00
created: 2011-09-01T00:00:00+02:00
status: 1

cristallerie
type: PreferredTerm
modified: 2015-04-30T15:53:08+02:00
created: 2011-09-01T00:00:00+02:00
status: 1

volière
type: PreferredTerm
modified: 2014-12-31T16:04:44+01:00
created: 2011-09-01T00:00:00+02:00
status: 1

usine d'ouvrages en matière plastique
type: PreferredTerm
modified: 2015-04-29T16:22:59+02:00
created: 2011-09-01T00:00:00+02:00
status: 1

galerie technique
type: PreferredTerm
modified: 2014-10-16T11:15:20+02:00
created: 2011-09-01T00:00:00+02:00
status: 1

filature
type: PreferredTerm
modified: 2015-04-30T15:32:03+02:00
created: 2011-09-01T00:00:00+02:00
status: 1

exploitation agricole
type: PreferredTerm
modified: 2014-12-30T14:01:43+01:00
created: 2011-09-01T00:00:00+02:00
status: 1

folie
type: PreferredTerm
modified: 2014-12-30T15:56:59+01:00
created: 2011-09-01T00:00:00+02:00
status: 1

centrale atomique
type: SimpleNonPreferredTerm
modified: 2015-02-19T16:26:49+01:00
created: 2011-09-01T00:00:00+02:00
status: 1

centrale nucléaire
type: PreferredTerm
modified: 2015-02-19T16:26:49+01:00
created: 2011-09-01T00:00:00+02:00
status: 1

brûlerie
type: PreferredTerm
modified: 2015-01-07T12:11:48+01:00
created: 2011-09-01T00:00:00+02:00
status: 1

sagrestia
type: PreferredTerm
modified: 2014-11-28T16:01:53+01:00
created: 2011-09-01T00:00:00+02:00
status: 1

sacristy
type: PreferredTerm
modified: 2014-11-28T16:01:53+01:00
created: 2011-09-01T00:00:00+02:00
status: 1

sacristie
type: PreferredTerm
modified: 2014-11-28T16:01:53+01:00
created: 2011-09-01T00:00:00+02:00
status: 1

sacristies
type: PreferredTerm
modified: 2014-11-28T16:01:53+01:00
created: 2011-09-01T00:00:00+02:00
status: 1

architecture artisanale commerciale et tertiaire
type: PreferredTerm
modified: 2013-04-23T00:00:00+02:00
created: 2011-09-01T00:00:00+02:00
status: 1

boulingrin
type: PreferredTerm
modified: 2014-12-30T16:33:30+01:00
created: 2011-09-01T00:00:00+02:00
status: 1

alloggio dell' abate
type: PreferredTerm
modified: 2014-11-28T14:57:56+01:00
created: 2011-09-01T00:00:00+02:00
status: 1

abbots' + houses
type: PreferredTerm
modified: 2014-11-28T14:57:56+01:00
created: 2011-09-01T00:00:00+02:00
status: 1

logis abbatial
type: PreferredTerm
modified: 2014-11-28T14:57:56+01:00
created: 2011-09-01T00:00:00+02:00
status: 1

abbot's house
type: PreferredTerm
modified: 2014-11-28T14:57:56+01:00
created: 2011-09-01T00:00:00+02:00
status: 1

usine de roulements
type: PreferredTerm
modified: 2014-11-27T16:00:49+01:00
created: 2011-09-01T00:00:00+02:00
status: 1

biscotterie
type: PreferredTerm
modified: 2015-04-29T15:26:50+02:00
created: 2011-09-01T00:00:00+02:00
status: 1

échauguette
type: PreferredTerm
modified: 2015-02-26T11:03:37+01:00
created: 2011-09-01T00:00:00+02:00
status: 1

tannerie
type: PreferredTerm
modified: 2014-12-08T11:41:50+01:00
created: 2011-09-01T00:00:00+02:00
status: 1

palais
type: PreferredTerm
modified: 2014-12-31T12:54:59+01:00
created: 2011-09-01T00:00:00+02:00
status: 1

séchoir à chanvre
type: PreferredTerm
modified: 2014-10-16T11:52:55+02:00
created: 2011-09-01T00:00:00+02:00
status: 1

beguinages
type: PreferredTerm
modified: 2014-10-15T13:46:13+02:00
created: 2011-09-01T00:00:00+02:00
status: 1

béguinage
type: PreferredTerm
modified: 2014-10-15T13:46:13+02:00
created: 2011-09-01T00:00:00+02:00
status: 1

beghinaggio
type: PreferredTerm
modified: 2014-10-15T13:46:13+02:00
created: 2011-09-01T00:00:00+02:00
status: 1

lay sisters house
type: PreferredTerm
modified: 2014-10-15T13:46:13+02:00
created: 2011-09-01T00:00:00+02:00
status: 1

passe-pied
type: PreferredTerm
modified: 2014-09-30T10:23:15+02:00
created: 2011-09-01T00:00:00+02:00
status: 1

piscine baptismale
type: PreferredTerm
modified: 2014-10-15T14:04:36+02:00
created: 2011-09-01T00:00:00+02:00
status: 1

immersion font
type: PreferredTerm
modified: 2014-10-15T14:04:36+02:00
created: 2011-09-01T00:00:00+02:00
status: 1

forge artisanale
type: PreferredTerm
modified: 2014-10-06T13:14:50+02:00
created: 2011-09-01T00:00:00+02:00
status: 1

usine de pièces détachées en matière plastique
type: PreferredTerm
modified: 2015-02-11T14:59:58+01:00
created: 2011-09-01T00:00:00+02:00
status: 1

salle du conseil
type: PreferredTerm
modified: 2015-02-26T11:44:11+01:00
created: 2013-10-15T18:40:27+02:00
status: 1

olympic village
type: PreferredTerm
modified: 2014-10-17T15:02:45+02:00
created: 2011-09-01T00:00:00+02:00
status: 1

village olympique
type: PreferredTerm
modified: 2014-10-17T15:02:45+02:00
created: 2011-09-01T00:00:00+02:00
status: 1

villaggio olimpico
type: PreferredTerm
modified: 2014-10-17T15:02:45+02:00
created: 2011-09-01T00:00:00+02:00
status: 1

usine de gainerie
type: PreferredTerm
modified: 2014-12-08T16:28:48+01:00
created: 2011-09-01T00:00:00+02:00
status: 1

ensemble pastoral
type: PreferredTerm
modified: 2014-12-30T13:59:02+01:00
created: 2011-09-01T00:00:00+02:00
status: 1

théâtre de jardin
type: PreferredTerm
modified: 2014-10-14T10:33:49+02:00
created: 2011-09-01T00:00:00+02:00
status: 1

perron
type: PreferredTerm
modified: 2015-02-25T12:59:00+01:00
created: 2011-09-01T00:00:00+02:00
status: 1

centrale solaire
type: PreferredTerm
modified: 2015-02-19T16:36:43+01:00
created: 2011-09-01T00:00:00+02:00
status: 1

chambre
type: PreferredTerm
modified: 2014-12-31T16:15:57+01:00
created: 2011-09-01T00:00:00+02:00
status: 1

serre
type: PreferredTerm
modified: 2014-12-30T16:12:27+01:00
created: 2011-09-01T00:00:00+02:00
status: 1

mairie
type: PreferredTerm
modified: 2014-12-12T10:17:40+01:00
created: 2011-09-01T00:00:00+02:00
status: 1

four industriel
type: PreferredTerm
modified: 2015-03-30T15:44:44+02:00
created: 2011-09-01T00:00:00+02:00
status: 1

usine de matériel de bureau
type: PreferredTerm
modified: 2015-02-04T14:21:19+01:00
created: 2011-09-01T00:00:00+02:00
status: 1

toril
type: SimpleNonPreferredTerm
modified: 2014-12-30T14:19:57+01:00
created: 2011-09-01T00:00:00+02:00
status: 1

étable à vaches
type: PreferredTerm
modified: 2014-12-30T14:19:57+01:00
created: 2011-09-01T00:00:00+02:00
status: 1

hôpital général
type: PreferredTerm
modified: 2015-01-02T11:25:43+01:00
created: 2011-09-01T00:00:00+02:00
status: 1

commanderie
type: PreferredTerm
modified: 2014-11-27T16:59:01+01:00
created: 2011-09-01T00:00:00+02:00
status: 1

hospitaller's preceptory + templars preceptory
type: PreferredTerm
modified: 2014-11-27T16:59:01+01:00
created: 2011-09-01T00:00:00+02:00
status: 1

commenda militare
type: PreferredTerm
modified: 2014-11-27T16:59:01+01:00
created: 2011-09-01T00:00:00+02:00
status: 1

commanderies
type: PreferredTerm
modified: 2014-11-27T16:59:01+01:00
created: 2011-09-01T00:00:00+02:00
status: 1

passage souterrain
type: PreferredTerm
modified: 2014-10-16T15:24:47+02:00
created: 2011-09-01T00:00:00+02:00
status: 1

garenne
type: PreferredTerm
modified: 2014-10-14T12:02:53+02:00
created: 2011-09-01T00:00:00+02:00
status: 1

ensemble de l'administration ou de la vie publique
type: PreferredTerm
modified: 2013-04-23T00:00:00+02:00
created: 2011-09-01T00:00:00+02:00
status: 1

séchoir à houblon
type: PreferredTerm
modified: 2015-02-26T12:00:22+01:00
created: 2011-09-01T00:00:00+02:00
status: 1

centre commercial
type: PreferredTerm
modified: 2014-12-05T11:24:58+01:00
created: 2011-09-01T00:00:00+02:00
status: 1

ensemble de transformation des métaux
type: PreferredTerm
modified: 2015-04-21T11:54:29+02:00
created: 2011-09-01T00:00:00+02:00
status: 1

usine à glace
type: PreferredTerm
modified: 2015-02-06T12:04:38+01:00
created: 2011-09-01T00:00:00+02:00
status: 1

secteur urbain concerté
type: PreferredTerm
modified: 2015-01-09T12:11:26+01:00
created: 2011-09-01T00:00:00+02:00
status: 1

comparto edilizio
type: PreferredTerm
modified: 2015-01-09T12:11:26+01:00
created: 2011-09-01T00:00:00+02:00
status: 1

piscine de pèlerinage
type: PreferredTerm
modified: 2014-10-23T10:54:00+02:00
created: 2011-09-01T00:00:00+02:00
status: 1

usine de produits électrochimiques
type: PreferredTerm
modified: 2015-02-11T15:17:26+01:00
created: 2011-09-01T00:00:00+02:00
status: 1

dock
type: PreferredTerm
modified: 2014-10-17T15:13:52+02:00
created: 2011-09-01T00:00:00+02:00
status: 1

centre artisanal
type: PreferredTerm
modified: 2013-04-23T00:00:00+02:00
created: 2011-09-01T00:00:00+02:00
status: 1

noyau d'escalier
type: SimpleNonPreferredTerm
modified: 2015-02-25T12:48:41+01:00
created: 2011-09-01T00:00:00+02:00
status: 1

usine de maroquinerie
type: PreferredTerm
modified: 2015-04-28T16:43:21+02:00
created: 2011-09-01T00:00:00+02:00
status: 1

pont décoré
type: SimpleNonPreferredTerm
modified: 2014-12-30T16:10:25+01:00
created: 2011-09-01T00:00:00+02:00
status: 1

pont de jardin
type: PreferredTerm
modified: 2014-12-30T16:10:25+01:00
created: 2011-09-01T00:00:00+02:00
status: 1

centrale thermique
type: PreferredTerm
modified: 2015-02-19T16:58:40+01:00
created: 2011-09-01T00:00:00+02:00
status: 1

cabinet-pièce
type: PreferredTerm
modified: 2014-12-31T16:13:57+01:00
created: 2011-09-01T00:00:00+02:00
status: 1

échevinage
type: PreferredTerm
modified: 2014-12-12T10:33:08+01:00
created: 2011-09-01T00:00:00+02:00
status: 1

exploitation aquicole
type: PreferredTerm
modified: 2014-10-06T11:55:59+02:00
created: 2011-09-01T00:00:00+02:00
status: 1

exploitation ostréicole
type: SimpleNonPreferredTerm
modified: 2014-10-06T11:55:59+02:00
created: 2011-09-01T00:00:00+02:00
status: 1

exploitation piscicole
type: SimpleNonPreferredTerm
modified: 2014-10-06T11:55:59+02:00
created: 2011-09-01T00:00:00+02:00
status: 1

exploitation conchylicole
type: SimpleNonPreferredTerm
modified: 2014-10-06T11:55:59+02:00
created: 2011-09-01T00:00:00+02:00
status: 1

théâtre de verdure
type: PreferredTerm
modified: 2014-12-30T15:46:21+01:00
created: 2011-09-01T00:00:00+02:00
status: 1

porcherie
type: PreferredTerm
modified: 2014-12-30T14:22:04+01:00
created: 2011-09-01T00:00:00+02:00
status: 1

grand parc
type: SimpleNonPreferredTerm
modified: 2014-10-14T12:03:41+02:00
created: 2011-09-01T00:00:00+02:00
status: 1

parc de chasse
type: PreferredTerm
modified: 2014-10-14T12:03:41+02:00
created: 2011-09-01T00:00:00+02:00
status: 1

aire de triage
type: PreferredTerm
modified: 2013-04-23T00:00:00+02:00
created: 2011-09-01T00:00:00+02:00
status: 1

friary + nunnery + monastery
type: PreferredTerm
modified: 2014-11-27T17:18:53+01:00
created: 2011-09-01T00:00:00+02:00
status: 1

convento
type: PreferredTerm
modified: 2014-11-27T17:18:53+01:00
created: 2011-09-01T00:00:00+02:00
status: 1

convents
type: PreferredTerm
modified: 2014-11-27T17:18:53+01:00
created: 2011-09-01T00:00:00+02:00
status: 1

couvent
type: PreferredTerm
modified: 2014-11-27T17:18:53+01:00
created: 2011-09-01T00:00:00+02:00
status: 1

usine d'instruments de musique
type: PreferredTerm
modified: 2015-02-03T13:04:23+01:00
created: 2011-09-01T00:00:00+02:00
status: 1

orphelinat
type: PreferredTerm
modified: 2015-01-02T11:28:54+01:00
created: 2011-09-01T00:00:00+02:00
status: 1

public buildings
type: PreferredTerm
modified: 2014-09-05T10:13:13+02:00
created: 2011-09-01T00:00:00+02:00
status: 1

civil
type: PreferredTerm
modified: 2014-09-05T10:13:13+02:00
created: 2011-09-01T00:00:00+02:00
status: 1

architecture civile publique
type: PreferredTerm
modified: 2014-09-05T10:13:13+02:00
created: 2011-09-01T00:00:00+02:00
status: 1

passage à niveau
type: PreferredTerm
modified: 2014-12-02T13:03:57+01:00
created: 2011-09-01T00:00:00+02:00
status: 1

usine frigorifique
type: PreferredTerm
modified: 2015-02-06T11:53:06+01:00
created: 2011-09-01T00:00:00+02:00
status: 1

excavation
type: PreferredTerm
modified: 2015-03-27T16:19:06+01:00
created: 2011-09-01T00:00:00+02:00
status: 1

ensemble de construction mécanique
type: PreferredTerm
modified: 2015-05-04T15:03:47+02:00
created: 2011-09-01T00:00:00+02:00
status: 1

salle du trésor
type: PreferredTerm
modified: 2014-10-23T10:58:57+02:00
created: 2011-09-01T00:00:00+02:00
status: 1

treasury
type: PreferredTerm
modified: 2014-10-23T10:58:57+02:00
created: 2011-09-01T00:00:00+02:00
status: 1

treasuries
type: PreferredTerm
modified: 2014-10-23T10:58:57+02:00
created: 2011-09-01T00:00:00+02:00
status: 1

tresoro di una chiesa
type: PreferredTerm
modified: 2014-10-23T10:58:57+02:00
created: 2011-09-01T00:00:00+02:00
status: 1

hangar aéronautique
type: PreferredTerm
modified: 2014-11-28T16:15:22+01:00
created: 2011-09-01T00:00:00+02:00
status: 1

remise aéronautique
type: SimpleNonPreferredTerm
modified: 2014-11-28T16:15:22+01:00
created: 2011-09-01T00:00:00+02:00
status: 1

usine de produits d'entretien
type: PreferredTerm
modified: 2015-02-11T15:12:11+01:00
created: 2011-09-01T00:00:00+02:00
status: 1

zone d'aménagement concerté
type: SimpleNonPreferredTerm
modified: 2015-01-09T11:13:54+01:00
created: 2011-09-01T00:00:00+02:00
status: 1

zone d'urbanisation prioritaire
type: SimpleNonPreferredTerm
modified: 2015-01-09T11:13:54+01:00
created: 2011-09-01T00:00:00+02:00
status: 1

cité
type: SimpleNonPreferredTerm
modified: 2015-01-09T11:13:54+01:00
created: 2011-09-01T00:00:00+02:00
status: 1

grand ensemble
type: PreferredTerm
modified: 2015-01-09T11:13:54+01:00
created: 2011-09-01T00:00:00+02:00
status: 1

station d'air comprimé
type: PreferredTerm
modified: 2015-02-19T17:09:59+01:00
created: 2011-09-01T00:00:00+02:00
status: 1

polder
type: PreferredTerm
modified: 2014-10-06T11:56:42+02:00
created: 2011-09-01T00:00:00+02:00
status: 1

bastion
type: PreferredTerm
modified: 2015-01-05T12:28:04+01:00
created: 2011-09-01T00:00:00+02:00
status: 1

hermitages
type: PreferredTerm
modified: 2014-11-28T09:40:40+01:00
created: 2011-09-01T00:00:00+02:00
status: 1

hermitage (religious)
type: PreferredTerm
modified: 2014-11-28T09:40:40+01:00
created: 2011-09-01T00:00:00+02:00
status: 1

ermitage
type: PreferredTerm
modified: 2014-11-28T09:40:40+01:00
created: 2011-09-01T00:00:00+02:00
status: 1

eremo
type: PreferredTerm
modified: 2014-11-28T09:40:40+01:00
created: 2011-09-01T00:00:00+02:00
status: 1

hôtel de ville
type: PreferredTerm
modified: 2014-12-12T10:42:30+01:00
created: 2011-09-01T00:00:00+02:00
status: 1

temple de jardin
type: PreferredTerm
modified: 2014-12-30T15:42:53+01:00
created: 2011-09-01T00:00:00+02:00
status: 1

jardin d'hiver
type: PreferredTerm
modified: 2014-12-31T16:21:23+01:00
created: 2011-09-01T00:00:00+02:00
status: 1

pavillon de jardin
type: PreferredTerm
modified: 2014-12-30T16:09:25+01:00
created: 2011-09-01T00:00:00+02:00
status: 1

maison
type: PreferredTerm
modified: 2014-12-31T12:36:44+01:00
created: 2011-09-01T00:00:00+02:00
status: 1

maison d'habitations
type: SimpleNonPreferredTerm
modified: 2014-12-31T12:36:44+01:00
created: 2011-09-01T00:00:00+02:00
status: 1

escalier mécanique
type: PreferredTerm
modified: 2015-02-25T12:57:14+01:00
created: 2011-09-01T00:00:00+02:00
status: 1

escalier roulant
type: SimpleNonPreferredTerm
modified: 2015-02-25T12:57:14+01:00
created: 2011-09-01T00:00:00+02:00
status: 1

escalator
type: SimpleNonPreferredTerm
modified: 2015-02-25T12:57:14+01:00
created: 2011-09-01T00:00:00+02:00
status: 1

usine de délainage
type: PreferredTerm
modified: 2014-12-08T15:51:27+01:00
created: 2011-09-01T00:00:00+02:00
status: 1

trophies (monuments)
type: PreferredTerm
modified: 2014-11-18T13:04:00+01:00
created: 2011-09-01T00:00:00+02:00
status: 1

trophy
type: PreferredTerm
modified: 2014-11-18T13:04:00+01:00
created: 2011-09-01T00:00:00+02:00
status: 1

trophée monumental
type: PreferredTerm
modified: 2014-11-18T13:04:00+01:00
created: 2011-09-01T00:00:00+02:00
status: 1

trofeo
type: PreferredTerm
modified: 2014-11-18T13:04:00+01:00
created: 2011-09-01T00:00:00+02:00
status: 1

vanne
type: PreferredTerm
modified: 2014-10-16T15:22:40+02:00
created: 2011-09-01T00:00:00+02:00
status: 1

jardin zoologique
type: PreferredTerm
modified: 2014-12-31T11:00:16+01:00
created: 2011-09-01T00:00:00+02:00
status: 1

zoo
type: SimpleNonPreferredTerm
modified: 2014-12-31T11:00:16+01:00
created: 2011-09-01T00:00:00+02:00
status: 1

séchoir à fromages
type: PreferredTerm
modified: 2015-02-26T11:52:58+01:00
created: 2011-09-01T00:00:00+02:00
status: 1

usine de matériel optique
type: PreferredTerm
modified: 2015-04-28T15:45:29+02:00
created: 2011-09-01T00:00:00+02:00
status: 1

ruine artificielle
type: PreferredTerm
modified: 2014-12-30T15:40:56+01:00
created: 2011-09-01T00:00:00+02:00
status: 1

ruine
type: SimpleNonPreferredTerm
modified: 2014-12-30T15:40:56+01:00
created: 2011-09-01T00:00:00+02:00
status: 1

soue
type: SimpleNonPreferredTerm
modified: 2014-12-30T14:23:33+01:00
created: 2011-09-01T00:00:00+02:00
status: 1

toit à porcs
type: PreferredTerm
modified: 2014-12-30T14:23:33+01:00
created: 2011-09-01T00:00:00+02:00
status: 1

aire des déchets
type: PreferredTerm
modified: 2015-03-24T13:25:58+01:00
created: 2011-09-01T00:00:00+02:00
status: 1

usine de mise en bouteilles des eaux minérales
type: PreferredTerm
modified: 2015-04-29T15:35:38+02:00
created: 2011-09-01T00:00:00+02:00
status: 1

redan
type: PreferredTerm
modified: 2015-01-05T13:08:39+01:00
created: 2011-09-01T00:00:00+02:00
status: 1

lotissement
type: PreferredTerm
modified: 2015-01-09T12:08:54+01:00
created: 2011-09-01T00:00:00+02:00
status: 1

organ lofts & choir lofts
type: PreferredTerm
modified: 2015-02-25T10:18:39+01:00
created: 2011-09-01T00:00:00+02:00
status: 1

tribuna d'organo
type: PreferredTerm
modified: 2015-02-25T10:18:39+01:00
created: 2011-09-01T00:00:00+02:00
status: 1

tribune d'orgue
type: PreferredTerm
modified: 2015-02-25T10:18:39+01:00
created: 2011-09-01T00:00:00+02:00
status: 1

organ loft
type: PreferredTerm
modified: 2015-02-25T10:18:39+01:00
created: 2011-09-01T00:00:00+02:00
status: 1

usine d'explosifs
type: SimpleNonPreferredTerm
modified: 2015-02-11T16:14:47+01:00
created: 2011-09-01T00:00:00+02:00
status: 1

usine de produits explosifs
type: PreferredTerm
modified: 2015-02-11T16:14:47+01:00
created: 2011-09-01T00:00:00+02:00
status: 1

batterie d'artillerie
type: PreferredTerm
modified: 2015-01-05T12:30:02+01:00
created: 2011-09-01T00:00:00+02:00
status: 1

établissement des eaux
type: PreferredTerm
modified: 2014-10-23T11:59:47+02:00
created: 2011-09-01T00:00:00+02:00
status: 1

tente de jardin
type: PreferredTerm
modified: 2014-10-14T10:32:17+02:00
created: 2011-09-01T00:00:00+02:00
status: 1

priories
type: PreferredTerm
modified: 2014-11-28T09:40:02+01:00
created: 2011-09-01T00:00:00+02:00
status: 1

prieuré
type: PreferredTerm
modified: 2014-11-28T09:40:02+01:00
created: 2011-09-01T00:00:00+02:00
status: 1

priorato
type: PreferredTerm
modified: 2014-11-28T09:40:02+01:00
created: 2011-09-01T00:00:00+02:00
status: 1

priory
type: PreferredTerm
modified: 2014-11-28T09:40:02+01:00
created: 2011-09-01T00:00:00+02:00
status: 1

usine à gaz
type: PreferredTerm
modified: 2015-03-11T11:10:31+01:00
created: 2011-09-01T00:00:00+02:00
status: 1

maison commune
type: PreferredTerm
modified: 2014-12-12T10:43:44+01:00
created: 2011-09-01T00:00:00+02:00
status: 1

usine de boyauderie
type: PreferredTerm
modified: 2015-04-28T16:41:10+02:00
created: 2011-09-01T00:00:00+02:00
status: 1

orangerie
type: PreferredTerm
modified: 2014-12-30T16:07:48+01:00
created: 2011-09-01T00:00:00+02:00
status: 1

cuisine
type: PreferredTerm
modified: 2014-12-31T16:17:42+01:00
created: 2011-09-01T00:00:00+02:00
status: 1

usine de matériel médicochirurgical
type: PreferredTerm
modified: 2015-02-04T14:24:47+01:00
created: 2011-09-01T00:00:00+02:00
status: 1

station de pompage
type: PreferredTerm
modified: 2014-12-02T12:48:07+01:00
created: 2011-09-01T00:00:00+02:00
status: 1

aire des matières premières
type: PreferredTerm
modified: 2015-03-24T15:08:31+01:00
created: 2011-09-01T00:00:00+02:00
status: 1

parc
type: PreferredTerm
modified: 2014-12-31T11:10:01+01:00
created: 2011-09-01T00:00:00+02:00
status: 1

redoute
type: PreferredTerm
modified: 2015-01-05T13:12:07+01:00
created: 2011-09-01T00:00:00+02:00
status: 1

four à chaux
type: PreferredTerm
modified: 2015-03-30T16:22:43+02:00
created: 2011-09-01T00:00:00+02:00
status: 1

usine de mise en bouteilles
type: PreferredTerm
modified: 2015-04-29T15:30:15+02:00
created: 2011-09-01T00:00:00+02:00
status: 1

rock carving + rune stone + inscribed stone
type: PreferredTerm
modified: 2015-02-24T16:38:21+01:00
created: 2011-09-01T00:00:00+02:00
status: 1

pitture rupestri + scultura preistorica
type: PreferredTerm
modified: 2015-02-24T16:38:21+01:00
created: 2011-09-01T00:00:00+02:00
status: 1

roche ornée
type: PreferredTerm
modified: 2015-02-24T16:38:21+01:00
created: 2011-09-01T00:00:00+02:00
status: 1

centre d'affaires
type: PreferredTerm
modified: 2014-10-17T15:15:10+02:00
created: 2011-09-01T00:00:00+02:00
status: 1

pièce d'affinage
type: PreferredTerm
modified: 2015-02-26T11:57:22+01:00
created: 2011-09-01T00:00:00+02:00
status: 1

balance publique
type: Concept
modified: 2015-02-26T11:39:58+01:00
in scheme: Thésaurus de la désignation des œuvres architecturales et des espaces aménagés
broader: pont-bascule
alternative label: poids public
created: 2014-05-27T17:36:58+02:00
definition: Ouvrage permettant de vérifier la masse des matières vendues : sacs de contenance diverse, animaux, etc. Elle est souvent placée à proximité d'un marché ou d'un champ de foire.
status: 1
broad match: cb11983022j

balance publique
type: PreferredTerm
modified: 2015-02-26T11:39:58+01:00
created: 2014-05-27T17:36:58+02:00
status: 1

abattoirs
type: SimpleNonPreferredTerm
modified: 2014-12-04T14:55:33+01:00
created: 2014-04-03T17:07:29+02:00
status: 1

focus
type: CustomConceptAttribute

tunnels
type: PreferredTerm
modified: 2014-12-02T15:05:59+01:00
created: 2014-09-23T18:13:32+02:00
status: 1

music conservatories & drama schools
type: PreferredTerm
modified: 2014-12-01T16:06:04+01:00
created: 2014-09-22T17:11:06+02:00
status: 1

hemp ovens
type: PreferredTerm
modified: 2015-02-25T15:39:19+01:00
created: 2014-09-17T11:55:48+02:00
status: 1

dams
type: PreferredTerm
modified: 2014-12-01T14:00:58+01:00
created: 2014-09-23T15:58:47+02:00
status: 1

grandstands
type: PreferredTerm
modified: 2014-10-17T16:46:58+02:00
created: 2014-09-05T15:30:50+02:00
status: 1

vaults (structural elements)
type: PreferredTerm
modified: 2015-02-24T17:23:08+01:00
created: 2014-09-04T16:36:57+02:00
status: 1

curtain walls
type: PreferredTerm
modified: 2015-01-05T12:36:35+01:00
created: 2014-09-19T16:47:31+02:00
status: 1

parking garages
type: PreferredTerm
modified: 2014-12-31T15:57:24+01:00
created: 2014-09-18T18:09:49+02:00
status: 1

electric substations
type: PreferredTerm
modified: 2014-12-02T15:04:59+01:00
created: 2014-09-23T18:12:35+02:00
status: 1

service stations
type: PreferredTerm
modified: 2014-12-05T11:19:56+01:00
created: 2014-09-04T11:55:01+02:00
status: 1

ovens (baking equipment)
type: PreferredTerm
modified: 2015-02-25T14:43:42+01:00
created: 2014-09-17T11:53:52+02:00
status: 1

égouts
type: PreferredTerm
modified: 2014-12-02T12:04:39+01:00
created: 2014-09-23T16:58:07+02:00
status: 1

domes (architectural elements)
type: PreferredTerm
modified: 2015-02-24T17:24:39+01:00
created: 2014-09-04T16:42:09+02:00
status: 1

sports buildings
type: PreferredTerm
modified: 2014-09-05T15:41:05+02:00
created: 2014-09-05T15:41:04+02:00
status: 1

ballrooms
type: PreferredTerm
modified: 2014-10-17T15:57:59+02:00
created: 2014-09-08T12:26:59+02:00
status: 1

town houses
type: PreferredTerm
modified: 2014-12-31T12:22:24+01:00
created: 2014-09-18T17:25:11+02:00
status: 1

pavements (surface elements)
type: PreferredTerm
modified: 2015-02-25T10:25:18+01:00
created: 2014-09-04T17:22:42+02:00
status: 1

tollbooths
type: PreferredTerm
modified: 2014-10-09T11:38:01+02:00
created: 2014-09-04T11:52:27+02:00
status: 1

lunchrooms
type: PreferredTerm
modified: 2015-02-25T11:31:18+01:00
created: 2014-09-08T17:42:57+02:00
status: 1

rose windows
type: PreferredTerm
modified: 2014-10-16T10:49:33+02:00
created: 2014-09-04T15:10:40+02:00
status: 1

playgrounds
type: PreferredTerm
modified: 2014-10-17T15:45:35+02:00
created: 2014-09-05T15:35:39+02:00
status: 1

blockhouses
type: PreferredTerm
modified: 2015-01-05T12:33:48+01:00
created: 2014-09-19T16:36:51+02:00
status: 1

gatehouses & lodges
type: PreferredTerm
modified: 2014-12-31T15:50:51+01:00
created: 2014-09-18T18:06:40+02:00
status: 1

footbaths
type: PreferredTerm
modified: 2015-02-25T16:36:21+01:00
created: 2014-09-17T13:03:24+02:00
status: 1

parquetry
type: PreferredTerm
modified: 2015-02-25T10:24:25+01:00
created: 2014-09-04T17:16:14+02:00
status: 1

apartment houses
type: PreferredTerm
modified: 2014-12-31T12:26:01+01:00
created: 2014-09-18T17:26:23+02:00
status: 1

fireplaces
type: PreferredTerm
modified: 2015-02-25T10:07:16+01:00
created: 2014-09-08T17:52:23+02:00
status: 1

art schools
type: PreferredTerm
modified: 2014-12-01T16:05:00+01:00
created: 2014-09-22T17:03:10+02:00
status: 1

auction houses
type: PreferredTerm
modified: 2014-10-06T15:39:58+02:00
created: 2014-09-04T11:46:10+02:00
status: 1

casemates
type: PreferredTerm
modified: 2015-01-05T12:31:28+01:00
created: 2014-09-19T16:33:40+02:00
status: 1

academies (buildings)
type: PreferredTerm
modified: 2014-12-12T14:26:02+01:00
created: 2014-09-05T15:33:38+02:00
status: 1

carriagehouses
type: PreferredTerm
modified: 2014-12-31T15:55:08+01:00
created: 2014-09-18T18:07:57+02:00
status: 1

colonnades
type: PreferredTerm
modified: 2015-02-25T11:37:19+01:00
created: 2014-09-08T17:44:36+02:00
status: 1

floor coverings
type: PreferredTerm
modified: 2015-02-25T10:23:33+01:00
created: 2014-09-04T17:11:24+02:00
status: 1

arches
type: PreferredTerm
modified: 2015-02-25T12:23:26+01:00
created: 2014-09-04T16:13:58+02:00
status: 1

arsenals
type: PreferredTerm
modified: 2015-01-05T11:31:14+01:00
created: 2014-09-19T13:58:53+02:00
status: 1

dwellings
type: PreferredTerm
modified: 2014-12-31T13:03:17+01:00
created: 2014-09-18T17:18:38+02:00
status: 1

vestibules & entrance halls
type: PreferredTerm
modified: 2015-02-26T11:33:38+01:00
created: 2014-09-17T15:13:41+02:00
status: 1

rose gardens
type: PreferredTerm
modified: 2014-12-31T11:19:50+01:00
created: 2014-09-18T15:58:26+02:00
status: 1

wells
type: PreferredTerm
modified: 2015-02-24T15:47:37+01:00
created: 2014-09-23T18:31:39+02:00
status: 1

posterns
type: PreferredTerm
modified: 2015-01-05T13:24:21+01:00
created: 2014-09-22T10:02:50+02:00
status: 1

air bases
type: PreferredTerm
modified: 2015-01-05T11:59:50+01:00
created: 2014-09-19T15:56:46+02:00
status: 1

brasseries
type: PreferredTerm
modified: 2014-12-05T10:58:27+01:00
created: 2014-09-04T12:25:41+02:00
status: 1

peristyles (colonnades)
type: PreferredTerm
modified: 2015-02-25T11:42:16+01:00
created: 2014-09-08T17:45:49+02:00
status: 1

barracks
type: PreferredTerm
modified: 2015-01-05T11:37:08+01:00
created: 2014-09-19T14:00:09+02:00
status: 1

pleasure gardens
type: PreferredTerm
modified: 2014-12-31T10:33:15+01:00
created: 2014-09-18T15:41:43+02:00
status: 1

castles & châteaux
type: PreferredTerm
modified: 2014-12-31T12:18:54+01:00
created: 2014-09-18T17:22:53+02:00
status: 1

defensive walls
type: PreferredTerm
modified: 2015-01-05T12:44:17+01:00
created: 2014-09-19T17:01:40+02:00
status: 1

manholes
type: PreferredTerm
modified: 2014-10-16T15:16:05+02:00
created: 2014-09-23T18:33:42+02:00
status: 1

naval bases
type: PreferredTerm
modified: 2015-01-05T12:01:17+01:00
created: 2014-09-19T15:58:20+02:00
status: 1

lintels
type: PreferredTerm
modified: 2015-02-24T17:16:06+01:00
created: 2014-09-04T16:24:54+02:00
status: 1

restaurants
type: PreferredTerm
modified: 2014-12-05T10:57:26+01:00
created: 2014-09-04T11:31:08+02:00
status: 1

incinerators
type: PreferredTerm
modified: 2014-10-16T14:15:24+02:00
created: 2014-09-23T13:34:52+02:00
status: 1

citadels
type: PreferredTerm
modified: 2015-01-05T11:26:36+01:00
created: 2014-09-19T13:56:36+02:00
status: 1

souterrains
type: PreferredTerm
modified: 2014-12-31T12:06:45+01:00
created: 2014-09-18T17:15:07+02:00
status: 1

drawbridges
type: PreferredTerm
modified: 2015-01-05T13:21:03+01:00
created: 2014-09-22T09:55:54+02:00
status: 1

reservoirs
type: PreferredTerm
modified: 2014-12-02T12:41:41+01:00
created: 2014-09-23T18:36:03+02:00
status: 1

tide gages
type: PreferredTerm
modified: 2014-10-10T10:48:03+02:00
created: 2014-09-08T12:47:15+02:00
status: 1

ceilings
type: PreferredTerm
modified: 2015-02-25T12:24:39+01:00
created: 2014-09-04T16:27:58+02:00
status: 1

structural frames
type: PreferredTerm
modified: 2015-02-24T16:56:08+01:00
created: 2014-09-04T15:30:25+02:00
status: 1

cisterns
type: PreferredTerm
modified: 2014-12-02T12:48:56+01:00
created: 2014-09-23T18:38:03+02:00
status: 1

traps (trapping equipment)
type: PreferredTerm
modified: 2014-10-16T11:37:42+02:00
created: 2014-09-17T13:08:26+02:00
status: 1

keeps
type: PreferredTerm
modified: 2015-01-05T12:40:16+01:00
created: 2014-09-19T16:49:25+02:00
status: 1

water towers
type: PreferredTerm
modified: 2014-12-02T12:49:39+01:00
created: 2014-09-23T18:37:01+02:00
status: 1

wharves
type: PreferredTerm
modified: 2014-10-16T14:33:02+02:00
created: 2014-09-23T15:47:27+02:00
status: 1

military installations
type: PreferredTerm
modified: 2014-10-14T15:54:10+02:00
created: 2014-09-19T14:16:03+02:00
status: 1

platbands
type: PreferredTerm
modified: 2015-02-25T12:31:33+01:00
created: 2014-09-04T16:34:01+02:00
status: 1

forts
type: PreferredTerm
modified: 2015-01-05T11:17:17+01:00
created: 2014-09-19T13:53:22+02:00
status: 1

university and college buildings
type: PreferredTerm
modified: 2014-12-01T17:14:04+01:00
created: 2014-09-22T17:43:35+02:00
status: 1

meteorological stations
type: PreferredTerm
modified: 2014-12-19T10:26:08+01:00
created: 2014-09-08T12:52:56+02:00
status: 1

carriage houses
type: PreferredTerm
modified: 2014-12-30T14:51:28+01:00
created: 2014-09-03T16:27:17+02:00
status: 1

mikvehs
type: PreferredTerm
modified: 2014-10-15T13:36:20+02:00
created: 2014-09-22T12:41:54+02:00
status: 1

sports complexes
type: PreferredTerm
modified: 2014-12-19T11:21:20+01:00
created: 2014-09-05T14:50:56+02:00
status: 1

tow paths
type: PreferredTerm
modified: 2015-01-07T12:45:49+01:00
created: 2014-09-24T16:07:28+02:00
status: 1

billiard rooms
type: PreferredTerm
modified: 2014-12-19T10:54:51+01:00
created: 2014-09-08T10:15:35+02:00
status: 1

lawns (landscaped grass)
type: PreferredTerm
modified: 2014-12-30T16:45:50+01:00
created: 2014-09-18T12:19:25+02:00
status: 1

campgrounds
type: PreferredTerm
modified: 2014-12-19T11:19:47+01:00
created: 2014-09-05T14:45:38+02:00
status: 1

paths
type: PreferredTerm
modified: 2015-01-07T12:43:28+01:00
created: 2014-09-24T15:51:37+02:00
status: 1

gymnasiums
type: PreferredTerm
modified: 2014-12-12T15:05:49+01:00
created: 2014-09-08T11:24:27+02:00
status: 1

tithe barns
type: PreferredTerm
modified: 2015-01-02T11:06:00+01:00
created: 2014-09-08T16:11:22+02:00
status: 1

fortresses
type: PreferredTerm
modified: 2015-01-05T11:21:38+01:00
created: 2014-09-19T13:54:45+02:00
status: 1

Irrigation systems
type: PreferredTerm
modified: 2014-12-01T12:57:28+01:00
created: 2014-09-23T14:27:43+02:00
status: 1

sawtooth roofs
type: PreferredTerm
modified: 2015-02-25T12:06:55+01:00
created: 2014-09-08T18:03:11+02:00
status: 1

art galleries
type: PreferredTerm
modified: 2014-10-10T10:57:01+02:00
created: 2014-09-08T14:02:23+02:00
status: 1

channels
type: PreferredTerm
modified: 2014-12-01T14:16:50+01:00
created: 2014-09-23T16:49:49+02:00
status: 1

military camps
type: PreferredTerm
modified: 2015-01-05T11:03:35+01:00
created: 2014-09-19T13:50:03+02:00
status: 1

wine presses
type: PreferredTerm
modified: 2014-12-30T14:47:21+01:00
created: 2014-09-03T16:16:20+02:00
status: 1

golf courses
type: PreferredTerm
modified: 2014-12-12T15:27:56+01:00
created: 2014-09-08T11:38:39+02:00
status: 1

recreation areas
type: PreferredTerm
modified: 2014-10-17T16:21:55+02:00
created: 2014-09-05T14:43:33+02:00
status: 1

convention centers
type: PreferredTerm
modified: 2014-12-19T10:47:20+01:00
created: 2014-09-08T09:57:35+02:00
status: 1

glass roof
type: PreferredTerm
modified: 2015-02-25T12:09:40+01:00
created: 2014-09-08T18:05:43+02:00
status: 1

gallows
type: PreferredTerm
modified: 2014-10-14T14:08:59+02:00
created: 2014-09-08T16:51:07+02:00
status: 1

bus shelters
type: PreferredTerm
modified: 2014-10-16T14:13:12+02:00
created: 2014-09-23T13:04:06+02:00
status: 1

exhibition building spaces
type: PreferredTerm
modified: 2014-09-05T17:21:23+02:00
created: 2014-09-05T17:21:23+02:00
status: 1

maternity hospitals
type: PreferredTerm
modified: 2015-01-02T12:16:46+01:00
created: 2014-09-19T12:30:01+02:00
status: 1

slipways
type: PreferredTerm
modified: 2014-12-01T14:15:49+01:00
created: 2014-09-23T16:47:26+02:00
status: 1

theological seminaries
type: PreferredTerm
modified: 2014-12-01T17:06:42+01:00
created: 2014-09-22T17:38:38+02:00
status: 1

dead-end streets
type: PreferredTerm
modified: 2015-01-07T13:09:04+01:00
created: 2014-09-24T16:09:46+02:00
status: 1

roundhouses
type: PreferredTerm
modified: 2014-11-28T17:08:16+01:00
created: 2014-09-23T13:02:34+02:00
status: 1

archery ranges
type: PreferredTerm
modified: 2014-10-17T15:52:20+02:00
created: 2014-09-08T11:03:59+02:00
status: 1

police stations
type: PreferredTerm
modified: 2015-01-05T10:29:44+01:00
created: 2014-09-08T17:06:23+02:00
status: 1

spillways
type: PreferredTerm
modified: 2014-12-01T14:24:18+01:00
created: 2014-09-23T16:52:53+02:00
status: 1

Lourdes grottoes
type: PreferredTerm
modified: 2015-02-24T12:06:56+01:00
created: 2014-10-15T12:03:45+02:00
status: 1

compressed air utilities
type: PreferredTerm
modified: 2014-10-17T09:15:56+02:00
created: 2014-09-24T10:10:49+02:00
status: 1

dikes
type: PreferredTerm
modified: 2014-12-01T14:27:37+01:00
created: 2014-09-23T16:54:00+02:00
status: 1

water distribution structures
type: PreferredTerm
modified: 2015-02-25T16:11:33+01:00
created: 2014-09-17T12:23:05+02:00
status: 1

airports
type: PreferredTerm
modified: 2014-12-01T12:05:58+01:00
created: 2014-09-23T13:41:07+02:00
status: 1

heating systems
type: PreferredTerm
modified: 2014-10-17T09:18:26+02:00
created: 2014-09-24T10:20:58+02:00
status: 1

exhibitions buildings
type: PreferredTerm
modified: 2014-12-19T10:29:01+01:00
created: 2014-09-08T14:04:49+02:00
status: 1

boarding schools
type: PreferredTerm
modified: 2014-12-08T11:12:23+01:00
created: 2014-09-22T17:35:17+02:00
status: 1

operating rooms
type: PreferredTerm
modified: 2014-10-14T15:37:13+02:00
created: 2014-09-19T10:56:56+02:00
status: 1

running tracks
type: PreferredTerm
modified: 2014-10-10T12:21:21+02:00
created: 2014-09-05T15:17:32+02:00
status: 1

shooting ranges
type: PreferredTerm
modified: 2014-10-17T15:51:01+02:00
created: 2014-09-08T11:04:13+02:00
status: 1

military academies
type: PreferredTerm
modified: 2014-12-01T16:08:16+01:00
created: 2014-09-22T17:15:04+02:00
status: 1

courthouse
type: PreferredTerm
modified: 2015-01-05T10:48:53+01:00
created: 2014-09-08T17:20:32+02:00
status: 1

community centers
type: PreferredTerm
modified: 2014-10-10T11:57:33+02:00
created: 2014-09-08T10:16:42+02:00
status: 1

canals
type: PreferredTerm
modified: 2014-12-01T12:54:44+01:00
created: 2014-09-23T14:28:04+02:00
status: 1

roadways
type: PreferredTerm
modified: 2015-01-07T12:37:26+01:00
created: 2014-09-24T15:49:15+02:00
status: 1

camps (recreation areas)
type: PreferredTerm
modified: 2014-12-12T14:43:53+01:00
created: 2014-09-05T14:58:56+02:00
status: 1

garden walks
type: PreferredTerm
modified: 2014-10-14T09:30:41+02:00
created: 2014-09-17T16:28:44+02:00
status: 1

beltways
type: SimpleNonPreferredTerm
modified: 2014-10-17T14:50:10+02:00
created: 2014-09-24T15:42:25+02:00
status: 1

prisons
type: PreferredTerm
modified: 2015-01-05T10:33:06+01:00
created: 2014-09-08T17:10:39+02:00
status: 1

parish houses
type: PreferredTerm
modified: 2014-12-19T10:56:25+01:00
created: 2014-09-08T14:32:05+02:00
status: 1

locks (hydraulic structures)
type: PreferredTerm
modified: 2014-12-02T12:00:08+01:00
created: 2014-09-23T16:55:53+02:00
status: 1

utilities
type: PreferredTerm
modified: 2014-09-24T10:33:30+02:00
created: 2014-09-24T09:45:44+02:00
status: 1

gutters
type: PreferredTerm
modified: 2015-01-07T12:35:02+01:00
created: 2014-09-24T15:45:05+02:00
status: 1

amusement parks
type: PreferredTerm
modified: 2014-10-10T12:10:42+02:00
created: 2014-09-05T14:51:55+02:00
status: 1

bake ovens
type: PreferredTerm
modified: 2015-02-25T16:06:51+01:00
created: 2014-09-17T11:57:06+02:00
status: 1

aqueducts
type: PreferredTerm
modified: 2014-12-01T12:49:56+01:00
created: 2014-09-23T14:25:09+02:00
status: 1

marine terminals
type: PreferredTerm
modified: 2014-11-18T12:58:40+01:00
created: 2014-09-23T14:53:10+02:00
status: 1

dairies
type: PreferredTerm
modified: 2014-12-04T16:44:21+01:00
created: 2014-09-04T10:58:48+02:00
status: 1

consulates (diplomatic buildings)
type: PreferredTerm
modified: 2014-10-09T11:55:21+02:00
created: 2014-09-05T11:41:20+02:00
status: 1

presses (culinary tools)
type: PreferredTerm
modified: 2014-12-30T14:43:23+01:00
created: 2014-09-03T15:30:11+02:00
status: 1

infirmaries
type: PreferredTerm
modified: 2015-01-02T11:54:53+01:00
created: 2014-09-19T12:25:31+02:00
status: 1

telecommunication systems
type: PreferredTerm
modified: 2014-10-17T10:00:13+02:00
created: 2014-09-24T10:39:47+02:00
status: 1

observatories
type: PreferredTerm
modified: 2014-12-19T10:21:10+01:00
created: 2014-09-08T12:31:09+02:00
status: 1

skating rinks
type: PreferredTerm
modified: 2014-12-12T15:28:49+01:00
created: 2014-09-08T11:40:03+02:00
status: 1

columbaria
type: PreferredTerm
modified: 2015-02-24T15:57:32+01:00
created: 2014-09-22T10:24:25+02:00
status: 1

office buildings
type: PreferredTerm
modified: 2014-12-04T16:33:48+01:00
created: 2014-09-04T10:54:07+02:00
status: 1

ports
type: PreferredTerm
modified: 2014-12-01T13:26:26+01:00
created: 2014-09-23T14:54:36+02:00
status: 1

Campuses
type: PreferredTerm
modified: 2014-10-16T10:33:27+02:00
created: 2014-09-22T17:51:02+02:00
status: 1

ponds
type: PreferredTerm
modified: 2014-12-30T17:04:59+01:00
created: 2014-09-18T12:50:55+02:00
status: 1

cider presses
type: PreferredTerm
modified: 2014-12-30T14:45:08+01:00
created: 2014-09-03T16:13:12+02:00
status: 1

bell towers
type: PreferredTerm
modified: 2014-12-05T12:06:14+01:00
created: 2014-09-05T10:58:12+02:00
status: 1

irrigation systems
type: PreferredTerm
modified: 2014-10-06T12:01:57+02:00
created: 2014-09-03T12:30:37+02:00
status: 1

teaching hospitals
type: PreferredTerm
modified: 2015-01-02T12:28:27+01:00
created: 2014-09-19T10:38:36+02:00
status: 1

dispensaries
type: PreferredTerm
modified: 2015-01-02T11:51:29+01:00
created: 2014-09-19T12:22:44+02:00
status: 1

Covered walkways
type: PreferredTerm
modified: 2015-01-07T13:13:00+01:00
created: 2014-09-25T11:13:24+02:00
status: 1

slaughterhouses
type: PreferredTerm
modified: 2014-12-04T14:55:33+01:00
created: 2014-09-03T17:13:31+02:00
status: 1

post offices
type: PreferredTerm
modified: 2014-12-05T12:07:02+01:00
created: 2014-09-05T11:00:46+02:00
status: 1

canchas
type: PreferredTerm
modified: 2014-10-10T10:05:12+02:00
created: 2014-09-08T11:21:26+02:00
status: 1

hotels
type: PreferredTerm
modified: 2014-12-04T16:33:01+01:00
created: 2014-10-06T13:23:24+02:00
status: 1

psychiatric hospitals
type: PreferredTerm
modified: 2015-01-02T12:01:23+01:00
created: 2014-09-19T12:28:35+02:00
status: 1

basilicas
type: PreferredTerm
modified: 2014-11-27T15:55:37+01:00
created: 2014-09-22T13:10:21+02:00
status: 1

carpet beds
type: PreferredTerm
modified: 2014-12-30T16:42:33+01:00
created: 2014-09-18T12:05:56+02:00
status: 1

electric utilities
type: PreferredTerm
modified: 2014-10-17T09:19:16+02:00
created: 2014-09-24T10:24:31+02:00
status: 1

bicycle paths
type: PreferredTerm
modified: 2015-01-07T13:18:35+01:00
created: 2014-09-25T11:14:45+02:00
status: 1

jeu de paume fields
type: PreferredTerm
modified: 2014-10-10T10:09:44+02:00
created: 2014-09-08T11:29:10+02:00
status: 1

artificial islands
type: PreferredTerm
modified: 2014-12-30T17:06:45+01:00
created: 2014-09-18T12:57:33+02:00
status: 1

hospitals
type: PreferredTerm
modified: 2015-01-02T12:22:42+01:00
created: 2014-09-19T12:27:08+02:00
status: 1

street lighting
type: PreferredTerm
modified: 2014-10-17T09:17:05+02:00
created: 2014-09-24T10:13:16+02:00
status: 1

courtrooms
type: PreferredTerm
modified: 2015-01-05T10:59:24+01:00
created: 2014-09-08T17:33:40+02:00
status: 1

riding halls
type: PreferredTerm
modified: 2014-12-12T15:26:33+01:00
created: 2014-09-08T11:36:40+02:00
status: 1

exhibition buildings
type: PreferredTerm
modified: 2014-10-17T15:18:12+02:00
created: 2014-09-05T09:49:38+02:00
status: 1

poultry houses
type: PreferredTerm
modified: 2014-12-30T14:39:41+01:00
created: 2014-09-03T15:18:49+02:00
status: 1

intersections
type: PreferredTerm
modified: 2015-01-07T12:01:37+01:00
created: 2014-09-24T12:43:47+02:00
status: 1

department stores
type: PreferredTerm
modified: 2014-12-05T10:16:26+01:00
created: 2014-09-04T12:02:53+02:00
status: 1

clubhouses
type: PreferredTerm
modified: 2014-12-12T10:48:54+01:00
created: 2014-09-05T12:23:16+02:00
status: 1

museums (buildings)
type: PreferredTerm
modified: 2014-12-19T10:42:37+01:00
created: 2014-09-05T17:31:10+02:00
status: 1

flower beds
type: PreferredTerm
modified: 2014-12-30T16:36:13+01:00
created: 2014-09-18T12:04:51+02:00
status: 1

ponds (water)
type: PreferredTerm
modified: 2014-12-30T14:33:27+01:00
created: 2014-09-03T15:11:37+02:00
status: 1

hotels (public accommodations)
type: PreferredTerm
modified: 2014-10-17T15:16:46+02:00
created: 2014-09-29T12:05:30+02:00
status: 1

traffic circles
type: PreferredTerm
modified: 2015-01-07T11:59:33+01:00
created: 2014-09-24T13:29:39+02:00
status: 1

shopping arcades
type: PreferredTerm
modified: 2014-12-05T10:13:57+01:00
created: 2014-09-04T12:00:46+02:00
status: 1

farms
type: PreferredTerm
modified: 2014-12-30T13:52:01+01:00
created: 2014-09-03T11:36:13+02:00
status: 1

ha-has
type: PreferredTerm
modified: 2014-10-14T09:44:30+02:00
created: 2014-09-30T12:34:51+02:00
status: 1

dovecotes
type: PreferredTerm
modified: 2014-12-30T14:35:56+01:00
created: 2014-09-03T15:14:49+02:00
status: 1

horse racetracks
type: PreferredTerm
modified: 2014-12-12T15:08:13+01:00
created: 2014-09-08T11:25:34+02:00
status: 1

fairgrounds
type: PreferredTerm
modified: 2014-12-05T11:22:29+01:00
created: 2014-09-05T09:37:10+02:00
status: 1

motion-picture studios
type: PreferredTerm
modified: 2014-12-19T10:34:28+01:00
created: 2014-09-08T14:23:37+02:00
status: 1

stands (mercantile structures)
type: PreferredTerm
modified: 2014-12-05T10:04:33+01:00
created: 2014-09-04T11:58:56+02:00
status: 1

parterre
type: PreferredTerm
modified: 2014-12-30T16:40:57+01:00
created: 2014-09-18T12:01:16+02:00
status: 1

cascades
type: PreferredTerm
modified: 2014-12-30T17:01:55+01:00
created: 2014-09-18T12:49:41+02:00
status: 1

marshalling yards
type: PreferredTerm
modified: 2014-12-01T13:12:36+01:00
created: 2014-09-23T14:51:00+02:00
status: 1

haylofts
type: PreferredTerm
modified: 2014-12-30T14:29:18+01:00
created: 2014-09-03T15:00:18+02:00
status: 1

terraces
type: PreferredTerm
modified: 2014-12-31T11:27:06+01:00
created: 2014-09-18T16:57:00+02:00
status: 1

welfare buildings
type: PreferredTerm
modified: 2015-01-02T11:33:51+01:00
created: 2014-09-19T11:34:27+02:00
status: 1

waterfalls
type: PreferredTerm
modified: 2014-12-30T16:57:35+01:00
created: 2014-09-18T12:48:00+02:00
status: 1

Japanese paving stones
type: PreferredTerm
modified: 2014-09-30T12:55:51+02:00
created: 2014-09-30T12:52:35+02:00
status: 1

agricultural buildings
type: PreferredTerm
modified: 2014-09-02T16:59:42+02:00
created: 2014-09-02T16:52:34+02:00
status: 1

stores
type: PreferredTerm
modified: 2014-10-06T13:25:50+02:00
created: 2014-09-04T11:05:07+02:00
status: 1

barns
type: PreferredTerm
modified: 2014-12-30T14:32:07+01:00
created: 2014-09-03T15:04:47+02:00
status: 1

necropolises
type: PreferredTerm
modified: 2014-10-15T13:17:44+02:00
created: 2014-09-22T11:40:42+02:00
status: 1

telegraphs
type: PreferredTerm
modified: 2014-10-17T10:03:17+02:00
created: 2014-09-24T10:38:53+02:00
status: 1

woodsheds
type: PreferredTerm
modified: 2014-12-31T15:35:01+01:00
created: 2014-09-18T17:56:58+02:00
status: 1

fountains
type: PreferredTerm
modified: 2015-02-24T15:39:06+01:00
created: 2014-09-23T18:26:41+02:00
status: 1

huts
type: PreferredTerm
modified: 2014-12-31T12:03:19+01:00
created: 2014-09-18T17:13:58+02:00
status: 1

sanatoriums
type: PreferredTerm
modified: 2015-01-02T12:13:56+01:00
created: 2014-09-19T12:37:04+02:00
status: 1

long galleries
type: PreferredTerm
modified: 2015-02-26T11:06:42+01:00
created: 2014-09-17T14:32:28+02:00
status: 1

doors
type: PreferredTerm
modified: 2015-02-24T16:50:20+01:00
created: 2014-09-04T14:56:48+02:00
status: 1

farm building
type: PreferredTerm
modified: 2014-09-02T17:16:32+02:00
created: 2014-09-02T17:16:17+02:00
status: 1

grottoes
type: PreferredTerm
modified: 2014-12-30T15:32:01+01:00
created: 2014-09-17T18:17:27+02:00
status: 1

ministries
type: PreferredTerm
modified: 2014-10-09T12:10:31+02:00
created: 2014-09-05T12:00:56+02:00
status: 1

agglomerations
type: PreferredTerm
modified: 2015-01-07T11:52:24+01:00
created: 2014-09-24T11:27:01+02:00
status: 1

international organizations buildings
type: PreferredTerm
modified: 2014-10-17T15:34:11+02:00
created: 2014-09-05T12:48:16+02:00
status: 1

niches
type: PreferredTerm
modified: 2015-02-24T16:49:09+01:00
created: 2014-09-04T14:53:36+02:00
status: 1

granges (farms)
type: PreferredTerm
modified: 2014-12-30T13:49:45+01:00
created: 2014-09-03T11:43:31+02:00
status: 1

granaries
type: PreferredTerm
modified: 2014-12-05T12:20:26+01:00
created: 2014-09-05T11:51:18+02:00
status: 1

porte-cochères
type: PreferredTerm
modified: 2015-02-25T11:24:09+01:00
created: 2014-09-04T15:01:11+02:00
status: 1

baileys
type: PreferredTerm
modified: 2014-12-31T15:32:08+01:00
created: 2014-09-18T17:51:50+02:00
status: 1

guildhalls
type: PreferredTerm
modified: 2014-12-12T10:52:57+01:00
created: 2014-09-05T12:42:08+02:00
status: 1

waterfronts
type: PreferredTerm
modified: 2015-01-08T10:34:31+01:00
created: 2014-09-25T13:19:01+02:00
status: 1

administration buildings
type: PreferredTerm
modified: 2014-09-05T11:12:26+02:00
created: 2014-09-05T11:11:37+02:00
status: 1

horse farms
type: PreferredTerm
modified: 2014-12-30T13:54:21+01:00
created: 2014-09-03T11:39:22+02:00
status: 1

pergolas
type: PreferredTerm
modified: 2014-12-30T15:35:14+01:00
created: 2014-09-17T18:22:14+02:00
status: 1

public gardens
type: PreferredTerm
modified: 2014-12-31T10:39:14+01:00
created: 2014-09-18T16:05:37+02:00
status: 1

porticoes
type: PreferredTerm
modified: 2015-02-26T11:12:16+01:00
created: 2014-09-17T14:42:34+02:00
status: 1

interchanges
type: PreferredTerm
modified: 2014-10-17T14:34:19+02:00
created: 2014-09-24T13:30:52+02:00
status: 1

portals
type: PreferredTerm
modified: 2015-02-24T16:53:32+01:00
created: 2014-09-04T14:58:53+02:00
status: 1

towers
type: PreferredTerm
modified: 2015-02-26T12:18:46+01:00
created: 2014-09-17T13:27:23+02:00
status: 1

brine fields
type: PreferredTerm
modified: 2015-01-21T16:00:51+01:00
created: 2014-09-23T16:37:35+02:00
status: 1

housing complexes
type: PreferredTerm
modified: 2014-12-31T15:48:26+01:00
created: 2014-10-14T12:55:29+02:00
status: 1

laundries (businesses)
type: PreferredTerm
modified: 2014-10-09T11:24:15+02:00
created: 2014-09-03T17:35:36+02:00
status: 1

stables
type: PreferredTerm
modified: 2014-12-31T15:42:17+01:00
created: 2014-09-18T18:02:12+02:00
status: 1

mottes
type: PreferredTerm
modified: 2015-01-05T12:57:45+01:00
created: 2014-09-19T17:18:07+02:00
status: 1

turrets
type: PreferredTerm
modified: 2015-02-26T12:21:03+01:00
created: 2014-09-17T15:15:08+02:00
status: 1

banks (financial institutions)
type: PreferredTerm
modified: 2014-12-04T15:10:17+01:00
created: 2014-09-03T17:33:06+02:00
status: 1

loggias
type: PreferredTerm
modified: 2015-02-26T11:25:14+01:00
created: 2014-09-17T14:48:45+02:00
status: 1

botanical gardens
type: PreferredTerm
modified: 2014-12-31T10:26:47+01:00
created: 2014-09-18T15:40:03+02:00
status: 1

fosses
type: PreferredTerm
modified: 2015-01-05T12:51:43+01:00
created: 2014-09-19T17:10:10+02:00
status: 1

troughs
type: PreferredTerm
modified: 2014-12-30T14:11:06+01:00
created: 2014-09-03T12:42:32+02:00
status: 1

aisles
type: PreferredTerm
modified: 2015-02-26T12:24:37+01:00
created: 2014-09-17T13:29:19+02:00
status: 1

kennels
type: PreferredTerm
modified: 2014-12-31T15:39:03+01:00
created: 2014-09-18T17:59:11+02:00
status: 1

inns
type: PreferredTerm
modified: 2014-12-04T15:08:53+01:00
created: 2014-09-03T17:27:44+02:00
status: 1

oil presses
type: PreferredTerm
modified: 2014-12-30T14:46:15+01:00
created: 2014-09-03T16:14:46+02:00
status: 1

leprosaria
type: PreferredTerm
modified: 2015-01-02T12:07:12+01:00
created: 2014-09-19T12:35:02+02:00
status: 1

alpine gardens
type: PreferredTerm
modified: 2014-12-31T10:29:05+01:00
created: 2014-09-18T16:00:33+02:00
status: 1

morgues
type: PreferredTerm
modified: 2015-02-24T16:27:09+01:00
created: 2014-09-22T10:49:34+02:00
status: 1

fire stations
type: PreferredTerm
modified: 2014-10-09T11:58:21+02:00
created: 2014-09-05T11:02:50+02:00
status: 1

cloakrooms & locker rooms
type: PreferredTerm
modified: 2015-02-26T12:31:22+01:00
created: 2014-09-17T13:31:26+02:00
status: 1

wine cellars
type: PreferredTerm
modified: 2014-12-31T15:38:03+01:00
created: 2014-09-18T17:58:04+02:00
status: 1

arbors
type: PreferredTerm
modified: 2014-12-30T15:29:03+01:00
created: 2014-09-17T18:03:39+02:00
status: 1

moats
type: PreferredTerm
modified: 2015-01-05T12:52:45+01:00
created: 2014-09-19T17:11:59+02:00
status: 1

workshop
type: PreferredTerm
modified: 2014-12-04T15:07:12+01:00
created: 2014-09-03T17:24:51+02:00
status: 1

urban fringes
type: PreferredTerm
modified: 2014-10-17T15:04:01+02:00
created: 2014-09-25T12:04:40+02:00
status: 1

archeological sites
type: PreferredTerm
modified: 2015-02-25T14:35:24+01:00
created: 2014-09-17T11:48:42+02:00
status: 1

lazarettos
type: PreferredTerm
modified: 2015-01-02T12:04:45+01:00
created: 2014-09-19T12:34:07+02:00
status: 1

conurbations
type: PreferredTerm
modified: 2014-10-17T10:42:48+02:00
created: 2014-09-24T12:10:35+02:00
status: 1

market gardens
type: PreferredTerm
modified: 2014-12-31T10:47:19+01:00
created: 2014-09-18T16:14:05+02:00
status: 1

bell towers (churches)
type: PreferredTerm
modified: 2015-02-25T11:55:45+01:00
created: 2014-09-08T17:56:44+02:00
status: 1

information centers
type: PreferredTerm
modified: 2014-12-19T10:46:21+01:00
created: 2014-09-05T17:34:23+02:00
status: 1

penstocks
type: PreferredTerm
modified: 2014-12-02T12:27:04+01:00
created: 2014-09-23T18:23:31+02:00
status: 1

bridges (builtworks)
type: PreferredTerm
modified: 2014-12-02T13:05:30+01:00
created: 2014-09-23T17:26:53+02:00
status: 1

footbridges
type: PreferredTerm
modified: 2014-12-02T13:06:10+01:00
created: 2014-09-23T18:15:06+02:00
status: 1

lavatories & latrines
type: PreferredTerm
modified: 2014-12-31T16:23:14+01:00
created: 2014-09-19T10:19:07+02:00
status: 1

lighthouses
type: PreferredTerm
modified: 2014-11-28T17:06:09+01:00
created: 2014-09-23T12:31:19+02:00
status: 1

fences
type: PreferredTerm
modified: 2015-02-25T10:29:02+01:00
created: 2014-09-04T17:43:20+02:00
status: 1

milestones
type: PreferredTerm
modified: 2015-02-24T11:23:06+01:00
created: 2014-09-23T16:38:35+02:00
status: 1

open-air theaters
type: PreferredTerm
modified: 2014-10-10T12:07:19+02:00
created: 2014-09-08T10:20:03+02:00
status: 1

firing ranges
type: PreferredTerm
modified: 2015-01-05T12:24:15+01:00
created: 2014-09-19T14:43:58+02:00
status: 1

cave dwellings
type: PreferredTerm
modified: 2014-12-31T11:29:42+01:00
created: 2014-09-18T17:06:10+02:00
status: 1

vegetable gardens & kitchen gardens
type: PreferredTerm
modified: 2014-12-31T10:46:32+01:00
created: 2014-09-18T16:12:28+02:00
status: 1

policestations
type: PreferredTerm
modified: 2015-01-05T11:41:05+01:00
created: 2014-09-19T14:11:15+02:00
status: 1

lecture halls
type: PreferredTerm
modified: 2014-12-08T11:31:59+01:00
created: 2014-09-22T17:52:39+02:00
status: 1

ravelins
type: PreferredTerm
modified: 2015-01-05T13:07:03+01:00
created: 2014-09-19T17:29:51+02:00
status: 1

launch complexes
type: PreferredTerm
modified: 2014-10-16T14:09:05+02:00
created: 2014-09-23T12:24:32+02:00
status: 1

marker
type: PreferredTerm
modified: 2015-02-24T11:23:56+01:00
created: 2014-09-23T16:34:23+02:00
status: 1

gables (architectural elements)
type: PreferredTerm
modified: 2015-02-25T16:27:37+01:00
created: 2014-09-04T17:53:17+02:00
status: 1

flower gardens
type: PreferredTerm
modified: 2014-12-31T10:44:43+01:00
created: 2014-09-18T16:10:56+02:00
status: 1

bus stations
type: PreferredTerm
modified: 2014-11-28T17:02:22+01:00
created: 2014-09-23T12:20:41+02:00
status: 1

atriums
type: PreferredTerm
modified: 2015-02-25T11:49:41+01:00
created: 2014-09-08T17:50:19+02:00
status: 1

belvederes
type: PreferredTerm
modified: 2015-02-25T11:53:49+01:00
created: 2014-09-08T17:55:05+02:00
status: 1

retaining walls
type: PreferredTerm
modified: 2015-02-25T16:23:28+01:00
created: 2014-09-04T17:51:14+02:00
status: 1

herb gardens
type: PreferredTerm
modified: 2014-10-14T11:58:26+02:00
created: 2014-09-18T16:09:22+02:00
status: 1

runways
type: PreferredTerm
modified: 2014-10-16T15:26:27+02:00
created: 2014-09-23T17:25:21+02:00
status: 1

guardhouses
type: PreferredTerm
modified: 2015-01-05T11:45:13+01:00
created: 2014-09-19T14:01:31+02:00
status: 1

streetcar stations
type: PreferredTerm
modified: 2014-10-16T14:06:57+02:00
created: 2014-09-23T13:28:19+02:00
status: 1

mills
type: PreferredTerm
modified: 2014-12-17T16:57:16+01:00
created: 2014-09-23T10:25:37+02:00
status: 1

bathhouses
type: PreferredTerm
modified: 2014-12-12T11:09:32+01:00
created: 2014-09-05T14:14:41+02:00
status: 1

roofs or roof components
type: PreferredTerm
modified: 2015-02-24T17:05:42+01:00
created: 2014-09-04T15:46:44+02:00
status: 1

rectories
type: PreferredTerm
modified: 2014-12-31T12:57:40+01:00
created: 2014-09-18T17:41:26+02:00
status: 1

parking lots
type: PreferredTerm
modified: 2015-02-26T12:13:34+01:00
created: 2014-09-17T13:24:19+02:00
status: 1

city walls
type: PreferredTerm
modified: 2015-01-05T12:10:11+01:00
created: 2014-09-19T16:01:33+02:00
status: 1

dormers
type: PreferredTerm
modified: 2015-02-25T12:04:48+01:00
created: 2014-09-08T18:01:16+02:00
status: 1

moving walkways
type: PreferredTerm
modified: 2015-02-25T13:55:48+01:00
created: 2014-09-17T10:37:31+02:00
status: 1

subway stations
type: PreferredTerm
modified: 2014-11-28T16:59:09+01:00
created: 2014-09-23T13:26:22+02:00
status: 1

storefronts
type: PreferredTerm
modified: 2015-02-25T10:09:16+01:00
created: 2014-09-05T10:05:52+02:00
status: 1

fords
type: PreferredTerm
modified: 2014-10-16T14:50:21+02:00
created: 2014-09-23T17:08:02+02:00
status: 1

powder magazines
type: PreferredTerm
modified: 2015-01-05T11:49:21+01:00
created: 2014-09-19T14:06:09+02:00
status: 1

recreation centers
type: PreferredTerm
modified: 2014-12-12T14:44:55+01:00
created: 2014-09-05T16:58:27+02:00
status: 1

silos
type: PreferredTerm
modified: 2015-02-26T12:08:17+01:00
created: 2014-09-17T13:21:52+02:00
status: 1

hunting lodges
type: PreferredTerm
modified: 2014-12-31T12:59:34+01:00
created: 2014-09-18T17:42:57+02:00
status: 1

chimney stacks
type: PreferredTerm
modified: 2015-02-24T17:09:58+01:00
created: 2014-09-04T16:02:07+02:00
status: 1

magazines
type: PreferredTerm
modified: 2015-01-05T11:47:17+01:00
created: 2014-09-19T14:04:52+02:00
status: 1

jetties
type: PreferredTerm
modified: 2014-12-02T12:21:53+01:00
created: 2014-09-23T17:10:19+02:00
status: 1

outworks
type: PreferredTerm
modified: 2014-09-19T17:29:58+02:00
created: 2014-09-19T17:27:41+02:00
status: 1

funicular railways
type: PreferredTerm
modified: 2014-12-02T14:53:57+01:00
created: 2014-09-23T18:06:27+02:00
status: 1

spires
type: PreferredTerm
modified: 2015-02-25T12:00:44+01:00
created: 2014-09-08T17:58:27+02:00
status: 1

partitions (interior walls)
type: PreferredTerm
modified: 2015-02-25T10:28:01+01:00
created: 2014-09-04T17:39:44+02:00
status: 1

coastal fortifications & field fortifications
type: PreferredTerm
modified: 2015-01-05T12:13:19+01:00
created: 2014-09-19T16:07:53+02:00
status: 1

stairs
type: PreferredTerm
modified: 2015-02-25T12:48:41+01:00
created: 2014-09-17T09:54:24+02:00
status: 1

elevations
type: PreferredTerm
modified: 2015-02-25T13:59:46+01:00
created: 2014-09-17T11:26:12+02:00
status: 1

windmills
type: PreferredTerm
modified: 2014-12-02T12:09:19+01:00
created: 2014-09-23T17:04:34+02:00
status: 1

city gates
type: PreferredTerm
modified: 2014-12-12T10:31:22+01:00
created: 2014-09-29T12:17:39+02:00
status: 1

walls - railings - fences
type: PreferredTerm
modified: 2015-02-25T10:27:09+01:00
created: 2014-09-04T17:36:11+02:00
status: 1

outdoor sanctuaries
type: PreferredTerm
modified: 2014-10-15T13:34:48+02:00
created: 2014-09-22T12:28:43+02:00
status: 1

lanterns (roof appendages)
type: PreferredTerm
modified: 2015-02-25T12:03:13+01:00
created: 2014-09-08T17:59:46+02:00
status: 1

allotment gardens
type: PreferredTerm
modified: 2014-12-31T10:50:41+01:00
created: 2014-09-18T16:15:21+02:00
status: 1

oppida
type: PreferredTerm
modified: 2015-01-05T12:14:48+01:00
created: 2014-09-19T16:09:35+02:00
status: 1

viewpoint indicator
type: PreferredTerm
modified: 2014-10-09T13:07:00+02:00
created: 2014-09-05T14:36:56+02:00
status: 1

railroad stations
type: PreferredTerm
modified: 2014-11-28T16:55:48+01:00
created: 2014-09-23T12:19:10+02:00
status: 1

chutes
type: PreferredTerm
modified: 2014-10-22T12:58:46+02:00
created: 2014-09-17T10:41:58+02:00
status: 1

groins
type: PreferredTerm
modified: 2014-10-16T14:49:52+02:00
created: 2014-09-23T17:06:36+02:00
status: 1

junior high schools
type: PreferredTerm
modified: 2014-12-01T16:25:13+01:00
created: 2014-09-22T17:27:14+02:00
status: 1

submarine bases
type: PreferredTerm
modified: 2014-10-14T15:58:40+02:00
created: 2014-09-19T15:59:25+02:00
status: 1

launching ramps
type: PreferredTerm
modified: 2014-10-21T14:04:05+02:00
created: 2014-09-19T16:24:41+02:00
status: 1

elevators
type: PreferredTerm
modified: 2015-02-25T12:40:42+01:00
created: 2014-09-17T09:47:41+02:00
status: 1

water treatment plants
type: PreferredTerm
modified: 2014-11-28T16:32:13+01:00
created: 2014-09-23T12:14:43+02:00
status: 1

broadcasting stations
type: PreferredTerm
modified: 2014-10-16T15:34:30+02:00
created: 2014-09-23T17:57:43+02:00
status: 1

libraries (buildings)
type: PreferredTerm
modified: 2014-12-12T14:32:30+01:00
created: 2014-09-05T16:51:15+02:00
status: 1

windows
type: PreferredTerm
modified: 2015-02-24T16:47:04+01:00
created: 2014-09-04T14:51:22+02:00
status: 1

circuses
type: PreferredTerm
modified: 2014-12-19T11:14:16+01:00
created: 2014-09-08T14:55:11+02:00
status: 1

youth hostels
type: PreferredTerm
modified: 2014-12-12T14:29:40+01:00
created: 2014-09-05T16:48:35+02:00
status: 1

satellite towns
type: PreferredTerm
modified: 2014-10-17T14:26:29+02:00
created: 2014-09-24T12:38:03+02:00
status: 1

balconies
type: PreferredTerm
modified: 2015-02-25T10:14:33+01:00
created: 2014-09-17T11:28:25+02:00
status: 1

public baths
type: PreferredTerm
modified: 2014-12-18T15:10:53+01:00
created: 2014-09-08T12:12:52+02:00
status: 1

battlefields
type: PreferredTerm
modified: 2015-01-05T12:04:08+01:00
created: 2014-09-19T14:32:57+02:00
status: 1

high schools
type: PreferredTerm
modified: 2014-12-01T16:27:30+01:00
created: 2014-09-22T17:28:32+02:00
status: 1

corridors
type: PreferredTerm
modified: 2015-02-25T12:42:14+01:00
created: 2014-09-17T09:49:53+02:00
status: 1

watchtowers
type: PreferredTerm
modified: 2015-01-05T13:33:16+01:00
created: 2014-09-19T16:21:11+02:00
status: 1

Cable railroads
type: PreferredTerm
modified: 2014-10-16T15:35:30+02:00
created: 2014-09-24T10:59:44+02:00
status: 1

fortification elements
type: PreferredTerm
modified: 2015-01-05T13:31:56+01:00
created: 2014-09-19T16:17:21+02:00
status: 1

opera houses
type: PreferredTerm
modified: 2014-12-19T11:15:09+01:00
created: 2014-09-08T14:58:03+02:00
status: 1

openings (architectural elements)
type: PreferredTerm
modified: 2015-02-24T16:40:39+01:00
created: 2014-09-04T14:40:40+02:00
status: 1

parochial schools
type: PreferredTerm
modified: 2014-12-01T16:31:04+01:00
created: 2014-09-22T17:30:38+02:00
status: 1

almshouses
type: PreferredTerm
modified: 2015-01-02T11:23:11+01:00
created: 2014-09-19T11:57:18+02:00
status: 1

quays
type: PreferredTerm
modified: 2014-12-02T14:44:08+01:00
created: 2014-09-23T17:54:14+02:00
status: 1

splayed arches & voussoirs
type: PreferredTerm
modified: 2015-02-24T17:34:58+01:00
created: 2014-09-04T16:57:21+02:00
status: 1

saving banks
type: PreferredTerm
modified: 2015-01-02T10:52:41+01:00
created: 2014-09-08T15:58:24+02:00
status: 1

concert halls
type: PreferredTerm
modified: 2014-12-19T11:16:17+01:00
created: 2014-09-08T14:59:21+02:00
status: 1

apsidioles
type: PreferredTerm
modified: 2015-02-25T11:19:39+01:00
created: 2014-09-08T17:41:24+02:00
status: 1

cultural centers (buildings)
type: PreferredTerm
modified: 2014-10-09T13:22:06+02:00
created: 2014-09-05T16:54:45+02:00
status: 1

oriel windows
type: PreferredTerm
modified: 2015-02-25T14:02:49+01:00
created: 2014-09-17T11:33:20+02:00
status: 1

vocational schools
type: PreferredTerm
modified: 2014-12-01T15:56:24+01:00
created: 2014-09-22T16:44:33+02:00
status: 1

theaters
type: PreferredTerm
modified: 2014-12-19T11:17:04+01:00
created: 2014-09-08T15:01:25+02:00
status: 1

apses
type: PreferredTerm
modified: 2015-02-25T11:14:30+01:00
created: 2014-09-08T17:39:51+02:00
status: 1

gambling casinos
type: PreferredTerm
modified: 2014-12-12T14:33:58+01:00
created: 2014-09-05T16:52:41+02:00
status: 1

landings (marine structures)
type: PreferredTerm
modified: 2014-12-02T14:50:02+01:00
created: 2014-09-23T17:55:43+02:00
status: 1

laboratories
type: PreferredTerm
modified: 2014-12-19T10:19:45+01:00
created: 2014-09-08T12:31:14+02:00
status: 1

basements
type: PreferredTerm
modified: 2015-02-25T14:39:43+01:00
created: 2014-09-17T11:51:50+02:00
status: 1

trolleybus systems
type: PreferredTerm
modified: 2014-10-17T10:18:12+02:00
created: 2014-09-24T11:19:48+02:00
status: 1

sidewalks
type: PreferredTerm
modified: 2015-01-08T10:10:44+01:00
created: 2014-09-25T11:31:38+02:00
status: 1

pavilions
type: PreferredTerm
modified: 2015-02-25T16:33:30+01:00
created: 2014-09-17T12:52:51+02:00
status: 1

sections of watercourse
type: PreferredTerm
modified: 2014-12-01T13:52:09+01:00
created: 2014-09-23T15:17:14+02:00
status: 1

railroad signal towers
type: PreferredTerm
modified: 2014-12-02T14:47:37+01:00
created: 2014-09-23T17:53:05+02:00
status: 1

campuses
type: PreferredTerm
modified: 2014-12-31T13:56:08+01:00
created: 2014-09-18T17:49:43+02:00
status: 1

courtyards
type: PreferredTerm
modified: 2015-02-25T11:45:35+01:00
created: 2014-09-08T17:47:57+02:00
status: 1

kindrgartens & nursery schools
type: PreferredTerm
modified: 2014-12-01T15:38:29+01:00
created: 2014-09-22T16:40:42+02:00
status: 1

research institutes (buildings)
type: PreferredTerm
modified: 2014-12-19T10:17:46+01:00
created: 2014-09-05T17:16:01+02:00
status: 1

skateboarding parks
type: PreferredTerm
modified: 2014-10-09T13:13:15+02:00
created: 2014-09-08T10:32:51+02:00
status: 1

stories
type: PreferredTerm
modified: 2014-10-16T11:25:17+02:00
created: 2014-09-17T11:50:01+02:00
status: 1

Paths
type: PreferredTerm
modified: 2015-01-08T10:07:39+01:00
created: 2014-09-25T11:25:39+02:00
status: 1

cooperative stores
type: PreferredTerm
modified: 2014-12-05T10:18:10+01:00
created: 2014-09-04T12:17:31+02:00
status: 1

teachers colleges
type: PreferredTerm
modified: 2014-12-01T17:17:53+01:00
created: 2014-09-22T17:46:50+02:00
status: 1

waterways
type: PreferredTerm
modified: 2014-12-01T13:50:44+01:00
created: 2014-09-23T15:14:11+02:00
status: 1

dry docks
type: PreferredTerm
modified: 2014-12-01T14:07:35+01:00
created: 2014-09-23T16:19:39+02:00
status: 1

control towers
type: PreferredTerm
modified: 2014-10-16T15:44:57+02:00
created: 2014-09-23T17:46:58+02:00
status: 1

squinches & trompes
type: PreferredTerm
modified: 2015-02-24T17:26:10+01:00
created: 2014-09-04T16:47:16+02:00
status: 1

highways
type: PreferredTerm
modified: 2015-01-07T12:25:08+01:00
created: 2014-09-24T15:37:47+02:00
status: 1

wet docks
type: PreferredTerm
modified: 2014-12-01T14:06:25+01:00
created: 2014-09-23T16:16:06+02:00
status: 1

elementary schools
type: PreferredTerm
modified: 2014-12-01T15:50:17+01:00
created: 2014-09-22T16:41:55+02:00
status: 1

primary roads
type: PreferredTerm
modified: 2015-01-07T13:25:27+01:00
created: 2014-09-25T11:22:04+02:00
status: 1

studios (work spaces)
type: PreferredTerm
modified: 2014-12-12T14:28:45+01:00
created: 2014-09-05T16:41:23+02:00
status: 1

reformatories
type: PreferredTerm
modified: 2015-01-05T10:57:23+01:00
created: 2014-09-08T17:31:15+02:00
status: 1

railroads
type: PreferredTerm
modified: 2014-12-01T13:47:49+01:00
created: 2014-09-23T15:11:28+02:00
status: 1

streets
type: PreferredTerm
modified: 2015-01-08T10:00:45+01:00
created: 2014-09-25T11:24:01+02:00
status: 1

funeral homes
type: PreferredTerm
modified: 2014-10-15T13:01:54+02:00
created: 2014-09-22T10:39:05+02:00
status: 1

movable bridges
type: PreferredTerm
modified: 2014-12-02T13:08:17+01:00
created: 2014-09-23T18:19:41+02:00
status: 1

docks
type: PreferredTerm
modified: 2014-12-01T14:05:20+01:00
created: 2014-09-23T16:02:39+02:00
status: 1

spas (health resorts)
type: PreferredTerm
modified: 2014-12-19T10:11:20+01:00
created: 2014-09-08T12:18:09+02:00
status: 1

junior highschools & highschools
type: PreferredTerm
modified: 2014-12-01T16:16:19+01:00
created: 2014-09-22T17:24:46+02:00
status: 1

archives (buildings)
type: PreferredTerm
modified: 2014-12-12T14:40:02+01:00
created: 2014-09-05T16:57:18+02:00
status: 1

concentration camps
type: PreferredTerm
modified: 2015-01-05T10:55:46+01:00
created: 2014-09-08T17:29:29+02:00
status: 1

foundations and floors
type: PreferredTerm
modified: 2015-02-25T10:22:43+01:00
created: 2014-09-04T17:07:54+02:00
status: 1

universities
type: PreferredTerm
modified: 2014-12-01T17:22:10+01:00
created: 2014-09-22T17:49:13+02:00
status: 1

rooms
type: PreferredTerm
modified: 2015-02-25T16:40:10+01:00
created: 2014-09-17T13:05:58+02:00
status: 1

supermarkets
type: PreferredTerm
modified: 2014-12-05T10:23:02+01:00
created: 2014-09-04T12:23:29+02:00
status: 1

telegraph stations
type: PreferredTerm
modified: 2014-10-23T13:08:43+02:00
created: 2014-09-23T18:11:21+02:00
status: 1

air and space transportation buildings
type: PreferredTerm
modified: 2014-10-23T11:58:55+02:00
created: 2014-09-23T12:04:26+02:00
status: 1

markets (structures)
type: PreferredTerm
modified: 2014-12-05T10:24:55+01:00
created: 2014-09-04T11:10:12+02:00
status: 1

streetcar systems
type: PreferredTerm
modified: 2014-10-17T10:13:52+02:00
created: 2014-09-24T11:12:16+02:00
status: 1

nymphaea
type: PreferredTerm
modified: 2014-12-30T16:05:57+01:00
created: 2014-09-17T17:51:06+02:00
status: 1

forests (cultural landscapes)
type: PreferredTerm
modified: 2014-12-30T16:24:26+01:00
created: 2014-09-18T10:46:34+02:00
status: 1

cafés (restaurants)
type: PreferredTerm
modified: 2014-12-04T16:00:12+01:00
created: 2014-09-03T17:51:21+02:00
status: 1

masonic buildings
type: PreferredTerm
modified: 2014-12-12T11:04:07+01:00
created: 2014-09-05T14:02:50+02:00
status: 1

resorts
type: PreferredTerm
modified: 2015-01-07T11:38:22+01:00
created: 2014-09-24T12:21:18+02:00
status: 1

customhouses
type: PreferredTerm
modified: 2015-01-02T11:04:43+01:00
created: 2014-09-08T16:09:06+02:00
status: 1

stadiums
type: PreferredTerm
modified: 2014-12-18T15:08:32+01:00
created: 2014-09-08T11:46:45+02:00
status: 1

downtowns
type: PreferredTerm
modified: 2015-01-08T10:37:56+01:00
created: 2014-09-25T13:24:06+02:00
status: 1

embassies
type: PreferredTerm
modified: 2014-10-09T11:54:39+02:00
created: 2014-09-05T10:55:32+02:00
status: 1

rotundas
type: PreferredTerm
modified: 2014-12-30T15:39:08+01:00
created: 2014-09-18T09:42:37+02:00
status: 1

brothels
type: PreferredTerm
modified: 2014-10-06T15:25:15+02:00
created: 2014-09-04T11:08:34+02:00
status: 1

quarries
type: PreferredTerm
modified: 2015-01-15T16:39:54+01:00
created: 2014-09-23T10:48:48+02:00
status: 1

menageries
type: PreferredTerm
modified: 2014-12-30T16:02:00+01:00
created: 2014-09-17T17:46:30+02:00
status: 1

railroads (infrastructure)
type: PreferredTerm
modified: 2014-10-17T10:10:26+02:00
created: 2014-09-24T11:04:21+02:00
status: 1

menhirs
type: PreferredTerm
modified: 2015-02-24T16:20:16+01:00
created: 2014-09-22T11:27:37+02:00
status: 1

stables (animal housing)
type: PreferredTerm
modified: 2014-12-30T14:25:48+01:00
created: 2014-09-03T15:45:31+02:00
status: 1

health resorts
type: PreferredTerm
modified: 2014-10-17T10:45:04+02:00
created: 2014-09-24T12:18:32+02:00
status: 1

day camps
type: PreferredTerm
modified: 2014-10-17T15:50:02+02:00
created: 2014-09-08T10:42:39+02:00
status: 1

reflecting pools
type: PreferredTerm
modified: 2014-12-31T10:21:54+01:00
created: 2014-09-18T15:28:45+02:00
status: 1

octrois
type: PreferredTerm
modified: 2015-01-02T11:03:28+01:00
created: 2014-09-08T16:07:38+02:00
status: 1

forums (open spaces)
type: PreferredTerm
modified: 2014-10-17T15:00:26+02:00
created: 2014-09-25T13:27:29+02:00
status: 1

potteries
type: PreferredTerm
modified: 2014-10-06T15:28:44+02:00
created: 2014-09-04T11:18:00+02:00
status: 1

amphitheaters (builts works)
type: PreferredTerm
modified: 2014-12-19T11:03:28+01:00
created: 2014-09-08T14:34:04+02:00
status: 1

bus depots
type: PreferredTerm
modified: 2014-11-28T16:10:53+01:00
created: 2014-09-23T11:58:11+02:00
status: 1

sheepfolds
type: PreferredTerm
modified: 2014-12-30T14:16:51+01:00
created: 2014-09-03T15:48:22+02:00
status: 1

Parish houses
type: PreferredTerm
modified: 2014-11-28T13:01:47+01:00
created: 2014-09-22T14:58:49+02:00
status: 1

summer camps
type: PreferredTerm
modified: 2014-12-12T14:49:39+01:00
created: 2014-09-08T10:45:13+02:00
status: 1

winter resorts
type: PreferredTerm
modified: 2015-01-07T11:36:58+01:00
created: 2014-09-24T12:30:29+02:00
status: 1

water stairs
type: PreferredTerm
modified: 2014-09-30T15:16:02+02:00
created: 2014-09-18T15:23:13+02:00
status: 1

marinas
type: PreferredTerm
modified: 2015-01-08T10:41:57+01:00
created: 2014-09-25T13:28:43+02:00
status: 1

pawnshops
type: PreferredTerm
modified: 2015-01-02T11:00:51+01:00
created: 2014-09-08T16:05:21+02:00
status: 1

swimming pools
type: PreferredTerm
modified: 2014-12-18T15:06:25+01:00
created: 2014-09-08T11:41:19+02:00
status: 1

market halls
type: PreferredTerm
modified: 2014-12-05T10:26:23+01:00
created: 2014-09-04T11:15:12+02:00
status: 1

administrative centers
type: PreferredTerm
modified: 2014-10-17T15:35:51+02:00
created: 2014-09-05T10:45:32+02:00
status: 1

horse barns
type: PreferredTerm
modified: 2014-12-30T14:18:55+01:00
created: 2014-09-03T15:58:30+02:00
status: 1

streetcars depots
type: PreferredTerm
modified: 2014-11-28T16:10:02+01:00
created: 2014-09-23T12:03:01+02:00
status: 1

roof frames
type: PreferredTerm
modified: 2015-02-24T17:02:24+01:00
created: 2014-09-04T15:35:35+02:00
status: 1

seaside resorts
type: PreferredTerm
modified: 2015-01-07T11:33:57+01:00
created: 2014-09-24T12:28:46+02:00
status: 1

tea rooms
type: PreferredTerm
modified: 2014-12-04T16:00:48+01:00
created: 2014-09-03T17:54:39+02:00
status: 1

performing arts buildings
type: PreferredTerm
modified: 2014-12-19T10:58:22+01:00
created: 2014-09-08T10:17:53+02:00
status: 1

benches
type: PreferredTerm
modified: 2015-02-24T11:39:36+01:00
created: 2014-09-05T10:24:40+02:00
status: 1

boskets
type: PreferredTerm
modified: 2014-12-30T16:20:49+01:00
created: 2014-09-18T10:43:21+02:00
status: 1

fencing rooms
type: PreferredTerm
modified: 2014-10-10T10:15:35+02:00
created: 2014-09-08T11:45:55+02:00
status: 1

slabs
type: PreferredTerm
modified: 2014-10-17T14:35:20+02:00
created: 2014-09-24T14:58:25+02:00
status: 1

rock gardens
type: PreferredTerm
modified: 2014-12-30T16:52:59+01:00
created: 2014-09-18T12:34:01+02:00
status: 1

auditoriums
type: PreferredTerm
modified: 2014-10-10T12:00:55+02:00
created: 2014-09-08T14:46:09+02:00
status: 1

posthouses
type: PreferredTerm
modified: 2014-12-05T10:48:39+01:00
created: 2014-09-04T11:28:52+02:00
status: 1

stock exchanges
type: PreferredTerm
modified: 2014-12-04T15:46:03+01:00
created: 2014-10-06T13:00:35+02:00
status: 1

clock towers
type: PreferredTerm
modified: 2015-02-24T11:22:03+01:00
created: 2014-09-05T10:27:11+02:00
status: 1

megalith alignments
type: PreferredTerm
modified: 2015-02-24T16:12:10+01:00
created: 2014-09-22T11:22:18+02:00
status: 1

sewers (drainage structures)
type: PreferredTerm
modified: 2014-10-17T10:16:06+02:00
created: 2014-09-24T11:18:01+02:00
status: 1

covered walkways
type: PreferredTerm
modified: 2014-12-30T15:02:11+01:00
created: 2014-09-17T16:12:00+02:00
status: 1

halls (interior spaces)
type: PreferredTerm
modified: 2014-12-31T16:27:17+01:00
created: 2014-09-19T10:22:19+02:00
status: 1

transportation infrastructure
type: PreferredTerm
modified: 2014-10-17T10:11:14+02:00
created: 2014-09-24T10:46:49+02:00
status: 1

shelters
type: PreferredTerm
modified: 2014-12-05T10:38:16+01:00
created: 2014-09-04T11:26:25+02:00
status: 1

telephone exchanges
type: PreferredTerm
modified: 2014-11-28T16:08:00+01:00
created: 2014-09-23T11:15:06+02:00
status: 1

washhouses
type: PreferredTerm
modified: 2014-12-05T11:51:11+01:00
created: 2014-09-05T10:29:39+02:00
status: 1

health facilities
type: PreferredTerm
modified: 2015-01-02T11:57:19+01:00
created: 2014-09-19T12:20:36+02:00
status: 1

agriculture schools
type: PreferredTerm
modified: 2014-12-01T16:00:38+01:00
created: 2014-09-22T17:03:35+02:00
status: 1

topiary
type: PreferredTerm
modified: 2014-12-30T16:31:06+01:00
created: 2014-09-18T10:59:10+02:00
status: 1

mints (buildings)
type: PreferredTerm
modified: 2015-01-02T10:57:35+01:00
created: 2014-09-08T16:03:06+02:00
status: 1

bakeries
type: PreferredTerm
modified: 2014-12-04T15:43:04+01:00
created: 2014-09-03T17:37:50+02:00
status: 1

threshing floor
type: PreferredTerm
modified: 2014-12-30T14:12:15+01:00
created: 2014-09-29T11:36:35+02:00
status: 1

spas
type: PreferredTerm
modified: 2014-10-17T14:20:42+02:00
created: 2014-09-24T12:23:52+02:00
status: 1

comfort stations
type: PreferredTerm
modified: 2014-12-05T12:05:53+01:00
created: 2014-09-05T10:31:30+02:00
status: 1

telephone systems
type: PreferredTerm
modified: 2014-10-17T10:02:31+02:00
created: 2014-09-24T10:44:03+02:00
status: 1

dining rooms
type: PreferredTerm
modified: 2014-12-31T16:28:49+01:00
created: 2014-09-19T10:23:28+02:00
status: 1

motion picture theaters
type: PreferredTerm
modified: 2014-12-19T11:08:31+01:00
created: 2014-09-08T14:51:38+02:00
status: 1

allées
type: PreferredTerm
modified: 2014-12-30T15:11:02+01:00
created: 2014-09-17T16:08:02+02:00
status: 1

boathouses
type: PreferredTerm
modified: 2014-12-31T15:58:20+01:00
created: 2014-09-18T18:11:14+02:00
status: 1

velodromes
type: PreferredTerm
modified: 2014-12-18T15:09:37+01:00
created: 2014-09-08T11:47:42+02:00
status: 1

retirement homes
type: PreferredTerm
modified: 2015-01-02T11:49:27+01:00
created: 2014-09-19T11:52:41+02:00
status: 1

recording studios
type: PreferredTerm
modified: 2014-10-10T11:47:42+02:00
created: 2014-09-08T14:25:34+02:00
status: 1

vaults (strong rooms)
type: PreferredTerm
modified: 2014-10-06T15:52:37+02:00
created: 2014-09-05T10:09:45+02:00
status: 1

maze gardens
type: PreferredTerm
modified: 2014-12-30T16:28:01+01:00
created: 2014-09-18T10:52:52+02:00
status: 1

bathrooms
type: PreferredTerm
modified: 2014-12-31T16:31:04+01:00
created: 2014-09-19T10:24:32+02:00
status: 1

ramps
type: PreferredTerm
modified: 2015-02-25T13:51:34+01:00
created: 2014-09-17T10:30:19+02:00
status: 1

orphanages & terminal care facilities
type: PreferredTerm
modified: 2015-01-02T11:46:32+01:00
created: 2014-09-19T11:51:30+02:00
status: 1

shacks
type: PreferredTerm
modified: 2014-12-31T12:00:41+01:00
created: 2014-09-18T17:12:10+02:00
status: 1

cenotaphs
type: PreferredTerm
modified: 2015-02-24T14:37:18+01:00
created: 2014-09-22T11:14:36+02:00
status: 1

Water supply systems
type: PreferredTerm
modified: 2014-10-17T10:17:00+02:00
created: 2014-09-24T11:15:52+02:00
status: 1

commodity exchanges
type: PreferredTerm
modified: 2014-10-06T13:02:34+02:00
created: 2014-09-03T17:59:35+02:00
status: 1

nurseries (horticulture)
type: PreferredTerm
modified: 2014-12-31T10:53:04+01:00
created: 2014-09-18T16:17:26+02:00
status: 1

icehouses
type: PreferredTerm
modified: 2014-12-30T15:58:21+01:00
created: 2014-09-17T17:11:57+02:00
status: 1

sepulchral monuments
type: PreferredTerm
modified: 2015-02-24T14:30:31+01:00
created: 2014-09-22T10:47:46+02:00
status: 1

tract houses
type: PreferredTerm
modified: 2014-10-17T15:06:15+02:00
created: 2014-09-25T14:57:25+02:00
status: 1

fishponds
type: PreferredTerm
modified: 2014-12-30T14:55:24+01:00
created: 2014-09-03T15:42:22+02:00
status: 1

roads
type: PreferredTerm
modified: 2014-10-17T14:28:43+02:00
created: 2014-09-24T12:56:26+02:00
status: 1

tack rooms
type: PreferredTerm
modified: 2014-12-31T16:02:05+01:00
created: 2014-09-18T18:14:15+02:00
status: 1

manor houses ou manors
type: PreferredTerm
modified: 2014-12-31T12:40:04+01:00
created: 2014-09-18T17:36:18+02:00
status: 1

salons & reception rooms
type: PreferredTerm
modified: 2014-12-31T16:33:56+01:00
created: 2014-09-19T10:26:35+02:00
status: 1

orchards
type: PreferredTerm
modified: 2014-12-31T10:54:38+01:00
created: 2014-09-18T16:18:41+02:00
status: 1

gatehouses
type: PreferredTerm
modified: 2015-02-25T13:46:24+01:00
created: 2014-09-17T11:01:44+02:00
status: 1

apiaries
type: PreferredTerm
modified: 2014-12-30T14:52:39+01:00
created: 2014-09-03T15:38:12+02:00
status: 1

bridle paths
type: PreferredTerm
modified: 2015-01-07T12:24:18+01:00
created: 2014-09-24T15:36:01+02:00
status: 1

penal colonies
type: PreferredTerm
modified: 2015-01-05T10:50:45+01:00
created: 2014-09-08T17:27:17+02:00
status: 1

storehouses
type: PreferredTerm
modified: 2014-12-31T16:00:16+01:00
created: 2014-09-18T18:12:27+02:00
status: 1

porches
type: PreferredTerm
modified: 2015-02-25T10:16:33+01:00
created: 2014-09-17T10:28:12+02:00
status: 1

carriage passages
type: PreferredTerm
modified: 2015-02-25T13:42:15+01:00
created: 2014-09-17T10:26:34+02:00
status: 1

agricultural complexes
type: PreferredTerm
modified: 2014-12-30T14:08:39+01:00
created: 2014-09-02T17:12:50+02:00
status: 1

burial caves
type: PreferredTerm
modified: 2015-02-24T16:01:07+01:00
created: 2014-09-22T10:44:49+02:00
status: 1

drying sheds
type: PreferredTerm
modified: 2015-02-26T11:47:34+01:00
created: 2014-09-17T13:20:19+02:00
status: 1

aviaries
type: PreferredTerm
modified: 2014-12-31T16:04:44+01:00
created: 2014-09-18T18:15:13+02:00
status: 1

follies
type: PreferredTerm
modified: 2014-12-30T15:56:59+01:00
created: 2014-09-17T17:10:26+02:00
status: 1

palaces
type: PreferredTerm
modified: 2014-12-31T12:54:59+01:00
created: 2014-09-18T17:37:28+02:00
status: 1

baptismal fonts
type: PreferredTerm
modified: 2014-10-15T14:04:36+02:00
created: 2014-09-22T15:34:19+02:00
status: 1

olympic villages
type: PreferredTerm
modified: 2014-10-17T15:02:45+02:00
created: 2014-09-25T13:37:36+02:00
status: 1

sheep farms
type: PreferredTerm
modified: 2014-12-30T13:59:02+01:00
created: 2014-09-03T12:02:32+02:00
status: 1

perrons
type: PreferredTerm
modified: 2015-02-25T12:59:00+01:00
created: 2014-09-17T11:00:22+02:00
status: 1

bedrooms
type: PreferredTerm
modified: 2014-12-31T16:15:57+01:00
created: 2014-09-19T10:12:52+02:00
status: 1

greenhouses
type: PreferredTerm
modified: 2014-12-30T16:12:27+01:00
created: 2014-09-17T17:58:07+02:00
status: 1

town halls
type: PreferredTerm
modified: 2014-12-12T10:17:40+01:00
created: 2014-09-05T11:30:20+02:00
status: 1

cowsheds
type: PreferredTerm
modified: 2014-12-30T14:19:57+01:00
created: 2014-09-03T16:02:45+02:00
status: 1

cattle barns
type: SimpleNonPreferredTerm
modified: 2014-12-30T14:19:57+01:00
created: 2014-09-03T16:02:45+02:00
status: 1

rabbit warrens
type: PreferredTerm
modified: 2014-10-14T12:02:53+02:00
created: 2014-09-18T16:27:13+02:00
status: 1

shopping centers
type: PreferredTerm
modified: 2014-12-05T11:24:58+01:00
created: 2014-09-04T12:30:48+02:00
status: 1

hop barns
type: PreferredTerm
modified: 2015-02-26T12:00:22+01:00
created: 2014-09-17T15:53:38+02:00
status: 1

warehouses
type: PreferredTerm
modified: 2014-10-17T15:13:52+02:00
created: 2014-09-03T18:15:32+02:00
status: 1

cabinets (rooms)
type: PreferredTerm
modified: 2014-12-31T16:13:57+01:00
created: 2014-09-19T10:11:25+02:00
status: 1

pigsties
type: PreferredTerm
modified: 2014-12-30T14:22:04+01:00
created: 2014-09-03T16:05:39+02:00
status: 1

preserves
type: PreferredTerm
modified: 2014-10-14T12:03:41+02:00
created: 2014-09-18T16:31:23+02:00
status: 1

orphanages
type: PreferredTerm
modified: 2015-01-02T11:28:54+01:00
created: 2014-09-19T12:17:21+02:00
status: 1

grade crossings
type: PreferredTerm
modified: 2014-12-02T13:03:57+01:00
created: 2014-09-23T17:17:32+02:00
status: 1

hangars
type: PreferredTerm
modified: 2014-11-28T16:15:22+01:00
created: 2014-09-23T12:08:37+02:00
status: 1

polders
type: PreferredTerm
modified: 2014-10-06T11:56:42+02:00
created: 2014-09-03T12:25:10+02:00
status: 1

bastions
type: PreferredTerm
modified: 2015-01-05T12:28:04+01:00
created: 2014-09-19T16:30:52+02:00
status: 1

city halls
type: PreferredTerm
modified: 2014-12-12T10:42:30+01:00
created: 2014-09-05T12:07:01+02:00
status: 1

winter gardens
type: PreferredTerm
modified: 2014-12-31T16:21:23+01:00
created: 2014-09-19T10:15:16+02:00
status: 1

pavilions (garden structures)
type: PreferredTerm
modified: 2014-12-30T16:09:25+01:00
created: 2014-09-17T17:54:23+02:00
status: 1

houses
type: PreferredTerm
modified: 2014-12-31T12:36:44+01:00
created: 2014-09-18T17:30:41+02:00
status: 1

escalators
type: PreferredTerm
modified: 2015-02-25T12:57:14+01:00
created: 2014-09-17T10:58:54+02:00
status: 1

sluice gates
type: PreferredTerm
modified: 2014-10-16T15:22:40+02:00
created: 2014-09-23T18:45:10+02:00
status: 1

zoos
type: PreferredTerm
modified: 2014-12-31T11:00:16+01:00
created: 2014-09-18T15:48:48+02:00
status: 1

artificial ruins
type: PreferredTerm
modified: 2014-12-30T15:40:56+01:00
created: 2014-09-18T09:44:08+02:00
status: 1

redans
type: PreferredTerm
modified: 2015-01-05T13:08:39+01:00
created: 2014-09-19T17:32:11+02:00
status: 1

batteries (platforms)
type: PreferredTerm
modified: 2015-01-05T12:30:02+01:00
created: 2014-09-19T16:32:12+02:00
status: 1

waterworks
type: PreferredTerm
modified: 2014-10-23T11:59:47+02:00
created: 2014-09-23T12:11:34+02:00
status: 1

orangeries
type: PreferredTerm
modified: 2014-12-30T16:07:48+01:00
created: 2014-09-17T17:52:28+02:00
status: 1

kitchens
type: PreferredTerm
modified: 2014-12-31T16:17:42+01:00
created: 2014-09-19T10:13:56+02:00
status: 1

pumping stations
type: PreferredTerm
modified: 2014-12-02T12:48:07+01:00
created: 2014-09-23T18:43:58+02:00
status: 1

parks
type: PreferredTerm
modified: 2014-12-31T11:10:01+01:00
created: 2014-09-18T15:57:18+02:00
status: 1

redoubts
type: PreferredTerm
modified: 2015-01-05T13:12:07+01:00
created: 2014-09-19T17:33:27+02:00
status: 1

img1
type: CustomConceptAttribute

img2
type: CustomConceptAttribute

pan-de-bois
type: SimpleNonPreferredTerm
modified: 2015-02-24T16:56:08+01:00
created: 2014-11-25T18:15:45+01:00
status: 1

choeur
type: PreferredTerm
modified: 2015-03-09T11:09:01+01:00
created: 2014-12-03T12:21:26+01:00
status: 1

clôture de choeur
type: PreferredTerm
modified: 2015-03-09T11:11:12+01:00
created: 2015-03-09T11:11:12+01:00
status: 1