Spandau
created: 2020-10-19T13:28:05+02:00
modified: 2020-10-19T13:28:05+02:00
status: 1
type: Concept
broader: T84-626
definition: Spandau est le 5e arrondissement administratif (Bezirk) de Berlin, il est le plus à l'ouest de la ville. Il est situé au confluent de l'Havel et de la Spree.
in scheme: T84