Abrasion
created: 2020-05-27T20:23:48+02:00
modified: 2020-05-27T20:23:48+02:00
status: 1
type: Concept
definition: Endommagement engendrant une perte légère et localisée de matière et modifiant la perception du volume. Termes équivalents : Frottement ; Usure ; Polissage non voulu. A ne pas confondre avec : Erosion ; Corrosion. 1) Constat d'état : Localisation sur la surface. Sur les parties saillantes et sur les premières couches de coulées apparentes. Aspect : zone localisée plus claire et parfois brillante. 2) Origine possible : facteur accidentel/extérieur : configuration du lieu de conservation (problème de mise à distance de l'oeuvre, abrasion éolienne, particules, vent. On distinguera l'abrasion régulière (frottements très courants en surface à cause de passages successifs du public) de celle irrégulière et ne pouvant être contrôlé. 3) Possible évolution dans le temps : altération de surface. Favorise le dépôt et l'encrage de substances exogènes. L'irrégularité de la surface agrandit la surface spécifique, ce qui permet à la poussière de mieux s'ancrer.
notation: Abrasion